{"text_format":"3","workbook":"xlsx","n_sheets":9,"sheets":["Draft Roster","Draft List","Summary","Centre","Left Wing","Right Wing","Defence","Goalies","Data"],"not_rendered":{"macros":1,"external_links":1,"defined_names":45},"read":"whole","date_system":"1900"}

{"sheet":"Draft Roster","index":0,"n_rows":25,"n_cols":45,"rows_kept":25,"merged":[[0,1,0,4],[0,5,0,8],[0,9,0,12],[0,13,0,16],[0,17,0,20],[0,21,0,24],[0,25,0,28],[0,29,0,32],[0,33,0,36],[0,37,0,40],[0,41,0,44],[1,1,1,4],[1,5,1,8],[1,9,1,12],[1,13,1,16],[1,17,1,20],[1,21,1,24],[1,25,1,28],[1,29,1,32],[1,33,1,36],[1,37,1,40],[1,41,1,44],[21,1,21,2],[21,5,21,6],[21,13,21,14],[21,17,21,18],[21,21,21,22],[21,25,21,26],[21,29,21,30],[21,33,21,34],[21,37,21,38],[21,41,21,42],[22,1,22,2],[22,5,22,6],[22,9,22,10],[22,13,22,14],[22,17,22,18],[22,21,22,22],[22,25,22,26],[22,29,22,30],[22,33,22,34],[22,37,22,38],[22,41,22,42]]}
[null,{"$f":"C25","v":"Draft Order = 1"},{"$nulls":3},{"$f":"G25","v":"Draft Order = 2"},{"$nulls":3},{"$f":"K25","v":"Draft Order = 3"},{"$nulls":3},{"$f":"O25","v":"Draft Order = 4"},{"$nulls":3},{"$f":"S25","v":"Draft Order = 5"},{"$nulls":3},{"$f":"W25","v":"Draft Order = 6"},{"$nulls":3},{"$f":"AA25","v":"Draft Order = 7"},{"$nulls":3},{"$f":"AE25","v":"Draft Order = 8"},{"$nulls":3},{"$f":"AI25","v":"Draft Order = 9"},{"$nulls":3},{"$f":"AM25","v":"Draft Order = 10"},{"$nulls":3},{"$f":"AQ25","v":"n/a"}]
[null,{"$f":"Data!A2","v":"Phenomenal Team (Brad)"},{"$nulls":3},{"$f":"Data!A3","v":"Amazing Team (Brandon)"},{"$nulls":3},{"$f":"Data!A4","v":"Barons (Bruce)"},{"$nulls":3},{"$f":"Data!A5","v":"Champion Team (Cathy)"},{"$nulls":3},{"$f":"Data!A6","v":"Bruins (Jessica)"},{"$nulls":3},{"$f":"Data!A7","v":"Woap (Mike)"},{"$nulls":3},{"$f":"Data!A8","v":"Nice Team (Nick)"},{"$nulls":3},{"$f":"Data!A9","v":"Kayi Alps (Rhonda)"},{"$nulls":3},{"$f":"Data!A10","v":"Lugnuts (Rob)"},{"$nulls":3},{"$f":"Data!A11","v":"Fine Team (Todd)"},{"$nulls":3},{"$f":"Data!A12","v":"n/a"}]
[null,"Pos.","Player","$","years","Pos.","Player","$","years","Pos.","Player","$","years","Pos.","Player","$","years","Pos.","Player","$","years","Pos.","Player","$","years","Pos.","Player","$","years","Pos.","Player","$","years","Pos.","Player","$","years","Pos.","Player","$","years","Pos.","Player","$","years"]
[{"$f":"20-COUNT(D4,H4,L4,P4,T4,X4, AB4,AF4,AJ4,AN4,D5,H5,L5,P5,T5,X5,AB5,AF5,AJ5,AN5)","v":20},"G1",{"$nulls":3},"G1",{"$nulls":3},"G1",{"$nulls":3},"G1",{"$nulls":3},"G1",{"$nulls":3},"G1",{"$nulls":3},"G1",{"$nulls":3},"G1",{"$nulls":3},"G1",{"$nulls":3},"G1",{"$nulls":3},"G1"]
[null,"G2",{"$nulls":3},"G2",{"$nulls":3},"G2",{"$nulls":3},"G2",{"$nulls":3},"G2",{"$nulls":3},"G2",{"$nulls":3},"G2",{"$nulls":3},"G2",{"$nulls":3},"G2",{"$nulls":3},"G2",{"$nulls":3},"G2"]
[{"$f":"40-COUNT(D6:D9,H6:H9,L6:L9,P6:P9,T6:T9,X6:X9,AB6:AB9,AF6:AF9,AJ6:AJ9,AN6:AN9)","v":40},"D",{"$nulls":3},"D",{"$nulls":3},"D",{"$nulls":3},"D",{"$nulls":3},"D",{"$nulls":3},"D",{"$nulls":3},"D",{"$nulls":3},"D",{"$nulls":3},"D",{"$nulls":3},"D",{"$nulls":3},"D"]
[null,"D",{"$nulls":3},"D",{"$nulls":3},"D",{"$nulls":3},"D",{"$nulls":3},"D",{"$nulls":3},"D",{"$nulls":3},"D",{"$nulls":3},"D",{"$nulls":3},"D",{"$nulls":3},"D",{"$nulls":3},"D"]
[null,"D",{"$nulls":3},"D",{"$nulls":3},"D",{"$nulls":3},"D",{"$nulls":3},"D",{"$nulls":3},"D",{"$nulls":3},"D",{"$nulls":3},"D",{"$nulls":3},"D",{"$nulls":3},"D",{"$nulls":3},"D"]
[null,"D",{"$nulls":3},"D",{"$nulls":3},"D",{"$nulls":3},"D",{"$nulls":3},"D",{"$nulls":3},"D",{"$nulls":3},"D",{"$nulls":3},"D",{"$nulls":3},"D",{"$nulls":3},"D",{"$nulls":3},"D"]
[{"$f":"30-COUNT(D10:D12,H10:H12,L10:L12,P10:P12,#REF!,T10:T12,X10:X12,AB10:AB12,AF10:AF12,AJ10:AJ12,AN10:AN12)","v":30},"LW",{"$nulls":3},"LW",{"$nulls":3},"LW",{"$nulls":3},"LW",{"$nulls":3},"LW",{"$nulls":3},"LW",{"$nulls":3},"LW",{"$nulls":3},"LW",{"$nulls":3},"LW",{"$nulls":3},"LW",{"$nulls":3},"LW"]
[null,"LW",{"$nulls":3},"LW",{"$nulls":3},"LW",{"$nulls":3},"LW",{"$nulls":3},"LW",{"$nulls":3},"LW",{"$nulls":3},"LW",{"$nulls":3},"LW",{"$nulls":3},"LW",{"$nulls":3},"LW",{"$nulls":3},"LW"]
[null,"LW",{"$nulls":3},"LW",{"$nulls":3},"LW",{"$nulls":3},"LW",{"$nulls":3},"LW",{"$nulls":3},"LW",{"$nulls":3},"LW",{"$nulls":3},"LW",{"$nulls":3},"LW",{"$nulls":3},"LW",{"$nulls":3},"LW"]
[{"$f":"30-COUNT(D13:D15,H13:H15,L13:L15,P13:P15,T13:T15,X13:X15,AB13:AB15,AF13:AF15,AJ13:AJ15,AN13:AN15)","v":30},"RW",{"$nulls":3},"RW",{"$nulls":3},"RW",{"$nulls":3},"RW",{"$nulls":3},"RW",{"$nulls":3},"RW",{"$nulls":3},"RW",{"$nulls":3},"RW",{"$nulls":3},"RW",{"$nulls":3},"RW",{"$nulls":3},"RW"]
[null,"RW",{"$nulls":3},"RW",{"$nulls":3},"RW",{"$nulls":3},"RW",{"$nulls":3},"RW",{"$nulls":3},"RW",{"$nulls":3},"RW",{"$nulls":3},"RW",{"$nulls":3},"RW",{"$nulls":3},"RW",{"$nulls":3},"RW"]
[null,"RW",{"$nulls":3},"RW",{"$nulls":3},"RW",{"$nulls":3},"RW",{"$nulls":3},"RW",{"$nulls":3},"RW",{"$nulls":3},"RW",{"$nulls":3},"RW",{"$nulls":3},"RW",{"$nulls":3},"RW",{"$nulls":3},"RW"]
[{"$f":"30-COUNT(D16:D18,H16:H18,L16:L18,P16:P18,T16:T18,X16:X18,AB16:AB18,AF16:AF18,AJ16:AJ18,AN16:AN18)","v":30},"C",{"$nulls":3},"C",{"$nulls":3},"C",{"$nulls":3},"C",{"$nulls":3},"C",{"$nulls":3},"C",{"$nulls":3},"C",{"$nulls":3},"C",{"$nulls":3},"C",{"$nulls":3},"C",{"$nulls":3},"C"]
[null,"C",{"$nulls":3},"C",{"$nulls":3},"C",{"$nulls":3},"C",{"$nulls":3},"C",{"$nulls":3},"C",{"$nulls":3},"C",{"$nulls":3},"C",{"$nulls":3},"C",{"$nulls":3},"C",{"$nulls":3},"C"]
[null,"C",{"$nulls":3},"C",{"$nulls":3},"C",{"$nulls":3},"C",{"$nulls":3},"C",{"$nulls":3},"C",{"$nulls":3},"C",{"$nulls":3},"C",{"$nulls":3},"C",{"$nulls":3},"C",{"$nulls":3},"C"]
[{"$f":"10-COUNT(D19,H19,L19,P19,T19,X19,AB19,AF19,AJ19,AN19)","v":10},"U",{"$nulls":3},"U",{"$nulls":3},"U",{"$nulls":3},"U",{"$nulls":3},"U",{"$nulls":3},"U",{"$nulls":3},"U",{"$nulls":3},"U",{"$nulls":3},"U",{"$nulls":3},"U",{"$nulls":3},"U"]
[null,null,"Current Used Points",{"$f":"SUM(D4:D19)","v":0},null,null,"Current Used Points",{"$f":"SUM(H4:H19)","v":0},null,null,"Current Used Points",{"$f":"SUM(L4:L19)","v":0},null,null,"Current Used Points",{"$f":"SUM(P4:P19)","v":0},null,null,"Current Used Points",{"$f":"SUM(T4:T19)","v":0},null,null,"Current Used Points",{"$f":"SUM(X4:X19)","v":0},null,null,"Current Used Points",{"$f":"SUM(AB4:AB19)","v":0},null,null,"Current Used Points",{"$f":"SUM(AF4:AF19)","v":0},null,null,"Current Used Points",{"$f":"SUM(AJ4:AJ19)","v":0},null,null,"Current Used Points",{"$f":"SUM(AN4:AN19)","v":0},null,null,"Current Used Points",{"$f":"SUM(AR4:AR19)","v":0}]
[null,null,"Remaining Points",{"$f":"SUM(260-D20)","v":260},null,null,"Remaining Points",{"$f":"SUM(260-H20)","v":260},null,null,"Remaining Points",{"$f":"SUM(260-L20)","v":260},null,null,"Remaining Points",{"$f":"SUM(260-P20)","v":260},null,null,"Remaining Points",{"$f":"SUM(260-T20)","v":260},null,null,"Remaining Points",{"$f":"SUM(260-X20)","v":260},null,null,"Remaining Points",{"$f":"SUM(260-AB20)","v":260},null,null,"Remaining Points",{"$f":"SUM(260-AF20)","v":260},null,null,"Remaining Points",{"$f":"SUM(260-AJ20)","v":260},null,null,"Remaining Points",{"$f":"SUM(260-AN20)","v":260},null,null,"Remaining Points",{"$f":"SUM(260-AR20)","v":260}]
[null,"Maximum Bidding Points",null,{"$f":"(D21-(16-COUNT(D4:D19))+(IF(COUNT(D4:D19)=16,0,1)))","v":245},null,"Maximum Bidding Points",null,{"$f":"(H21-(16-COUNT(H4:H19))+(IF(COUNT(H4:H19)=16,0,1)))","v":245},null,null,"Maximum Bidding Points",{"$f":"(L21-(16-COUNT(L4:L19))+(IF(COUNT(L4:L19)=16,0,1)))","v":245},null,"Maximum Bidding Points",null,{"$f":"(P21-(16-COUNT(P4:P19))+(IF(COUNT(P4:P19)=16,0,1)))","v":245},null,"Maximum Bidding Points",null,{"$f":"(T21-(16-COUNT(T4:T19))+(IF(COUNT(T4:T19)=16,0,1)))","v":245},null,"Maximum Bidding Points",null,{"$f":"(X21-(16-COUNT(X4:X19))+(IF(COUNT(X4:X19)=16,0,1)))","v":245},null,"Maximum Bidding Points",null,{"$f":"(AB21-(16-COUNT(AB4:AB19))+(IF(COUNT(AB4:AB19)=16,0,1)))","v":245},null,"Maximum Bidding Points",null,{"$f":"(AF21-(16-COUNT(AF4:AF19))+(IF(COUNT(AF4:AF19)=16,0,1)))","v":245},null,"Maximum Bidding Points",null,{"$f":"(AJ21-(16-COUNT(AJ4:AJ19))+(IF(COUNT(AJ4:AJ19)=16,0,1)))","v":245},null,"Maximum Bidding Points",null,{"$f":"(AN21-(16-COUNT(AN4:AN19))+(IF(COUNT(AN4:AN19)=16,0,1)))","v":245},null,"Maximum Bidding Points",null,{"$f":"(AR21-(16-COUNT(AR4:AR19))+(IF(COUNT(AR4:AR19)=16,0,1)))","v":245}]
[null,"Remaining Players to Draft",null,{"$f":"16-COUNT(D4:D19)","v":16},null,"Remaining Players to Draft",null,{"$f":"16-COUNT(H4:H19)","v":16},null,"Remaining Players to Draft",null,{"$f":"16-COUNT(L4:L19)","v":16},null,"Remaining Players to Draft",null,{"$f":"16-COUNT(P4:P19)","v":16},null,"Remaining Players to Draft",null,{"$f":"16-COUNT(T4:T19)","v":16},null,"Remaining Players to Draft",null,{"$f":"16-COUNT(X4:X19)","v":16},null,"Remaining Players to Draft",null,{"$f":"16-COUNT(AB4:AB19)","v":16},null,"Remaining Players to Draft",null,{"$f":"16-COUNT(AF4:AF19)","v":16},null,"Remaining Players to Draft",null,{"$f":"16-COUNT(AJ4:AJ19)","v":16},null,"Remaining Players to Draft",null,{"$f":"16-COUNT(AN4:AN19)","v":16},null,"Remaining Players to Draft",null,{"$f":"16-COUNT(AR4:AR19)","v":16}]
[]
[null,null,{"$f":"\"Draft Order = \"&VLOOKUP(\"Phenomenal Team (Brad)\",draftorder,2,FALSE)","v":"Draft Order = 1"},{"$nulls":3},{"$f":"\"Draft Order = \"&VLOOKUP(\"Amazing Team (Brandon)\",draftorder,2,FALSE)","v":"Draft Order = 2"},{"$nulls":3},{"$f":"\"Draft Order = \"&VLOOKUP(\"Barons (Bruce)\",draftorder,2,FALSE)","v":"Draft Order = 3"},{"$nulls":3},{"$f":"\"Draft Order = \"&VLOOKUP(\"Champion Team (Cathy)\",draftorder,2,FALSE)","v":"Draft Order = 4"},{"$nulls":3},{"$f":"\"Draft Order = \"&VLOOKUP(\"Bruins (Jessica)\",draftorder,2,FALSE)","v":"Draft Order = 5"},{"$nulls":3},{"$f":"\"Draft Order = \"&VLOOKUP(\"Woap (Mike)\",draftorder,2,FALSE)","v":"Draft Order = 6"},{"$nulls":3},{"$f":"\"Draft Order = \"&VLOOKUP(\"Nice Team (Nick)\",draftorder,2,FALSE)","v":"Draft Order = 7"},{"$nulls":3},{"$f":"\"Draft Order = \"&VLOOKUP(\"Kayi Alps (Rhonda)\",draftorder,2,FALSE)","v":"Draft Order = 8"},{"$nulls":3},{"$f":"\"Draft Order = \"&VLOOKUP(\"Lugnuts (Rob)\",draftorder,2,FALSE)","v":"Draft Order = 9"},{"$nulls":3},{"$f":"\"Draft Order = \"&VLOOKUP(\"Fine Team (Todd)\",draftorder,2,FALSE)","v":"Draft Order = 10"},{"$nulls":3},"n/a"]

{"sheet":"Draft List","index":1,"n_rows":1,"n_cols":9,"rows_kept":1}
[0,"Team","Player","Bid","NHL Team","Rank","Points","Wins","Shutouts"]

{"sheet":"Summary","index":2,"n_rows":13,"n_cols":12,"rows_kept":13}
["Owners","Current Used Points","Remaining Points","Maximum Bidding Points","Remaining # Players to Draft","Goalies","Defence","Left Wingers","Right Wingers","Centres","Utility","Reserve"]
["Bruins (Bruce)",0,260,245,16,{"$f":"2-COUNT('Draft Roster'!D4:D5)","v":2},{"$f":"4-COUNT('Draft Roster'!D6:D9)","v":4},{"$f":"3-COUNT('Draft Roster'!D10:D12)","v":3},{"$f":"3-COUNT('Draft Roster'!D13:D15)","v":3},{"$f":"3-COUNT('Draft Roster'!D16:D18)","v":3},{"$f":"1-COUNT('Draft Roster'!D19)","v":1},{"$f":"5-COUNT('Draft Roster'!D26:D30)","v":5}]
["Dominant Brandon (Brandon)",0,260,245,16,{"$f":"2-COUNT('Draft Roster'!H4:H5)","v":2},{"$f":"4-COUNT('Draft Roster'!H6:H9)","v":4},{"$f":"3-COUNT('Draft Roster'!H10:H12)","v":3},{"$f":"3-COUNT('Draft Roster'!H13:H15)","v":3},{"$f":"3-COUNT('Draft Roster'!H16:H18)","v":3},{"$f":"1-COUNT('Draft Roster'!H19)","v":1},{"$f":"5-COUNT('Draft Roster'!H26:H30)","v":5}]
["Booya's (Cathy)",0,260,245,16,{"$f":"2-COUNT('Draft Roster'!L4:L5)","v":2},{"$f":"4-COUNT('Draft Roster'!L6:L9)","v":4},{"$f":"3-COUNT('Draft Roster'!L10:L12)","v":3},{"$f":"3-COUNT('Draft Roster'!L13:L15)","v":3},{"$f":"3-COUNT('Draft Roster'!L16:L18)","v":3},{"$f":"1-COUNT('Draft Roster'!L19)","v":1},{"$f":"5-COUNT('Draft Roster'!L26:L30)","v":5}]
["VanekDownByTheRiver (Colin)",0,260,245,16,{"$f":"2-COUNT('Draft Roster'!P4:P5)","v":2},{"$f":"4-COUNT('Draft Roster'!P6:P9)","v":4},{"$f":"3-COUNT('Draft Roster'!P10:P12)","v":3},{"$f":"3-COUNT('Draft Roster'!P13:P15)","v":3},{"$f":"3-COUNT('Draft Roster'!P16:P18)","v":3},{"$f":"1-COUNT('Draft Roster'!P19)","v":1},{"$f":"5-COUNT('Draft Roster'!P26:P30)","v":5}]
["Woap (Mike)",0,260,245,16,{"$f":"2-COUNT('Draft Roster'!T4:T5)","v":2},{"$f":"4-COUNT('Draft Roster'!T6:T9)","v":4},{"$f":"3-COUNT('Draft Roster'!T10:T12)","v":3},{"$f":"3-COUNT('Draft Roster'!T13:T15)","v":3},{"$f":"3-COUNT('Draft Roster'!T16:T18)","v":3},{"$f":"1-COUNT('Draft Roster'!T19)","v":1},{"$f":"5-COUNT('Draft Roster'!T26:T30)","v":5}]
["Tad Nugents (Nick)",0,260,245,16,{"$f":"2-COUNT('Draft Roster'!X4:X5)","v":2},{"$f":"4-COUNT('Draft Roster'!X6:X9)","v":4},{"$f":"3-COUNT('Draft Roster'!X10:X12)","v":3},{"$f":"3-COUNT('Draft Roster'!X13:X15)","v":3},{"$f":"3-COUNT('Draft Roster'!X16:X18)","v":3},{"$f":"1-COUNT('Draft Roster'!X19)","v":1},{"$f":"5-COUNT('Draft Roster'!X26:X30)","v":5}]
["Riverdogs (Rhonda)",0,260,245,16,{"$f":"2-COUNT('Draft Roster'!AB4:AB5)","v":2},{"$f":"4-COUNT('Draft Roster'!AB6:AB9)","v":4},{"$f":"3-COUNT('Draft Roster'!AB10:AB12)","v":3},{"$f":"3-COUNT('Draft Roster'!AB13:AB15)","v":3},{"$f":"3-COUNT('Draft Roster'!AB16:AB18)","v":3},{"$f":"1-COUNT('Draft Roster'!AB19)","v":1},{"$f":"5-COUNT('Draft Roster'!AB26:AB30)","v":5}]
["Robs Chiefs (Rob)",0,260,245,16,{"$f":"2-COUNT('Draft Roster'!AF4:AF5)","v":2},{"$f":"4-COUNT('Draft Roster'!AF6:AF9)","v":4},{"$f":"3-COUNT('Draft Roster'!AF10:AF12)","v":3},{"$f":"3-COUNT('Draft Roster'!AF13:AF15)","v":3},{"$f":"3-COUNT('Draft Roster'!AF16:AF18)","v":3},{"$f":"1-COUNT('Draft Roster'!AF19)","v":1},{"$f":"5-COUNT('Draft Roster'!AF26:AF30)","v":5}]
["Curtis Crazy Canucks (Todd)",0,260,245,16,{"$f":"2-COUNT('Draft Roster'!AJ4:AJ5)","v":2},{"$f":"4-COUNT('Draft Roster'!AJ6:AJ9)","v":4},{"$f":"3-COUNT('Draft Roster'!AJ10:AJ12)","v":3},{"$f":"3-COUNT('Draft Roster'!AJ13:AJ15)","v":3},{"$f":"3-COUNT('Draft Roster'!AJ16:AJ18)","v":3},{"$f":"1-COUNT('Draft Roster'!AJ19)","v":1},{"$f":"5-COUNT('Draft Roster'!AJ26:AJ30)","v":5}]
["Cold Warriors (Tom)",0,260,245,16,{"$f":"2-COUNT('Draft Roster'!AN4:AN5)","v":2},{"$f":"4-COUNT('Draft Roster'!AN6:AN9)","v":4},{"$f":"3-COUNT('Draft Roster'!AN10:AN12)","v":3},{"$f":"3-COUNT('Draft Roster'!AN13:AN15)","v":3},{"$f":"3-COUNT('Draft Roster'!AN16:AN18)","v":3},{"$f":"1-COUNT('Draft Roster'!AN19)","v":1},{"$f":"5-COUNT('Draft Roster'!AN26:AN30)","v":5}]
["Brad's Boss Team (Brad)",0,260,245,16,{"$f":"2-COUNT('Draft Roster'!AR4:AR5)","v":2},{"$f":"4-COUNT('Draft Roster'!AR6:AR9)","v":4},{"$f":"3-COUNT('Draft Roster'!AR10:AR12)","v":3},{"$f":"3-COUNT('Draft Roster'!AR13:AR15)","v":3},{"$f":"3-COUNT('Draft Roster'!AR16:AR18)","v":3},{"$f":"1-COUNT('Draft Roster'!AR19)","v":1},{"$f":"5-COUNT('Draft Roster'!AN26:AN30)","v":5}]
[{"$nulls":4},{"$f":"SUM(E2:E12)","v":176},{"$f":"SUM(F2:F12)","v":22},{"$f":"SUM(G2:G12)","v":44},{"$f":"SUM(H2:H12)","v":33},33,33,11,55]

{"sheet":"Centre","index":3,"n_rows":522,"n_cols":5,"rows_kept":522}
["Player","Team","GP","O-Rank","Points"]
["Connor McDavid","Edm - C",80,1,126]
["Leon Draisaitl","Edm - C,LW",82,2,116]
["Auston Matthews","Tor - C",75,3,105]
["Nathan MacKinnon","Col - C",75,4,104]
["Mikko Rantanen","Col - C,RW",76,8,93]
["Aleksander Barkov","Fla - C",74,13,94]
["Steven Stamkos","TB - C,LW",75,20,98]
["Sidney Crosby","Pit - C",68,21,81]
["J.T. Miller","Van - C,LW",79,22,91]
["Mika Zibanejad","NYR - C",79,25,79]
["Sebastian Aho","Car - C",80,27,85]
["Gabriel Landeskog","Col - C,LW",69,31,73]
["Jack Eichel","VGK - C",76,38,68]
["Elias Lindholm","Cgy - C",82,43,73]
["Claude Giroux","Ott - C,RW",78,45,69]
["Elias Pettersson","Van - C,LW",78,47,69]
["Evgeny Kuznetsov","Was - C",74,50,73]
["Evgeni Malkin","Pit - C",68,51,66]
["Nazem Kadri","Cgy - C",72,54,68]
["John Tavares","Tor - C",78,56,76]
["Sam Reinhart","Fla - C,RW",80,60,76]
["Josh Norris","Ott - C",75,63,61]
["Patrice Bergeron","Bos - C",73,64,59]
["Jack Hughes","NJ - C",70,68,69]
["Trevor Zegras","Anh - C",76,73,67]
["Pierre-Luc Dubois","Wpg - C",82,79,63]
["Anze Kopitar","LA - C",82,80,70]
["Robert Thomas","StL - C",75,82,74]
["Tim Stuetzle","Ott - C,LW",79,84,62]
["Joe Pavelski","Dal - C,RW",82,91,72]
["Brayden Schenn","StL - C,LW",69,95,52]
["Mark Scheifele","Wpg - C",75,97,76]
["Sam Bennett","Fla - C",72,99,49]
["Bo Horvat","Van - C",79,102,56]
["Dylan Larkin","Det - C",75,103,71]
["Brayden Point","TB - C",75,106,69]
["Tage Thompson","Buf - C",77,109,58]
["Anton Lundell","Fla - C",70,111,52]
["Ryan O'Reilly","StL - C",80,115,67]
["Tomas Hertl","SJ - C",78,120,61]
["Ryan Hartman","Min - C",80,122,53]
["Roope Hintz","Dal - C",75,124,67]
["Ryan Nugent-Hopkins","Edm - C,LW",72,127,61]
["Brock Nelson","NYI - C",80,130,54]
["Mathew Barzal","NYI - C",78,133,63]
["Boone Jenner","Cls - C",66,136,42]
["Nico Hischier","NJ - C",72,140,58]
["Nick Suzuki","Mon - C",82,141,64]
["Joel Eriksson Ek","Min - C",77,151,49]
["Sean Couturier","Phi - C",45,158,33]
["Matty Beniers","Sea - C",75,164,47]
["Andrew Copp","Det - C,RW",72,169,51]
["Ivan Barbashev","StL - C,LW",76,179,44]
["Ryan Johansen","Nsh - C",77,181,55]
["Erik Haula","NJ - C,LW",75,182,35]
["T.J. Oshie","Was - C,RW",66,183,42]
["Dawson Mercer","NJ - C,RW",82,185,48]
["Filip Chytil","NYR - C,RW",69,197,26]
["Logan Couture","SJ - C",77,203,55]
["Tyler Seguin","Dal - C,RW",80,204,54]
["Nick Schmaltz","Ari - C,RW",73,206,61]
["Nicklas Backstrom","Was - C",4,213,3]
["Cole Perfetti","Wpg - C,RW",77,216,48]
["Connor McMichael","Was - C,LW",72,217,44]
["Kirby Dach","Mon - C,RW",71,218,32]
["Dylan Strome","Was - C,RW",71,221,51]
["Hendrix Lapierre","Was - C",0,222,0]
["Ryan Strome","Anh - C",78,223,55]
["Chandler Stephenson","VGK - C,RW",78,226,59]
["Phillip Danault","LA - C",79,229,49]
["Jared McCann","Sea - C,LW",74,235,48]
["Shane Wright","Sea - C",78,236,46]
["Peyton Krebs","Buf - C,LW",74,237,32]
["Marco Rossi","Min - C",71,239,30]
["Yegor Sharangovich","NJ - C,LW",78,240,49]
["Cole Sillinger","Cls - C",79,242,43]
["Vincent Trocheck","NYR - C",77,251,56]
["Jordan Staal","Car - C",78,255,36]
["Jamie Benn","Dal - C,LW",80,259,48]
["Mikael Granlund","Nsh - C",77,262,59]
["Mikael Backlund","Cgy - C",80,269,41]
["Jeff Carter","Pit - C",75,273,44]
["Jean-Gabriel Pageau","NYI - C",77,274,40]
["Anthony Cirelli","TB - C,LW",68,295,38]
["Adam Lowry","Wpg - C",78,415,23]
["Ross Colton","TB - C,LW",77,418,37]
["Paul Stastny","Car - C,LW",72,422,45]
["Sean Kuraly","Cls - C",60,432,20]
["Yanni Gourde","Sea - C",78,435,52]
["Jack Roslovic","Cls - C",79,450,51]
["Barclay Goodrow","NYR - C,LW",71,451,26]
["Nicolas Roy","VGK - C,RW",77,456,37]
["William Karlsson","VGK - C,LW",75,478,43]
["Charlie Coyle","Bos - C",80,484,42]
["Scott Laughton","Phi - C,LW",67,498,27]
["Nick Paul","TB - C,LW",80,501,34]
["Pavel Zacha","Bos - C,LW",71,507,32]
["Colton Sissons","Nsh - C",79,508,26]
["Keegan Kolesar","VGK - C,RW",74,511,25]
["Adam Henrique","Anh - C,LW",65,512,41]
["Joel Farabee","Phi - C,LW",66,523,38]
["Nic Dowd","Was - C",66,528,23]
["Frederick Gaudreau","Min - C,RW",68,530,35]
["Pius Suter","Det - C",82,554,39]
["Lars Eller","Was - C",73,567,32]
["Trevor Lewis","Cgy - C,RW",45,569,8]
["Ryan Getzlaf","Anh - C",0,573,0]
["Teddy Blueger","Pit - C",69,575,30]
["J.T. Compher","Col - C,RW",74,579,33]
["Jesperi Kotkaniemi","Car - C,LW",74,581,33]
["Curtis Lazar","Van - C,RW",73,588,14]
["Sean Monahan","Mon - C",70,591,28]
["Kevin Hayes","Phi - C",72,598,46]
["Jake Evans","Mon - C,RW",56,600,22]
["Dylan Cozens","Buf - C",76,603,41]
["David Kampf","Tor - C",82,606,24]
["Calle Jarnkrok","Tor - C,RW",52,608,23]
["Michael Rasmussen","Det - C,LW",77,611,24]
["Pierre-Edouard Bellemare","TB - C",79,613,17]
["Luke Glendening","Dal - C,RW",80,614,16]
["Vladislav Namestnikov","TB - C,LW",75,615,28]
["Alex Newhook","Col - C,LW",64,617,30]
["Casey Cizikas","NYI - C",73,621,16]
["Trent Frederic","Bos - C,LW",66,629,22]
["Blake Lizotte","LA - C",67,630,21]
["Alex Wennberg","Sea - C",78,634,41]
["Nico Sturm","SJ - C,LW",75,638,18]
["Colin Blackwell","Chi - C,RW",73,646,27]
["Christian Dvorak","Mon - C",71,648,39]
["Tyson Jost","Min - C,LW",69,656,20]
["Derick Brassard","Ott - C,LW",39,660,16]
["Nick Bonino","SJ - C,LW",79,661,30]
["Eetu Luostarinen","Fla - C",74,662,22]
["Travis Boyd","Ari - C,RW",76,667,29]
["Michael McLeod","NJ - C",75,672,22]
["Nick Bjugstad","Ari - C,RW",48,678,11]
["Radek Faksa","Dal - C",79,684,23]
["Darren Helm","Col - C,LW",67,688,14]
["Jonathan Toews","Chi - C",71,695,40]
["Oskar Sundqvist","Det - C,RW",46,702,14]
["Brian Boyle","Pit - C,LW",62,705,20]
["Kevin Rooney","Cgy - C,LW",29,706,6]
["Tomas Nosek","Bos - C",71,707,16]
["Jason Dickinson","Van - C,LW",65,710,16]
["Barrett Hayton","Ari - C",74,713,31]
["Sam Carrick","Anh - C,RW",62,717,15]
["Isac Lundestrom","Anh - C",79,721,27]
["Alex Galchenyuk","Col - C,LW",58,725,22]
["Michael McCarron","Nsh - C",44,726,9]
["Victor Rask","Cls - C,LW",38,727,17]
["Ryan Carpenter","NYR - C,RW",43,731,8]
["Johan Larsson","Was - C,LW",49,732,21]
["Sam Lafferty","Chi - C,RW",75,737,17]
["Morgan Geekie","Sea - C",45,744,12]
["Brett Howden","VGK - C,LW",61,746,20]
["Zemgus Girgensons","Buf - C,LW",54,749,16]
["Derek Stepan","Car - C,RW",27,755,10]
["Christian Fischer","Ari - C,RW",63,757,14]
["Derek Ryan","Edm - C,RW",60,761,17]
["Casey Mittelstadt","Buf - C",70,762,44]
["Dylan Gambrell","Ott - C,RW",52,764,8]
["Juho Lammikko","Van - C",0,765,0]
["Chris Tierney","Fla - C,LW",58,772,22]
["Ryan McLeod","Edm - C,LW",73,774,24]
["Joe Veleno","Det - C,LW",37,779,10]
["Mathieu Perreault","Mon - C,LW",36,790,13]
["Riley Sheahan","Buf - C,LW",42,791,11]
["Jesper Boqvist","NJ - C",58,794,22]
["Justin Danforth","Cls - C,RW",16,795,5]
["Michael Amadio","VGK - C,RW",39,798,9]
["Dominic Toninato","Wpg - C,LW",51,800,9]
["Noel Acciari","StL - C,LW",57,802,20]
["Colin White","Fla - C,RW",45,805,21]
["Sam Steel","Min - C,LW",57,811,18]
["Jacob Peterson","Dal - C,LW",72,815,22]
["Devin Shore","Edm - C,LW",30,820,9]
["Rasmus Kupari","LA - C,RW",60,829,15]
["Morgan Frost","Phi - C,LW",68,830,20]
["Dakota Joshua","Van - C,LW",34,836,8]
["MacKenzie Entwistle","Chi - C,RW",48,837,11]
["David Krejci","Bos - C",64,839,44]
["Joe Thornton","Fla - C,LW",43,847,15]
["Ryan Poehling","Pit - C",43,849,12]
["Cody Eakin","Cgy - C",34,851,6]
["Reese Johnson","Chi - C,RW",44,858,7]
["Tyler Bozak","StL - C",52,864,16]
["Patrick Brown","Phi - C",15,865,3]
["Brad Richardson","Van - C,LW",43,866,9]
["Adam Ruzicka","Cgy - C",23,874,8]
["Ryan Dzingel","Car - C,RW",38,876,14]
["Brendan Gaunce","Cls - C,LW",6,884,2]
["Nolan Patrick","VGK - C,RW",0,887,0]
["Cedric Paquette","Mon - C",34,888,6]
["Riley Nash","Fla - C,RW",51,889,6]
["Aliaksei Protas","Was - C,LW",11,901,4]
["Jasper Weatherby","SJ - C",8,904,2]
["Connor Dewar","Min - C,LW",63,905,13]
["Laurent Dauphin","Ari - C,LW",30,916,8]
["Logan Brown","StL - C,RW",48,917,14]
["Jake Leschyshyn","VGK - C",74,919,14]
["Mark Jankowski","Nsh - C",15,920,4]
["Alexander Chmelevski","SJ - C,RW",0,922,0]
["Morgan Barron","Wpg - C,LW",74,923,17]
["Quinton Byfield","LA - C",49,924,13]
["Carter Rowney","Det - C,RW",0,932,0]
["Oskar Steen","Bos - C,RW",24,937,5]
["Alex Barre-Boulet","arre-Boulet TB - C,RW",37,939,13]
["Mikhail Maltsev","Col - C,LW",46,941,6]
["Scott Reedy","SJ - C,RW",6,942,2]
["Nate Thompson","LA - C",33,949,4]
["Cody Glass","Nsh - C,RW",22,951,8]
["Mark Kastelic","Ott - C",21,953,4]
["Adam Brooks","Phi - C,RW",29,957,6]
["Arttu Ruotsalainen","Buf - C",21,959,4]
["Thomas Novak","Nsh - C",16,968,5]
["Jayson Megna","Col - C,RW",23,972,3]
["Nick Merkley","NYR - C,RW",13,974,4]
["Austin Czarnik","Det - C,RW",4,977,2]
["Jonny Brodzinski","NYR - C,RW",25,980,3]
["Lias Andersson","LA - C,LW",8,981,2]
["Greg McKegg","Edm - C,LW",33,982,5]
["Henrik Borgstrom","Was - C,LW",19,986,4]
["Lane Pederson","Car - C,RW",18,995,4]
["Nathan Smith","Ari - C",77,1002,29]
["Michael Sgarbossa","Was - C",0,1004,0]
["Jaret Ande","LA - C",18,1011,4]
["Jack Studnicka","Bos - C",31,1023,5]
["Benoit-Olivier Groulx","Anh - C",44,1024,7]
["Brandon Sutter","Van - C,RW",0,1029,0]
["Ty Dellandrea","Dal - C,RW",35,1030,10]
["Kevin Stenlund","Wpg - C,RW",29,1034,7]
["Jay Beagle","Ari - C",38,1036,4]
["Shane Pinto","Ott - C",73,1037,38]
["Paul Cotter","VGK - C",6,1038,2]
["Jack McBain","Ari - C",65,1047,19]
["Thomas Bordeleau","SJ - C",76,1049,45]
["Clark Bishop","Cgy - C,LW",29,1057,10]
["Kristian Reichel","Wpg - C,RW",42,1059,10]
["Eric Staal","Fla - C",0,1060,0]
["Mitchell Stephens","Mon - C",15,1061,3]
["Artem Anisimov","Phi - C,LW",0,1065,0]
["Logan Shaw","Tor - C,RW",19,1072,3]
["Brad Malone","Edm - C,LW",4,1075,1]
["Jack Drury","Car - C",64,1077,28]
["Josiah Slavin","Chi - C,LW",25,1080,2]
["Alexander True","Sea - C",4,1083,0]
["Liam Foudy","Cls - C,RW",12,1085,2]
["Riley Damiani","Dal - C",7,1090,3]
["Kyle Criscuolo","Det - C",0,1095,0]
["Rhett Gardner","Dal - C,LW",10,1097,1]
["Alex Turcotte","LA - C",4,1099,0]
["Andrew Poturalski","Sea - C",8,1105,4]
["Otto Koivula","NYI - C",25,1121,4]
["Frederik Gauthier","NJ - C,RW",12,1124,2]
["Kyle Rau","Min - C,RW",7,1133,0]
["Zac Dalpe","Fla - C,RW",0,1134,0]
["Connor Bunnaman","Fla - C",19,1136,3]
["Matthew Peca","StL - C,LW",0,1141,0]
["Fredrik Karlstrom","Dal - C",8,1152,2]
["Jackson Cates","Phi - C,LW",6,1153,1]
["Garrett Pilon","Was - C",3,1155,0]
["Joseph Cramarossa","Min - C,LW",2,1160,1]
["Luke Johnson","SJ - C",0,1165,0]
["Joel L'Esperance","Det - C,RW",0,1166,0]
["Andrew Agozzino","SJ - C,LW",0,1171,0]
["Glenn Gawdin","Anh - C",39,1173,12]
["Gemel Smith","TB - C,LW",8,1175,2]
["Aleksi Heponiemi","Fla - C",5,1177,1]
["Ben Meyers","Col - C",37,1181,18]
["Byron Froese","VGK - C,RW",0,1184,0]
["Steven Fogarty","Min - C,RW",2,1186,0]
["Mason Shaw","Min - C",25,1187,8]
["Josh Dunne","Cls - C",0,1191,0]
["Chase Pearson","Det - C",0,1192,0]
["Danny O'Regan","Anh - C",13,1197,0]
["Tanner Laczynski","Phi - C",10,1200,1]
["Cooper Marody","Phi - C",4,1201,2]
["Ben Jones","Cgy - C",0,1203,0]
["Justin Richards","Cls - C",0,1205,0]
["Seth Griffith","Edm - C,LW",0,1206,0]
["Brett Seney","Chi - C,LW",5,1210,0]
["Zac Rinaldo","Cls - C,LW",0,1214,0]
["Viktor Lodin","Ott - C",8,1216,1]
["Cameron Hillis","Mon - C",0,1221,0]
["Chase De Leo","Anh - C",13,1224,0]
["Michael Eyssimont","Wpg - C",11,1228,0]
["Matthew Phillips","Cgy - C",38,1237,14]
["Cameron Hughes","Sea - C",0,1239,0]
["Sean Malone","Buf - C",0,1243,0]
["David Cotton","Sea - C",0,1250,0]
["Adam Cracknell","Ari - C,RW",0,1253,0]
["Luke Esposito","Edm - C,LW",0,1256,0]
["Cole Guttman","Chi - C",0,1263,0]
["Luca Del Bel Belluz","Cls - C",0,1266,0]
["Maxim Letunov","NYR - C",0,1267,0]
["Jachym Kondelik","Nsh - C",0,1271,0]
["Nils Aman","Van - C",0,1272,0]
["Noah Philp","Edm - C",0,1279,0]
["Chase Wouters","Van - C",0,1287,0]
["Nathan Gaucher","Anh - C",0,1288,0]
["Xavier Simoneau","Mon - C",0,1289,0]
["Kyle Marino","VGK - C",0,1291,0]
["Ryan McGregor","Ari - C",0,1299,0]
["Juuso Parssinen","Nsh - C",0,1304,0]
["Reece Newkirk","NYI - C",0,1310,0]
["Maxim Marushev","VGK - C",0,1311,0]
["Theo Rochette","Phi - C",0,1316,0]
["Ty Glover","Pit - C",0,1318,0]
["Luke Philp","Chi - C",0,1319,0]
["Simon Ryfors","TB - C",0,1320,0]
["Joshua Lopina","Anh - C",0,1322,0]
["Semyon Der-Arguchintsev","Tor - C",0,1323,0]
["Shane Gersich","Was - C,LW",0,1330,0]
["Jake Karabela","Was - C",0,1332,0]
["Boo Nieves","TB - C,LW",0,1338,0]
["Kyle Jackson","Sea - C",0,1340,0]
["Oskar Back","Dal - C",0,1344,0]
["Nikita Alexandrov","StL - C",0,1347,0]
["Callahan Burke","Col - C",0,1350,0]
["Jordan Gustafson","VGK - C",0,1351,0]
["Ridly Greig","Ott - C",0,1355,0]
["Braeden Kressler","Tor - C",0,1356,0]
["Matthew Wedman","Ott - C",0,1360,0]
["David Goyette","Sea - C",0,1361,0]
["Zack Bolduc","StL - C",0,1362,0]
["Evan Vierling","Cls - C",0,1363,0]
["Jacob Doty","LA - C",0,1368,0]
["Matyas Sapovaliv","VGK - C",0,1370,0]
["Samuel Asselin","Bos - C",0,1371,0]
["Rory Kerins","Cgy - C",0,1375,0]
["Nathan Todd","StL - C",0,1380,0]
["Josh Pillar","Min - C",0,1382,0]
["Felix Robert","TB - C",0,1383,0]
["Drew Worrad","Det - C",0,1387,0]
["Ryan Suzuki","Car - C",0,1388,0]
["Justin Scott","Col - C,RW",0,1391,0]
["Dylan Holloway","Edm - C",57,1396,19]
["Curtis Hall","Bos - C",0,1397,0]
["Spencer Foo","VGK - C,RW",0,1405,0]
["Anthony Richard","Mon - C",0,1408,0]
["Ivan Telegin","Wpg - C",0,1415,0]
["Jakub Demek","VGK - C",0,1416,0]
["Matej Pekar","Buf - C",0,1422,0]
["Joseph Blandisi","Tor - C,LW",0,1426,0]
["Cal O'Reilly","Phi - C",0,1427,0]
["Logan Morrison","Dal - C",0,1429,0]
["Jeff Kubiak","NYI - C",0,1432,0]
["Jalen Luypen","Chi - C",0,1434,0]
["Ryan Lohin","NYR - C",0,1437,0]
["Philippe Daoust","Ott - C",0,1439,0]
["Jake Chiasson","Edm - C",0,1443,0]
["Mikhail Abramov","Tor - C",0,1447,0]
["Nick Jones","Wpg - C",0,1453,0]
["Conor Geekie","Ari - C",0,1454,0]
["Jamieson Rees","Car - C",0,1458,0]
["Joseph Gambardella","NJ - C,LW",0,1469,0]
["Tim Schaller","Nsh - C,LW",0,1471,0]
["Odeen Tufto","TB - C",0,1472,0]
["Sam Houde","Pit - C",0,1473,0]
["Tye Kartye","Sea - C",0,1476,0]
["Mathias Emilio Pettersen","Cgy - C",0,1479,0]
["Lukas Svejkovsky","Pit - C,RW",0,1485,0]
["Henry Bowlby","Fla - C",0,1486,0]
["Patrick Khodorenko","NYR - C",0,1487,0]
["Brett Kemp","LA - C",0,1489,0]
["German Rubtsov","Fla - C",0,1495,0]
["Roni Hirvonen","Tor - C",0,1498,0]
["Tyler Madden","LA - C",0,1499,0]
["Dylan McLaughlin","StL - C",0,1501,0]
["Tanner Fritz","NYR - C",0,1505,0]
["Owen Beck","Mon - C",0,1514,0]
["Jake Gaudet","Cls - C",0,1515,0]
["Sammy Walker","Min - C",0,1517,0]
["Jakub Lauko","Bos - C",0,1519,0]
["Francesco Pinelli","LA - C",0,1522,0]
["Tristen Nielsen","Van - C",0,1526,0]
["Matt Marcinew","Cgy - C",0,1532,0]
["Patrick Giles","Fla - C",0,1534,0]
["Jiri Kulich","Buf - C",0,1536,0]
["Wyatt Johnston","Dal - C",0,1544,0]
["Paul Ludwinski","Chi - C",0,1549,0]
["Evan Barratt","Chi - C",0,1550,0]
["Brandon Gignac","Mon - C",0,1553,0]
["Liam Arnsby","Fla - C",0,1554,0]
["Julien Anctil","Det - C",0,1556,0]
["Seamus Malone","Chi - C",0,1560,0]
["Cole Bardreau","NYI - C",0,1566,0]
["Matthew Poitras","Bos - C",0,1570,0]
["Pontus Andreasson","Det - C",0,1573,0]
["Jordy Bellerive","Phi - C",0,1578,0]
["Samuel Helenius","LA - C",0,1579,0]
["Adam Edstrom","NYR - C",0,1582,0]
["Brett Stapley","Mon - C",0,1603,0]
["Ryan Winterton","Sea - C",0,1611,0]
["Andrei Buyalsky","Col - C",0,1612,0]
["Justin Robidas","Car - C",0,1616,0]
["Gabriel Dumont","TB - C,RW",0,1618,0]
["Akil Thomas","LA - C",0,1619,0]
["Mikael Huchette","Phi - C",0,1620,0]
["Logan Stankoven","Dal - C",0,1621,0]
["Danil Zhilkin","Wpg - C",0,1623,0]
["Calder Brooks","Cgy - C",0,1624,0]
["Tanner Dickinson","StL - C",0,1629,0]
["Riley Fiddler-Schultz","LA - C",0,1633,0]
["Cole Huckins","Cgy - C",0,1636,0]
["Colton Dach","Chi - C",0,1640,0]
["Jakub Brabenec","VGK - C",0,1647,0]
["Gage Goncalves","TB - C",0,1655,0]
["Riley Kidney","Mon - C",0,1657,0]
["Ivan Morozov","VGK - C",0,1664,0]
["Marco Kasper","Det - C",0,1669,0]
["Servac Petrovsky","Min - C",0,1676,0]
["Tyler Angle","Cls - C",0,1678,0]
["Carson Focht","Van - C",0,1682,0]
["John Beecher","Bos - C",0,1686,0]
["Brendan Brisson","VGK - C",0,1689,0]
["Caedan Bankier","Min - C",0,1690,0]
["Amadeus Lombardi","Det - C",0,1691,0]
["Tanner Kaspick","Min - C",0,1693,0]
["Shane Bowers","Col - C",0,1697,0]
["Gustav Rydahl","NYR - C",0,1701,0]
["Vasily Ponomarev","Car - C",0,1705,0]
["Ben King","Anh - C",0,1707,0]
["Alexander Khovanov","Min - C",0,1709,0]
["Aatu Raty","NYI - C",0,1711,0]
["Ville Petman","Sea - C",0,1714,0]
["Damien Giroux","Min - C",0,1715,0]
["Jordan Kawaguchi","Dal - C",0,1720,0]
["Tyson Kozak","Buf - C",0,1721,0]
["Noah Ostlund","Buf - C",0,1724,0]
["Jared Davidson","Mon - C",0,1725,0]
["Jonathan Gruden","Pit - C",0,1727,0]
["Aarne Talvitie","NJ - C",0,1728,0]
["Ryan Fitzgerald","Phi - C",0,1730,0]
["Martin Pospisil","Cgy - C",0,1744,0]
["Chaz Lucius","Wpg - C",0,1752,0]
["Peter Abbandonato","Mon - C",0,1756,0]
["Charlie Gerard","Phi - C",0,1761,0]
["Ilya Nikolaev","Cgy - C",0,1762,0]
["Bobby McMann","Tor - C",0,1764,0]
["Bear Hughes","Was - C",0,1769,0]
["Nate Schnarr","Mon - C",0,1770,0]
["Brian Flynn","NJ - C,RW",0,1773,0]
["Blake Murray","Car - C",0,1775,0]
["Liam Kirk","Ari - C",0,1776,0]
["Jake Uberti","Det - C",0,1777,0]
["Mason Jobst","Buf - C",0,1778,0]
["Mitch McLain","Cgy - C",0,1781,0]
["Jacob Mathieu","Det - C",0,1786,0]
["Garrett Van Whye","NJ - C",0,1792,0]
["Fraser Minten","Tor - C",0,1794,0]
["Bryce McConnell-Barker","NYR - C",0,1798,0]
["Jack Finley","TB - C",0,1802,0]
["Patrick Guay","VGK - C",0,1804,0]
["Brad Lambert","Wpg - C",0,1811,0]
["Jan Mysak","Mon - C",0,1814,0]
["Luke Henman","Sea - C",0,1821,0]
["Tyson Foerster","Phi - C",0,1822,0]
["Dalyn Wakely","Ott - C",0,1823,0]
["Gage Quinney","VGK - C",0,1826,0]
["Max McCue","SJ - C",0,1829,0]
["Cole Fonstad","Cls - C",0,1830,0]
["Ryder Korczak","NYR - C",0,1832,0]
["Dominic Turgeon","Min - C",0,1836,0]
["Raphael Lavoie","Edm - C",0,1839,0]
["Tucker Robertson","Sea - C",0,1840,0]
["Matt Rempe","NYR - C",0,1841,0]
["Francesco Arcuri","Dal - C",0,1843,0]
["Curtis Douglas","Tor - C",0,1846,0]
["Ruslan Iskhakov","NYI - C",0,1847,0]
["Alan Quine","LA - C,LW",0,1848,0]
["Jean-Luc Foudy","Col - C",0,1850,0]
["Brent Gates","Anh - C",0,1857,0]
["John Stevens","Van - C",0,1861,0]
["Xavier Bourgault","Edm - C",0,1864,0]
["Liam Hawel","Cls - C",0,1867,0]
["Ivan Ivan","Det - C",0,1869,0]
["Aidan Dudas","LA - C",0,1870,0]
["Marcus Limpar-Lantz","Det - C",0,1872,0]
["Sakari Manninen","VGK - C",0,1876,0]
["Zach Dean","VGK - C",0,1878,0]
["Brett Harrison","Bos - C",0,1883,0]
["Linus Karlsson","Van - C",0,1890,0]
["Mason Primeau","VGK - C",0,1891,0]
["Denis Malgin","Tor - C,RW",58,1892,21]
["Carson Gicewicz","Chi - C",0,1895,0]
["Tyler Sikura","Cls - C",0,1901,0]
["Cooper Walker","Cgy - C",0,1902,0]
["Nolan Stevens","NJ - C",0,1910,0]
["Hunter Haight","Min - C",0,1923,0]
["Zack Ostapchuk","Ott - C",0,1938,0]
["Jayden Grubbe","NYR - C",0,1941,0]
["Dmitry Ovchinnikov","Tor - C",0,1944,0]
["Cole Maier","Wpg - C",0,1948,0]
["Wyatt Bongiovanni","Wpg - C",0,1951,0]
["Matt Savoie","Buf - C",0,1953,0]
["Mavrik Bourque","Dal - C",0,1956,0]
["Keean Washkurak","StL - C",0,1960,0]
["Joseph LaBate","Car - C,LW",0,1963,0]
["Benjamin Tardif","Col - C",0,1969,0]
["Haakon Hanelt","Was - C",0,1981,0]
["Karl Henriksson","NYR - C",0,1987,0]
["Rourke Chartier","Ott - C",0,1989,0]
["Jacob Gaucher","Phi - C",0,1990,0]
["Connor Zary","Cgy - C",0,1991,0]
["Jimmy Huntington","Nsh - C",0,1992,0]
["Jordan Frasca","Pit - C",0,1993,0]
["Henri Nikkanen","Wpg - C",0,1997,0]
["J.R. Avon","Phi - C",0,2009,0]
["Filip Hallander","Pit - C",1,2028,0]
["Cedric Lacroix","Det - C",0,2038,0]
["Colt Conrad","VGK - C",0,2039,0]
["Sam Hentges","Min - C",0,2040,0]
["Sam Anas","Was - C",0,2043,0]
["Mike Vecchione","Was - C,RW",0,2054,0]
["Jean-Sebastien Dea","Ari - C,RW",0,2055,0]
["Michael Chaput","Pit - C,RW",0,2058,0]
["David Gustafsson","Wpg - C",39,2059,0]
["Brian Pinho","NJ - C",0,2060,0]
["Blake Speers","Ari - C,RW",2,2074,0]
["Lukas Reichel","Chi - C,LW",58,2075,26]

{"sheet":"Left Wing","index":4,"n_rows":515,"n_cols":5,"rows_kept":515}
["Player","Team","GP","O-Rank","Points"]
["Leon Draisaitl","Edm - C,LW",82,2,116]
["Kirill Kaprizov","Min - LW",81,6,106]
["Jonathan Huberdeau","Cgy - LW",80,11,104]
["Alex Ovechkin","Was - LW",77,12,87]
["Johnny Gaudreau","Cls - LW",82,18,101]
["Steven Stamkos","TB - C,LW",75,20,98]
["J.T. Miller","Van - C,LW",79,22,91]
["Artemi Panarin","NYR - LW",74,23,98]
["Chris Kreider","NYR - LW,RW",78,24,62]
["Kyle Connor","Wpg - LW",78,26,89]
["Jake Guentzel","Pit - LW",73,29,79]
["Brady Tkachuk","Ott - LW",80,30,70]
["Gabriel Landeskog","Col - C,LW",69,31,73]
["Timo Meier","SJ - LW,RW",79,33,74]
["Andrei Svechnikov","Car - LW",78,35,71]
["Alex DeBrincat","Ott - LW",80,36,75]
["Jason Robertson","Dal - LW",74,40,75]
["Elias Pettersson","Van - C,LW",78,47,69]
["Filip Forsberg","Nsh - LW",70,52,77]
["Nikolaj Ehlers","Wpg - LW,RW",66,55,59]
["Kevin Fiala","LA - LW,RW",79,57,78]
["William Nylander","Tor - LW,RW",79,61,76]
["Pavel Buchnevich","StL - LW,RW",77,62,75]
["Evander Kane","Edm - LW",75,77,70]
["Tim Stuetzle","Ott - C,LW",79,84,62]
["Teuvo Teravainen","Car - LW,RW",76,85,63]
["Patrik Laine","Cls - LW,RW",74,93,72]
["Brayden Schenn","StL - C,LW",69,95,52]
["Jordan Kyrou","StL - LW,RW",75,100,74]
["Matt Boldy","Min - LW,RW",77,107,58]
["Jonathan Marchessault","VGK - LW,RW",78,113,63]
["Zach Hyman","Edm - LW,RW",71,114,54]
["Cole Caufield","Mon - LW,RW",75,123,52]
["Clayton Keller","Ari - LW,RW",76,125,67]
["Ryan Nugent-Hopkins","Edm - C,LW",72,127,61]
["Michael Bunting","Tor - LW",77,142,65]
["Vasily Podkolzin","Van - LW,RW",79,143,30]
["Jakub Vrana","Det - LW",70,144,50]
["Seth Jarvis","Car - LW,RW",72,150,42]
["Valeri Nichushkin","Col - LW,RW",71,153,49]
["Ondrej Palat","NJ - LW",77,155,52]
["Taylor Hall","Bos - LW",77,161,56]
["Adrian Kempe","LA - LW,RW",80,162,45]
["Carter Verhaeghe","Fla - LW",74,166,52]
["Tyler Toffoli","Cgy - LW,RW",74,170,53]
["Juraj Slafkovsky","Mon - LW",0,174,0]
["Ivan Barbashev","StL - C,LW",76,179,44]
["Brad Marchand","Bos - LW",60,180,72]
["Erik Haula","NJ - C,LW",75,182,35]
["Andrew Mangiapane","Cgy - LW,RW",81,188,56]
["Viktor Arvidsson","LA - LW,RW",64,189,46]
["Jeff Skinner","Buf - LW",80,190,52]
["Arthur Kaliyev","LA - LW,RW",71,192,26]
["Tyler Bertuzzi","Det - LW,RW",64,200,57]
["Anders Lee","NYI - LW",77,202,52]
["Anthony Mantha","Was - LW,RW",64,211,42]
["Andre Burakovsky","Sea - LW,RW",80,212,56]
["Alex Formenton","Ott - LW",77,214,29]
["Connor McMichael","Was - C,LW",72,217,44]
["William Eklund","SJ - LW",77,219,38]
["Jake DeBrusk","Bos - LW,RW",74,227,39]
["Frank Vatrano","Anh - LW,RW",77,228,36]
["Alex Killorn","TB - LW,RW",82,231,55]
["Artturi Lehkonen","Col - LW,RW",75,232,37]
["Jared McCann","Sea - C,LW",74,235,48]
["Peyton Krebs","Buf - C,LW",74,237,32]
["Trevor Moore","LA - LW,RW",82,238,46]
["Yegor Sharangovich","NJ - C,LW",78,240,49]
["Kent Johnson","Cls - LW",71,241,52]
["Lawson Crouse","Ari - LW,RW",71,246,33]
["Max Pacioretty","Car - LW",25,247,20]
["Nino Niederreiter","Nsh - LW",77,253,45]
["Marcus Foligno","Min - LW,RW",70,254,34]
["Blake Coleman","Cgy - LW,RW",80,256,33]
["Jamie Benn","Dal - C,LW",80,259,48]
["Conor Garland","Van - LW,RW",77,260,55]
["Rickard Rakell","Pit - LW,RW",71,279,56]
["Jakub Voracek","Cls - LW,RW",79,281,62]
["Evan Rodrigues","Col - LW,RW",75,282,37]
["Mason Marchment","Dal - LW,RW",68,293,43]
["Anthony Cirelli","TB - C,LW",68,295,38]
["Alex Iafallo","LA - LW",80,296,38]
["Brandon Saad","StL - LW",75,298,44]
["Jordan Greenway","Min - LW",74,300,35]
["Ross Colton","TB - C,LW",77,418,37]
["Paul Stastny","Car - C,LW",72,422,45]
["Evgenii Dadonov","Mon - LW,RW",80,427,46]
["Dominik Kubalik","Det - LW,RW",78,428,38]
["Alexander Kerfoot","Tor - LW,RW",81,441,49]
["Pat Maroon","TB - LW",79,445,25]
["Barclay Goodrow","NYR - C,LW",71,451,26]
["Eeli Tolvanen","Nsh - LW",75,459,27]
["Yakov Trenin","Nsh - LW",76,461,22]
["Denis Gurianov","Dal - LW,RW",77,462,39]
["Ilya Mikheyev","Van - LW,RW",70,468,35]
["Tanner Pearson","Van - LW",76,471,37]
["William Karlsson","VGK - C,LW",75,478,43]
["James van Riemsdyk","Phi - LW,RW",81,485,40]
["Luke Kunin","SJ - LW,RW",76,490,24]
["Anthony Beauvillier","NYI - LW,RW",74,492,38]
["Pierre Engvall","Tor - LW,RW",73,496,32]
["Scott Laughton","Phi - C,LW",67,498,27]
["Zach Aston-Reese","Tor - LW,RW",47,500,12]
["Nick Paul","TB - C,LW",80,501,34]
["Dillon Dube","Cgy - LW,RW",78,503,36]
["Mike Hoffman","Mon - LW,RW",73,505,44]
["Pavel Zacha","Bos - C,LW",71,507,32]
["Milan Lucic","Cgy - LW",71,510,19]
["Adam Henrique","Anh - C,LW",65,512,41]
["Conor Sheary","Was - LW,RW",75,514,35]
["William Carrier","VGK - LW",65,515,17]
["Joel Farabee","Phi - C,LW",66,523,38]
["Zach Parise","NYI - LW,RW",73,524,32]
["Warren Foegele","Edm - LW",81,526,26]
["Nick Ritchie","Ari - LW",68,529,25]
["Brandon Hagel","TB - LW,RW",77,535,38]
["Josh Bailey","NYI - LW,RW",75,536,46]
["Danton Heinen","Pit - LW,RW",73,540,27]
["Mathieu Joseph","Ott - LW,RW",76,542,34]
["Alexis Lafreniere","NYR - LW,RW",80,546,50]
["Nicolas Deslauriers","Phi - LW",72,549,12]
["Nicolas","Tor - LW,RW",65,556,21]
["Ryan Donato","Sea - LW",58,568,24]
["Matt Martin","NYI - LW",67,574,9]
["Max Domi","Chi - LW,RW",73,577,35]
["Tomas Tatar","NJ - LW,RW",77,578,33]
["Jesperi Kotkaniemi","Car - C,LW",74,581,33]
["Eric Robinson","Cls - LW",67,586,23]
["Andreas Johnsson","NJ - LW,RW",73,589,32]
["Gustav Nyquist","Cls - LW,RW",81,592,53]
["Logan O'Connor","Col - LW,RW",77,593,27]
["Zach Sanford","Nsh - LW,RW",77,599,23]
["Nick Foligno","Bos - LW,RW",69,602,21]
["Daniel Sprong","Sea - LW,RW",37,605,14]
["Robby Fabbri","Det - LW,RW",49,607,26]
["Michael Rasmussen","Det - C,LW",77,611,24]
["Vladislav Namestnikov","TB - C,LW",75,615,28]
["Alex Newhook","Col - C,LW",64,617,30]
["Rudolfs Balcers","Fla - LW,RW",65,618,24]
["Adam Erne","Det - LW,RW",58,622,15]
["Alexander Barabanov","SJ - LW,RW",75,623,42]
["Filip Zadina","Det - LW,RW",74,624,27]
["Carl Grundstrom","LA - LW",39,627,11]
["Trent Frederic","Bos - C,LW",66,629,22]
["Nico Sturm","SJ - C,LW",75,638,18]
["Tyler Motte","Ott - LW,RW",39,639,10]
["Nils Hoglander","Van - LW,RW",75,640,29]
["Noah Gregor","SJ - LW,RW",45,641,17]
["Brock McGinn","Pit - LW,RW",63,642,22]
["Ryan Lomberg","Fla - LW",61,644,16]
["Brandon Duhaime","Min - LW,RW",71,647,17]
["Oskar Lindblom","SJ - LW",78,649,28]
["Derek Grant","Anh - LW,RW",72,651,23]
["Nick Cousins","Fla - LW",56,652,18]
["Brandon Tanev","Sea - LW,RW",58,653,21]
["Max Comtois","Anh - LW",62,654,26]
["Tyson Jost","Min - C,LW",69,656,20]
["Wayne Simmonds","Tor - LW,RW",69,658,13]
["Derick Brassard","Ott - C,LW",39,660,16]
["Nick Bonino","SJ - C,LW",79,661,30]
["Dryden Hunt","NYR - LW,RW",75,663,15]
["Joel Armia","Mon - LW,RW",65,664,21]
["Jason Zucker","Pit - LW",68,669,32]
["Taylor Raddysh","Chi - LW,RW",79,671,29]
["Rasmus Asplund","Buf - LW,RW",75,676,27]
["Mattias Janmark","Edm - LW,RW",68,682,22]
["Brendan Lemieux","LA - LW",45,683,11]
["Darren Helm","Col - C,LW",67,688,14]
["Jaden Schwartz","Sea - LW",67,689,44]
["Tyler Ennis","Ott - LW,RW",57,691,24]
["Kieffer Bellows","NYI - LW,RW",40,696,21]
["Sonny Milano","Cgy - LW,RW",47,698,25]
["Jordan Martinook","Car - LW,RW",62,699,14]
["Michael Raffl","Dal - LW",73,704,17]
["Brian Boyle","Pit - C,LW",62,705,20]
["Kevin Rooney","Cgy - C,LW",29,706,6]
["Jason Dickinson","Van - C,LW",65,710,16]
["Marcus Johansson","Was - LW,RW",66,712,26]
["Evgeny Svechnikov","SJ - LW,RW",42,720,11]
["Carl Hagelin","Was - LW",58,722,16]
["Alex Galchenyuk","Col - C,LW",58,725,22]
["Victor Rask","Cls - C,LW",38,727,17]
["Andreas Athanasiou","Chi - LW,RW",62,730,38]
["Johan Larsson","Was - C,LW",49,732,21]
["Andrew Cogliano","Col - LW",78,745,16]
["Brett Howden","VGK - C,LW",61,746,20]
["Steven Lorentz","SJ - LW,RW",69,748,11]
["Zemgus Girgensons","Buf - C,LW",54,749,16]
["Jonathan Drouin","Mon - LW",68,750,42]
["Philipp Kurashev","Chi - LW,RW",77,751,28]
["Adam Gaudette","Tor - LW,RW",42,753,10]
["Vinnie Hinostroza","Buf - LW,RW",49,754,21]
["Rem Pitlick","Mon - LW,RW",48,756,21]
["Chris Tierney","Fla - C,LW",58,772,22]
["Ryan McLeod","Edm - C,LW",73,774,24]
["Dominik Simon","Anh - LW,RW",62,777,13]
["Joe Veleno","Det - C,LW",37,779,10]
["Jimmy Vesey","NYR - LW,RW",52,780,11]
["Michael Pezzetta","Mon - LW",34,782,8]
["Alexandre Texier","Cls - LW,RW",0,783,0]
["Parker Kelly","Ott - LW,RW",58,784,14]
["Kevin Labanc","SJ - LW,RW",57,785,25]
["Matt Nieto","SJ - LW,RW",66,786,16]
["Mathieu Perreault","Mon - C,LW",36,790,13]
["Riley Sheahan","Buf - C,LW",42,791,11]
["Joel Kiviranta","Dal - LW,RW",60,792,9]
["Janne Kuokkanen","NJ - LW,RW",0,796,0]
["Dominic Toninato","Wpg - C,LW",51,800,9]
["Noel Acciari","StL - C,LW",57,802,20]
["Jujhar Khaira","Chi - LW,RW",32,804,5]
["Liam O'Brien","Ari - LW,RW",21,806,2]
["Matthew Highmore","StL - LW,RW",42,807,10]
["Boris Katchouk","Chi - LW",57,810,9]
["Sam Steel","Min - C,LW",57,811,18]
["Karson Kuhlman","Sea - LW,RW",17,812,5]
["Paul Byron","Mon - LW,RW",24,813,8]
["Jacob Peterson","Dal - C,LW",72,815,22]
["Kurtis MacDermid","Col - LW,D",28,819,4]
["Devin Shore","Edm - C,LW",30,820,9]
["Jonathan Dahlen","SJ - LW,RW",61,821,22]
["Tyler Johnson","Chi - LW,RW",48,827,16]
["Emil Bemstrom","Cls - LW,RW",42,828,11]
["Morgan Frost","Phi - C,LW",68,830,20]
["Dakota Joshua","Van - C,LW",34,836,8]
["Gerry Mayhew","Fla - LW,RW",42,840,7]
["Givani Smith","Det - LW",28,841,4]
["Jansen Harkins","Wpg - LW,RW",64,842,11]
["Antoine Roussel","Phi - LW",47,845,9]
["Nathan Walker","StL - LW,RW",33,846,8]
["Joe Thornton","Fla - C,LW",43,847,15]
["Sammy Blais","NYR - LW,RW",63,848,20]
["Klim Kostin","StL - LW,RW",53,853,12]
["Gabriel Vilardi","LA - LW,RW",40,856,13]
["Josh Archibald","Pit - LW,RW",43,859,10]
["Colton Sceviour","Edm - LW,RW",0,862,0]
["Anton Blidh","Col - LW,RW",31,863,8]
["Brad Richardson","Van - C,LW",43,866,9]
["Kyle Clifford","Tor - LW",39,871,7]
["Andrew Ladd","Ari - LW,RW",33,872,8]
["Yegor Chinakhov","Cls - LW,RW",24,878,5]
["Jeffrey Viel","SJ - LW,RW",0,879,0]
["Ross Johnston","NYI - LW,RW",25,880,4]
["Loui Eriksson","Ari - LW,RW",62,882,16]
["James Neal","Cls - LW,RW",22,883,7]
["Brendan Gaunce","Cls - C,LW",6,884,2]
["Jonah Gadjovich","SJ - LW,RW",9,893,2]
["Radim Zohorna","Cgy - LW",25,895,8]
["Miles Wood","NJ - LW",68,898,25]
["Aliaksei Protas","Was - C,LW",11,901,4]
["Connor Dewar","Min - C,LW",63,905,13]
["Drake Caggiula","Pit - LW,RW",47,909,16]
["Max Willman","Phi - LW",11,911,2]
["Noah Cates","Phi - LW",48,912,22]
["Laurent Dauphin","Ari - C,LW",30,916,8]
["Matt Luff","Det - LW,RW",8,918,2]
["Morgan Barron","Wpg - C,LW",74,923,17]
["Anders Bjork","Buf - LW",42,928,6]
["Blake Comeau","Dal - LW,RW",22,929,6]
["Alexei Toropchenko","StL - LW,RW",32,931,4]
["John Leonard","Nsh - LW,RW",25,936,7]
["Max Jones","Anh - LW",65,938,13]
["Mikhail Maltsev","Col - C,LW",46,941,6]
["Drew O'Connor","Pit - LW",41,945,10]
["Richard Panik","NYI - LW,RW",19,946,6]
["Mike Hardman","Chi - LW,RW",23,947,3]
["Josh Leivo","StL - LW,RW",23,950,9]
["Marian Studenic","Dal - LW,RW",45,956,9]
["Joe Snively","Was - LW",3,958,1]
["Brendan Perlini","Edm - LW,RW",26,961,4]
["Jonas Rondbjerg","VGK - LW,RW",15,962,3]
["Tanner Kero","Dal - LW",29,963,6]
["Michael Carcone","Ari - LW,RW",22,965,5]
["Rocco Grimaldi","Anh - LW,RW",21,967,6]
["MacKenzie MacEachern","Car - LW,RW",14,969,3]
["Axel Jonsson-Fjallby","Was - LW",14,973,2]
["Leo Komarov","NYI - LW,RW",13,976,3]
["Lias Andersson","LA - C,LW",8,981,2]
["Greg McKegg","Edm - C,LW",33,982,5]
["Phillip Di Giuseppe","Van - LW,RW",5,985,1]
["Henrik Borgstrom","Was - C,LW",19,986,4]
["Austin Wagner","LA - LW,RW",0,987,0]
["Justin Dowling","Van - LW",19,989,3]
["Chris Wagner","Bos - LW,RW",14,992,2]
["Bobby Ryan","Det - LW,RW",0,996,0]
["Brett Murray","Buf - LW",15,997,5]
["Isaac Ratcliffe","Phi - LW",17,999,7]
["Beck Malenstyn","Was - LW",4,1001,1]
["Tyler Benson","Edm - LW",34,1003,4]
["Nolan Foote","NJ - LW",5,1006,2]
["Dmitrij Jaskin","Ari - LW,RW",12,1007,1]
["Brett Connolly","Chi - LW,RW",21,1021,6]
["Mason McTavish","Anh - LW",76,1022,59]
["Mason Geertsen","NJ - LW,D",5,1027,0]
["A.J. Greer","Bos - LW",16,1035,3]
["Taro Hirose","Det - LW",5,1040,1]
["Sheldon Dries","Van - LW",4,1042,1]
["Nic Petan","Min - LW,RW",29,1044,3]
["Max McCormick","Sea - LW",5,1046,0]
["Gabriel Fortier","TB - LW",16,1055,3]
["Clark Bishop","Cgy - C,LW",29,1057,10]
["Artem Anisimov","Phi - C,LW",0,1065,0]
["Martin Frk","StL - LW,RW",7,1066,2]
["Michael Dal Colle","Ott - LW,RW",12,1068,2]
["Matias Maccelli","Ari - LW",32,1074,10]
["Brad Malone","Edm - C,LW",4,1075,1]
["Josiah Slavin","Chi - C,LW",25,1080,2]
["Nicholas Robertson","Tor - LW",52,1088,28]
["Jayce Hawryluk","Ott - LW,RW",0,1094,0]
["Rhett Gardner","Dal - C,LW",10,1097,1]
["Jake Neighbours","StL - LW",40,1104,13]
["Grigori Denisenko","Fla - LW",3,1110,1]
["Riley Tufte","Dal - LW",10,1112,2]
["Jayden Halbgewachs","SJ - LW",3,1119,1]
["Tim Gettinger","NYR - LW",14,1120,0]
["Nick Abruzzese","Tor - LW",12,1122,2]
["Andy Andreoff","NYI - LW",3,1123,0]
["Rafael Harvey-Pinard","Mon - LW",4,1127,0]
["Stefan Matteau","Col - LW,RW",0,1130,0]
["Dylan Sikura","Chi - LW,RW",11,1131,3]
["Matthew Peca","StL - C,LW",0,1141,0]
["Cole Smith","Nsh - LW",0,1143,0]
["Justin Bailey","Edm - LW,RW",12,1145,0]
["Lukas Vejdemo","Mon - LW",0,1148,0]
["Nathan Gerbe","Cls - LW,RW",0,1151,0]
["Jackson Cates","Phi - C,LW",6,1153,1]
["Bokondji Imama","Ari - LW",6,1159,0]
["Joseph Cramarossa","Min - C,LW",2,1160,1]
["Andrew Agozzino","SJ - C,LW",0,1171,0]
["Ben McCartney","Ari - LW",8,1174,2]
["Gemel Smith","TB - C,LW",8,1175,2]
["Adam Beckman","Min - LW",7,1193,2]
["Brandon Baddock","Min - LW",0,1196,0]
["Sampo Ranta","Col - LW",27,1202,8]
["Seth Griffith","Edm - C,LW",0,1206,0]
["Carsen Twarynski","Sea - LW",0,1209,0]
["Brett Seney","Chi - C,LW",5,1210,0]
["Alex Steeves","Tor - LW",8,1213,2]
["Zac Rinaldo","Cls - C,LW",0,1214,0]
["Cole Reinhardt","Ott - LW",9,1218,2]
["Jeff Malott","Wpg - LW",2,1219,0]
["C.J. Suess","SJ - LW",0,1223,0]
["Daniel Walcott","TB - LW",0,1226,0]
["Egor Sokolov","Ott - LW",9,1231,1]
["Brandon Biro","Buf - LW",12,1236,2]
["Samuel Fagemo","LA - LW",4,1242,0]
["Turner Elson","NYR - LW",0,1244,0]
["Sheldon Rempal","VGK - LW,RW",0,1248,0]
["Chris Terry","NYI - LW,RW",0,1251,0]
["Cross Hanas","Det - LW",0,1255,0]
["Luke Esposito","Edm - C,LW",0,1256,0]
["Pierre-Cedrick Labrie","TB - LW",0,1257,0]
["Erik Brown","NYI - LW",0,1264,0]
["Justin Kirkland","Anh - LW",0,1276,0]
["Danick Martel","Mon - LW",0,1280,0]
["Kenny Agostino","Tor - LW",0,1281,0]
["Emil Heineman","Mon - LW",0,1290,0]
["Cole Schneider","Nsh - LW",0,1294,0]
["Garrett Wilson","Phi - LW,RW",0,1295,0]
["Colin Theisen","Ari - LW",0,1305,0]
["Jaydon Dureau","TB - LW",0,1308,0]
["Michael Milne","Min - LW",0,1324,0]
["Brennan Othmann","NYR - LW",0,1325,0]
["Justin Nachbaur","LA - LW",0,1329,0]
["Shane Gersich","Was - C,LW",0,1330,0]
["Boo Nieves","TB - C,LW",0,1338,0]
["Eduards Tralmaks","Bos - LW",0,1339,0]
["Yauheni Aksiantsiuk","Dal - LW",0,1342,0]
["Georgii Merkulov","Bos - LW",0,1348,0]
["Maxim Golod","Anh - LW",0,1352,0]
["Jack Dugan","NJ - LW",0,1354,0]
["Dillon Hamaliuk","SJ - LW",0,1358,0]
["Timur Ibragimov","SJ - LW",0,1366,0]
["Tommy Apap","Nsh - LW",0,1372,0]
["Bobby Trivigno","NYR - LW",0,1384,0]
["Joel Teasdale","Mon - LW",0,1389,0]
["Michael Mersch","Buf - LW",0,1403,0]
["Kyle MacLean","NYI - LW",0,1404,0]
["Lucas Ciona","Cgy - LW",0,1407,0]
["Kai Schwindt","Fla - LW",0,1411,0]
["Zachary L'Heureux","Nsh - LW",0,1413,0]
["Gabriel Bourque","Mon - LW,RW",0,1419,0]
["Riley McKay","Chi - LW",0,1420,0]
["Filip Cederqvist","Buf - LW",0,1421,0]
["Joseph Blandisi","Tor - C,LW",0,1426,0]
["Brian Halonen","NJ - LW",0,1428,0]
["Joona Koppanen","Bos - LW",0,1430,0]
["Sam Laberge","NJ - LW",0,1431,0]
["Lucas Feuk","Cgy - LW",0,1449,0]
["Aleksandr Kisakov","Buf - LW",0,1460,0]
["Joseph Gambardella","NJ - C,LW",0,1469,0]
["Tim Schaller","Nsh - C,LW",0,1471,0]
["Bennett MacArthur","TB - LW",0,1475,0]
["Arshdeep Bains","Van - LW",0,1481,0]
["Julian Lutz","Ari - LW",0,1490,0]
["Anton Levtchi","Fla - LW",0,1494,0]
["Elliot Desnoyers","Phi - LW",0,1502,0]
["Cristiano DiGiacinto","NYR - LW",0,1504,0]
["Owen Sillinger","Cls - LW",0,1506,0]
["Rodion Amirov","Tor - LW",0,1507,0]
["Josh Davies","Fla - LW",0,1509,0]
["Conner Roulette","Dal - LW",0,1511,0]
["Lukas Sedlak","Col - LW,RW",0,1528,0]
["Brett Gallant","Cls - LW",0,1533,0]
["Sandis Vilmanis","Fla - LW",0,1538,0]
["Mark Liwiski","SJ - LW",0,1542,0]
["Vincent Arseneau","Van - LW",0,1547,0]
["Mike O'Leary","Min - LW",0,1548,0]
["Andre Lee","LA - LW",0,1563,0]
["Pavel Gogolev","Tor - LW",0,1564,0]
["Evan Boucher","Cgy - LW",0,1568,0]
["Jamie Devane","Pit - LW",0,1569,0]
["Ryan Wagner","Col - LW",0,1572,0]
["Ethan Keppen","Fla - LW",0,1574,0]
["Tyler Spezia","Det - LW",0,1583,0]
["Cole Koepke","TB - LW",0,1585,0]
["Matvey Petrov","Edm - LW",0,1587,0]
["Ben Boyd","Cls - LW",0,1590,0]
["Liam Ohgren","Min - LW",0,1591,0]
["Luke Toporowski","Bos - LW",0,1599,0]
["Ludwig Persson","Was - LW",0,1607,0]
["Michal Teply","Chi - LW",0,1609,0]
["Josh Filmon","NJ - LW",0,1617,0]
["Brennan Saulnier","Mon - LW",0,1625,0]
["Maxim Barbashev","NYR - LW",0,1628,0]
["Curtis McKenzie","Dal - LW",0,1630,0]
["Trenton Bliss","Det - LW",0,1635,0]
["Fredrik Olofsson","Dal - LW",0,1637,0]
["Justin Brazeau","Bos - LW",0,1646,0]
["Alex Gallant","Cgy - LW",0,1648,0]
["Connor Hvidston","Anh - LW",0,1653,0]
["Matthew Strome","Was - LW",0,1666,0]
["Mikael Pyyhtia","Cls - LW",0,1667,0]
["J.D. Greenway","Bos - LW",0,1688,0]
["Hugh McGing","StL - LW",0,1698,0]
["Reid Schaefer","Edm - LW",0,1706,0]
["Andrei Kuzmenko","Van - LW",76,1708,38]
["Pasquale Zito","Det - LW",0,1710,0]
["Cedrick Guindon","Mon - LW",0,1712,0]
["Samuel Savoie","Chi - LW",0,1718,0]
["Roman Ahcan","Cls - LW",0,1722,0]
["Joona Luoto","Cls - LW",0,1729,0]
["Daylan Kuefler","NYI - LW",0,1732,0]
["Cole Shepard","Van - LW",0,1733,0]
["Sam Poulin","Pit - LW",0,1735,0]
["Egor Afanasyev","Nsh - LW",0,1747,0]
["Will Cuylle","NYR - LW",0,1750,0]
["Roby Jarventie","Ott - LW",0,1757,0]
["Eric Alarie","LA - LW",0,1763,0]
["Blake McLaughlin","Anh - LW",0,1772,0]
["Alex Limoges","Wpg - LW",0,1774,0]
["Kirill Tyutyayev","Det - LW",0,1782,0]
["Arnaud Durandeau","NYI - LW",0,1788,0]
["Ilya Usau","TB - LW",0,1789,0]
["Jakob Pelletier","Cgy - LW",33,1797,16]
["Brett Sutter","Cgy - LW",0,1806,0]
["Gavin Hayes","Chi - LW",0,1807,0]
["Brayden Guy","StL - LW",0,1809,0]
["Adam Sykora","NYR - LW",0,1812,0]
["Blade Jenkins","NYI - LW",0,1820,0]
["Alex Nylander","Pit - LW,RW",0,1825,0]
["Lucas Condotta","Mon - LW",0,1834,0]
["Alan Quine","LA - C,LW",0,1848,0]
["Emile Poirier","Mon - LW",0,1851,0]
["Josh Passolt","Buf - LW",0,1852,0]
["Andrei Bakanov","StL - LW",0,1859,0]
["Ty Voit","Tor - LW",0,1866,0]
["Antonio Stranges","Dal - LW",0,1871,0]
["Linus Weissbach","Buf - LW",0,1874,0]
["Matt Alfaro","Van - LW",0,1879,0]
["Justin Ertel","Dal - LW",0,1881,0]
["Collin Adams","NYI - LW",0,1887,0]
["Tristan Mullin","Sea - LW",0,1888,0]
["Logan Nijhoff","Anh - LW",0,1903,0]
["Jermaine Loewen","VGK - LW",0,1906,0]
["Dalton Smith","Col - LW",0,1908,0]
["Parker Bell","Cgy - LW",0,1911,0]
["Sean Tschigerl","Anh - LW",0,1916,0]
["Alexander Suzdalev","Was - LW",0,1917,0]
["Peter Laviolette","Was - LW",0,1920,0]
["Alex Kile","Phi - LW",0,1922,0]
["Vladislav Firstov","Min - LW",0,1926,0]
["Charles Hudon","Col - LW,RW",0,1937,0]
["Carter Savoie","Edm - LW",0,1942,0]
["Grant Mismash","TB - LW",10,1945,1]
["Marcus Kallionkieli","VGK - LW",0,1954,0]
["Liam Gilmartin","SJ - LW",0,1957,0]
["Micheal Ferland","Van - LW,RW",0,1959,0]
["Joseph LaBate","Car - C,LW",0,1963,0]
["Navrin Mutter","Nsh - LW",0,1964,0]
["Kale Kessy","Was - LW",0,1966,0]
["Mitchell Martin","Det - LW",0,1980,0]
["Graham Slaggert","Tor - LW",0,1983,0]
["Josh Bloom","Buf - LW",0,1984,0]
["Angus Crookshank","Ott - LW",0,1986,0]
["Brendan Warren","Buf - LW",0,2000,0]
["James Malatesta","Cls - LW",0,2001,0]
["Tyler Savard","Phi - LW",0,2004,0]
["Kale Howarth","Chi - LW",0,2005,0]
["Joey Abate","Bos - LW",0,2011,0]
["Julian Napravnik","Was - LW",0,2013,0]
["James Hamblin","Edm - LW",0,2018,0]
["Danil Gushchin","SJ - LW",0,2020,0]
["Alex Swetlikoff","VGK - LW",0,2022,0]
["Jake Lucchini","Ott - LW",0,2032,0]
["Daniel Torgersson","Wpg - LW",0,2034,0]
["Mason Morelli","Was - LW",0,2041,0]
["Shawn Element","TB - LW",0,2049,0]
["Matt Filipe","Bos - LW",0,2050,0]
["Xavier Parent","NJ - LW",0,2052,0]
["C.J. Smith","NYR - LW",0,2061,0]
["Remi Elie","TB - LW",0,2062,0]
["Brayden Tracey","Anh - LW",11,2064,0]
["Pavel Dorofeyev","VGK - LW",0,2065,0]
["Lukas Reichel","Chi - C,LW",58,2075,26]

{"sheet":"Right Wing","index":5,"n_rows":485,"n_cols":5,"rows_kept":485}
["Player","Team","GP","O-Rank","Points"]
["Nikita Kucherov","TB - RW",72,7,106]
["Mikko Rantanen","Col - C,RW",76,8,93]
["Matthew Tkachuk","Fla - RW",82,16,95]
["Mitchell Marner","Tor - RW",74,17,99]
["Chris Kreider","NYR - LW,RW",78,24,62]
["David Pastrnak","Bos - RW",74,28,83]
["Timo Meier","SJ - LW,RW",79,33,74]
["Patrick Kane","Chi - RW",81,39,91]
["Claude Giroux","Ott - C,RW",78,45,69]
["Vladimir Tarasenko","StL - RW",76,49,79]
["Nikolaj Ehlers","Wpg - LW,RW",66,55,59]
["Kevin Fiala","LA - LW,RW",79,57,78]
["Sam Reinhart","Fla - C,RW",80,60,76]
["William Nylander","Tor - LW,RW",79,61,76]
["Pavel Buchnevich","StL - LW,RW",77,62,75]
["Mark Stone","VGK - RW",68,72,60]
["Drake Batherson","Ott - RW",76,76,61]
["Matt Duchene","Nsh - RW",77,78,72]
["Teuvo Teravainen","Car - LW,RW",76,85,63]
["Bryan Rust","Pit - RW",74,89,70]
["Mats Zuccarello","Min - RW",72,90,68]
["Joe Pavelski","Dal - C,RW",82,91,72]
["Patrik Laine","Cls - LW,RW",74,93,72]
["Brock Boeser","Van - RW",71,98,52]
["Jordan Kyrou","StL - LW,RW",75,100,74]
["Matt Boldy","Min - LW,RW",77,107,58]
["Jesper Bratt","NJ - RW",73,110,69]
["Jonathan Marchessault","VGK - LW,RW",78,113,63]
["Zach Hyman","Edm - LW,RW",71,114,54]
["Cole Caufield","Mon - LW,RW",75,123,52]
["Clayton Keller","Ari - LW,RW",76,125,67]
["Troy Terry","Anh - RW",74,126,62]
["Lucas Raymond","Det - RW",82,129,62]
["David Perron","Det - RW",75,132,59]
["Alex Tuch","Buf - RW",76,138,58]
["Vasily Podkolzin","Van - LW,RW",79,143,30]
["Seth Jarvis","Car - LW,RW",72,150,42]
["Valeri Nichushkin","Col - LW,RW",71,153,49]
["Blake Wheeler","Wpg - RW",68,157,64]
["Adrian Kempe","LA - LW,RW",80,162,45]
["Tanner Jeannot","Nsh - RW",80,167,37]
["Andrew Copp","Det - C,RW",72,169,51]
["Tyler Toffoli","Cgy - LW,RW",74,170,53]
["T.J. Oshie","Was - C,RW",66,183,42]
["Cam Atkinson","Phi - RW",76,184,48]
["Dawson Mercer","NJ - C,RW",82,185,48]
["Andrew Mangiapane","Cgy - LW,RW",81,188,56]
["Viktor Arvidsson","LA - LW,RW",64,189,46]
["Oliver Wahlstrom","NYI - RW",72,191,26]
["Arthur Kaliyev","LA - LW,RW",71,192,26]
["Filip Chytil","NYR - C,RW",69,197,26]
["Tyler Bertuzzi","Det - LW,RW",64,200,57]
["Tyler Seguin","Dal - C,RW",80,204,54]
["Nick Schmaltz","Ari - C,RW",73,206,61]
["Travis Konecny","Phi - RW",77,208,54]
["Anthony Duclair","Fla - RW",40,209,33]
["Anthony Mantha","Was - LW,RW",64,211,42]
["Andre Burakovsky","Sea - LW,RW",80,212,56]
["Philip Tomasino","Nsh - RW",79,215,35]
["Cole Perfetti","Wpg - C,RW",77,216,48]
["Kirby Dach","Mon - C,RW",71,218,32]
["Dylan Strome","Was - C,RW",71,221,51]
["Chandler Stephenson","VGK - C,RW",78,226,59]
["Jake DeBrusk","Bos - LW,RW",74,227,39]
["Frank Vatrano","Anh - LW,RW",77,228,36]
["Alex Killorn","TB - LW,RW",82,231,55]
["Artturi Lehkonen","Col - LW,RW",75,232,37]
["Oliver Bjorkstrand","Sea - RW",80,234,54]
["Trevor Moore","LA - LW,RW",82,238,46]
["Victor Olofsson","Buf - RW",77,243,55]
["Connor Brown","Was - RW",78,245,53]
["Lawson Crouse","Ari - LW,RW",71,246,33]
["Tom Wilson","Was - RW",52,249,33]
["Marcus Foligno","Min - LW,RW",70,254,34]
["Blake Coleman","Cgy - LW,RW",80,256,33]
["Conor Garland","Van - LW,RW",77,260,55]
["Garnet Hathaway","Was - RW",76,270,24]
["Jesse Puljujarvi","Edm - RW",73,272,34]
["Rickard Rakell","Pit - LW,RW",71,279,56]
["Craig Smith","Bos - RW",75,280,37]
["Jakub Voracek","Cls - LW,RW",79,281,62]
["Evan Rodrigues","Col - LW,RW",75,282,37]
["Martin Necas","Car - RW",63,289,36]
["Mason Marchment","Dal - LW,RW",68,293,43]
["Patric Hornqvist","Fla - RW",64,416,27]
["Evgenii Dadonov","Mon - LW,RW",80,427,46]
["Dominik Kubalik","Det - LW,RW",78,428,38]
["Corey Perry","TB - RW",74,430,33]
["Reilly Smith","VGK - RW",71,440,49]
["Alexander Kerfoot","Tor - LW,RW",81,441,49]
["Nicolas Roy","VGK - C,RW",77,456,37]
["Denis Gurianov","Dal - LW,RW",77,462,39]
["Kailer Yamamoto","Edm - RW",79,464,41]
["Phil Kessel","VGK - RW",82,466,53]
["Kasperi Kapanen","Pit - RW",75,467,33]
["Ilya Mikheyev","Van - LW,RW",70,468,35]
["Kyle Palmieri","NYI - RW",70,469,36]
["Dustin Brown","LA - RW",0,475,0]
["Josh Anderson","Mon - RW",74,476,30]
["Jesper Fast","Car - RW",77,481,32]
["James van Riemsdyk","Phi - LW,RW",81,485,40]
["Jordan Eberle","Sea - RW",79,486,46]
["Kyle Okposo","Buf - RW",63,487,28]
["Luke Kunin","SJ - LW,RW",76,490,24]
["Anthony Beauvillier","NYI - LW,RW",74,492,38]
["Pierre Engvall","Tor - LW,RW",73,496,32]
["Zach Aston-Reese","Tor - LW,RW",47,500,12]
["Dillon Dube","Cgy - LW,RW",78,503,36]
["Mike Hoffman","Mon - LW,RW",73,505,44]
["Keegan Kolesar","VGK - C,RW",74,511,25]
["Conor Sheary","Was - LW,RW",75,514,35]
["Zach Parise","NYI - LW,RW",73,524,32]
["Frederick Gaudreau","Min - C,RW",68,530,35]
["Brandon Hagel","TB - LW,RW",77,535,38]
["Josh Bailey","NYI - LW,RW",75,536,46]
["Danton Heinen","Pit - LW,RW",73,540,27]
["Mathieu Joseph","Ott - LW,RW",76,542,34]
["Alexis Lafreniere","NYR - LW,RW",80,546,50]
["Nathan Bastian","NJ - RW",70,550,16]
["Nicolas Aube-Kubel","Tor - LW,RW",65,556,21]
["Brendan Gallagher","Mon - RW",63,557,34]
["Cal Clutterbuck","NYI - RW",51,559,12]
["Trevor Lewis","Cgy - C,RW",45,569,8]
["Max Domi","Chi - LW,RW",73,577,35]
["Tomas Tatar","NJ - LW,RW",77,578,33]
["J.T. Compher","Col - C,RW",74,579,33]
["Owen Tippett","Phi - RW",74,584,26]
["Austin Watson","Ott - RW",47,585,12]
["Curtis Lazar","Van - C,RW",73,588,14]
["Andreas Johnsson","NJ - LW,RW",73,589,32]
["Alex Chiasson","Ari - RW",62,590,21]
["Gustav Nyquist","Cls - LW,RW",81,592,53]
["Logan O'Connor","Col - LW,RW",77,593,27]
["Zach Sanford","Nsh - LW,RW",77,599,23]
["Jake Evans","Mon - C,RW",56,600,22]
["Nick Foligno","Bos - LW,RW",69,602,21]
["Daniel Sprong","Sea - LW,RW",37,605,14]
["Robby Fabbri","Det - LW,RW",49,607,26]
["Calle Jarnkrok","Tor - C,RW",52,608,23]
["Ryan Reaves","NYR - RW",67,612,11]
["Luke Glendening","Dal - C,RW",80,614,16]
["Rudolfs Balcers","Fla - LW,RW",65,618,24]
["Adam Erne","Det - LW,RW",58,622,15]
["Alexander Barabanov","SJ - LW,RW",75,623,42]
["Filip Zadina","Det - LW,RW",74,624,27]
["Mason Appleton","Wpg - RW",66,631,23]
["Tyler Motte","Ott - LW,RW",39,639,10]
["Nils Hoglander","Van - LW,RW",75,640,29]
["Noah Gregor","SJ - LW,RW",45,641,17]
["Brock McGinn","Pit - LW,RW",63,642,22]
["Colin Blackwell","Chi - C,RW",73,646,27]
["Brandon Duhaime","Min - LW,RW",71,647,17]
["Sam Gagner","Wpg - RW",62,650,25]
["Derek Grant","Anh - LW,RW",72,651,23]
["Brandon Tanev","Sea - LW,RW",58,653,21]
["Wayne Simmonds","Tor - LW,RW",69,658,13]
["Zack Kassian","Ari - RW",61,659,20]
["Dryden Hunt","NYR - LW,RW",75,663,15]
["Joel Armia","Mon - LW,RW",65,664,21]
["Travis Boyd","Ari - C,RW",76,667,29]
["Ondrej Kase","Car - RW",59,668,33]
["Joonas Donskoi","Sea - RW",76,670,30]
["Taylor Raddysh","Chi - LW,RW",79,671,29]
["Rasmus Asplund","Buf - LW,RW",75,676,27]
["Nick Bjugstad","Ari - C,RW",48,678,11]
["Mattias Janmark","Edm - LW,RW",68,682,22]
["Tyler Ennis","Ott - LW,RW",57,691,24]
["Jakob Silfverberg","Anh - RW",60,693,25]
["Kieffer Bellows","NYI - LW,RW",40,696,21]
["Sonny Milano","Cgy - LW,RW",47,698,25]
["Jordan Martinook","Car - LW,RW",62,699,14]
["Oskar Sundqvist","Det - C,RW",46,702,14]
["Marcus Johansson","Was - LW,RW",66,712,26]
["Sam Carrick","Anh - C,RW",62,717,15]
["Evgeny Svechnikov","SJ - LW,RW",42,720,11]
["Kaapo Kakko","NYR - RW",66,724,26]
["Andreas Athanasiou","Chi - LW,RW",62,730,38]
["Ryan Carpenter","NYR - C,RW",43,731,8]
["Sam Lafferty","Chi - C,RW",75,737,17]
["Alexander Radulov","Dal - RW",0,740,0]
["Zack MacEwen","Phi - RW",73,741,10]
["Steven Lorentz","SJ - LW,RW",69,748,11]
["Philipp Kurashev","Chi - LW,RW",77,751,28]
["Adam Gaudette","Tor - LW,RW",42,753,10]
["Vinnie Hinostroza","Buf - LW,RW",49,754,21]
["Derek Stepan","Car - C,RW",27,755,10]
["Rem Pitlick","Mon - LW,RW",48,756,21]
["Christian Fischer","Ari - C,RW",63,757,14]
["Derek Ryan","Edm - C,RW",60,761,17]
["Dylan Gambrell","Ott - C,RW",52,764,8]
["Dominik Simon","Anh - LW,RW",62,777,13]
["Jimmy Vesey","NYR - LW,RW",52,780,11]
["Alexandre Texier","Cls - LW,RW",0,783,0]
["Parker Kelly","Ott - LW,RW",58,784,14]
["Kevin Labanc","SJ - LW,RW",57,785,25]
["Matt Nieto","SJ - LW,RW",66,786,16]
["Joel Kiviranta","Dal - LW,RW",60,792,9]
["Justin Danforth","Cls - C,RW",16,795,5]
["Janne Kuokkanen","NJ - LW,RW",0,796,0]
["Michael Amadio","VGK - C,RW",39,798,9]
["Julien Gauthier","NYR - RW",38,801,6]
["Jujhar Khaira","Chi - LW,RW",32,804,5]
["Colin White","Fla - C,RW",45,805,21]
["Liam O'Brien","Ari - LW,RW",21,806,2]
["Matthew Highmore","StL - LW,RW",42,807,10]
["Karson Kuhlman","Sea - LW,RW",17,812,5]
["Paul Byron","Mon - LW,RW",24,813,8]
["Mark Pysyk","Det - RW,D",41,814,7]
["John Hayden","Sea - RW",6,816,1]
["Brett Ritchie","Cgy - RW",41,817,5]
["Jonathan Dahlen","SJ - LW,RW",61,821,22]
["Tyler Johnson","Chi - LW,RW",48,827,16]
["Emil Bemstrom","Cls - LW,RW",42,828,11]
["Rasmus Kupari","LA - C,RW",60,829,15]
["MacKenzie Entwistle","Chi - C,RW",48,837,11]
["Gerry Mayhew","Fla - LW,RW",42,840,7]
["Jansen Harkins","Wpg - LW,RW",64,842,11]
["Tyler Pitlick","StL - RW",38,844,7]
["Nathan Walker","StL - LW,RW",33,846,8]
["Sammy Blais","NYR - LW,RW",63,848,20]
["Klim Kostin","StL - LW,RW",53,853,12]
["Gabriel Vilardi","LA - LW,RW",40,856,13]
["Reese Johnson","Chi - C,RW",44,858,7]
["Josh Archibald","Pit - LW,RW",43,859,10]
["Colton Sceviour","Edm - LW,RW",0,862,0]
["Anton Blidh","Col - LW,RW",31,863,8]
["Vinni Lettieri","Bos - RW",27,868,6]
["Andrew Ladd","Ari - LW,RW",33,872,8]
["Ryan Dzingel","Car - C,RW",38,876,14]
["Buddy Robinson","Chi - RW",27,877,5]
["Yegor Chinakhov","Cls - LW,RW",24,878,5]
["Jeffrey Viel","SJ - LW,RW",0,879,0]
["Ross Johnston","NYI - LW,RW",25,880,4]
["Loui Eriksson","Ari - LW,RW",62,882,16]
["James Neal","Cls - LW,RW",22,883,7]
["Nolan Patrick","VGK - C,RW",0,887,0]
["Riley Nash","Fla - C,RW",51,889,6]
["Jonah Gadjovich","SJ - LW,RW",9,893,2]
["Drake Caggiula","Pit - LW,RW",47,909,16]
["Fabian Zetterlund","NJ - RW",17,910,9]
["Logan Brown","StL - C,RW",48,917,14]
["Matt Luff","Det - LW,RW",8,918,2]
["Alexander Chmelevski","SJ - C,RW",0,922,0]
["Brett Leason","Was - RW",17,927,5]
["Blake Comeau","Dal - LW,RW",22,929,6]
["Alexei Toropchenko","StL - LW,RW",32,931,4]
["Carter Rowney","Det - C,RW",0,932,0]
["John Leonard","Nsh - LW,RW",25,936,7]
["Oskar Steen","Bos - C,RW",24,937,5]
["Alex Barre-Boulet","TB - C,RW",37,939,13]
["Scott Reedy","SJ - C,RW",6,942,2]
["Kole Lind","Sea - RW",7,944,3]
["Richard Panik","NYI - LW,RW",19,946,6]
["Mike Hardman","Chi - LW,RW",23,947,3]
["Josh Leivo","StL - LW,RW",23,950,9]
["Cody Glass","Nsh - C,RW",22,951,8]
["Marian Studenic","Dal - LW,RW",45,956,9]
["Adam Brooks","Phi - C,RW",29,957,6]
["Brendan Perlini","Edm - LW,RW",26,961,4]
["Jonas Rondbjerg","VGK - LW,RW",15,962,3]
["Michael Carcone","Ari - LW,RW",22,965,5]
["Kiefer Sherwood","Nsh - RW",18,966,4]
["Rocco Grimaldi","Anh - LW,RW",21,967,6]
["MacKenzie MacEachern","Car - LW,RW",14,969,3]
["Jayson Megna","Col - C,RW",23,972,3]
["Nick Merkley","NYR - C,RW",13,974,4]
["Leo Komarov","NYI - LW,RW",13,976,3]
["Austin Czarnik","Det - C,RW",4,977,2]
["Mathieu Olivier","Cls - RW",38,979,6]
["Jonny Brodzinski","NYR - C,RW",25,980,3]
["Phillip Di Giuseppe","Van - LW,RW",5,985,1]
["Austin Wagner","LA - LW,RW",0,987,0]
["Jake Virtanen","Edm - RW",0,991,0]
["Chris Wagner","Bos - LW,RW",14,992,2]
["Lane Pederson","Car - C,RW",18,995,4]
["Bobby Ryan","Det - LW,RW",0,996,0]
["Anthony Angello","StL - RW",8,1000,0]
["Dmitrij Jaskin","Ari - LW,RW",12,1007,1]
["Carson Meyer","Cls - RW",5,1010,1]
["Jan Jenik","Ari - RW",18,1015,6]
["William Lockwood","Van - RW",24,1017,3]
["Jesse Ylonen","Mon - RW",6,1018,2]
["Brett Connolly","Chi - LW,RW",21,1021,6]
["Kyle Turris","Edm - RW",29,1028,7]
["Brandon Sutter","Van - C,RW",0,1029,0]
["Ty Dellandrea","Dal - C,RW",35,1030,10]
["Kevin Stenlund","Wpg - C,RW",29,1034,7]
["Nic Petan","Min - LW,RW",29,1044,3]
["Marc McLaughlin","Bos - RW",0,1048,0]
["Bobby Brink","Phi - RW",16,1050,6]
["Jesper Froden","Sea - RW",0,1054,0]
["Wade Allison","Phi - RW",8,1056,2]
["Kristian Reichel","Wpg - C,RW",42,1059,10]
["Martin Frk","StL - LW,RW",7,1066,2]
["Michael Dal Colle","Ott - LW,RW",12,1068,2]
["Alex Belzile","Mon - RW",5,1069,0]
["Hayden Hodgson","Phi - RW",2,1071,1]
["Logan Shaw","Tor - C,RW",19,1072,3]
["Liam Foudy","Cls - C,RW",12,1085,2]
["Kurtis Gabriel","Chi - RW",4,1086,0]
["Austin Poganski","Sea - RW",0,1092,0]
["Jayce Hawryluk","Ott - LW,RW",0,1094,0]
["Nick Caamano","Dal - RW",0,1100,0]
["Jack Quinn","Buf - RW",71,1102,54]
["Scott Sabourin","Ott - RW",18,1106,3]
["Adam Raska","SJ - RW",5,1108,1]
["Trey Fix-Wolansky","Cls - RW",14,1117,3]
["Frederik Gauthier","NJ - C,RW",12,1124,2]
["Stefan Noesen","Car - RW",6,1128,2]
["Stefan Matteau","Col - LW,RW",0,1130,0]
["Dylan Sikura","Chi - LW,RW",11,1131,3]
["Kyle Rau","Min - C,RW",7,1133,0]
["Zac Dalpe","Fla - C,RW",0,1134,0]
["Martin Kaut","Col - RW",19,1135,4]
["Joey Anderson","Tor - RW",6,1138,0]
["Kole Sherwood","Nsh - RW",2,1139,0]
["Alexander Holtz","NJ - RW",6,1140,1]
["Justin Bailey","Edm - LW,RW",12,1145,0]
["Valtteri Puustinen","Pit - RW",1,1147,1]
["Vitali Kravtsov","NYR - RW",56,1150,16]
["Nathan Gerbe","Cls - LW,RW",0,1151,0]
["Ryan MacInnis","Buf - RW",6,1157,0]
["Mitchell Chaffee","Min - RW",1,1161,0]
["Joel L'Esperance","Det - C,RW",0,1166,0]
["Hudson Fasching","NYI - RW",5,1170,0]
["Zach Senyshyn","NJ - RW",4,1182,0]
["Byron Froese","VGK - C,RW",0,1184,0]
["Steven Fogarty","Min - C,RW",2,1186,0]
["Tyce Thompson","NJ - RW",4,1188,0]
["Hunter Drew","Anh - RW",0,1204,0]
["T.J. Tynan","LA - RW",0,1207,0]
["JJ Peterka","Buf - RW",16,1208,7]
["Bryce Kindopp","Anh - RW",9,1220,0]
["Linus Sandin","Phi - RW",0,1229,0]
["Luke Witkowski","StL - RW,D",0,1234,0]
["Riley Barber","Dal - RW",13,1245,1]
["Sheldon Rempal","VGK - LW,RW",0,1248,0]
["Chris Terry","NYI - LW,RW",0,1251,0]
["Adam Cracknell","Ari - C,RW",0,1253,0]
["Ozzy Wiesblatt","SJ - RW",0,1259,0]
["Sasha Pastujov","Anh - RW",0,1283,0]
["Simon Holmstrom","NYI - RW",0,1285,0]
["Garrett Wilson","Phi - LW,RW",0,1295,0]
["Dylan Guenther","Ari - RW",0,1296,0]
["Max Veronneau","SJ - RW",0,1298,0]
["Reece Vitelli","Ari - RW",0,1301,0]
["Kaleb Lawrence","LA - RW",0,1302,0]
["Alex Beaucage","Col - RW",0,1326,0]
["Alexander Pashin","Car - RW",0,1331,0]
["Dominik Shine","Det - RW",0,1333,0]
["Lauri Pajuniemi","NYR - RW",0,1336,0]
["Yushiro Hirano","Van - RW",0,1357,0]
["Lukas Rousek","Buf - RW",0,1359,0]
["Pavol Regenda","Anh - RW",0,1365,0]
["Samuel Huo","Cls - RW",0,1373,0]
["Alex Whelan","NYR - RW",0,1376,0]
["Isak Rosen","Buf - RW",0,1377,0]
["Nathan Legare","Pit - RW",0,1386,0]
["Justin Scott","Col - C,RW",0,1391,0]
["Pierrick Dube","Mon - RW",0,1393,0]
["Jakub Pour","Chi - RW",0,1394,0]
["Saku Maenalanen","Wpg - RW",0,1395,0]
["Logan Hutsko","Fla - RW",0,1398,0]
["Ryan Francis","Mon - RW",0,1399,0]
["Cameron Hausinger","Nsh - RW",0,1400,0]
["Spencer Foo","VGK - C,RW",0,1405,0]
["Henry Rybinski","Was - RW",0,1409,0]
["Jimmy Lambert","NYI - RW",0,1412,0]
["Adam Klapka","Cgy - RW",0,1417,0]
["Gabriel Bourque","Mon - LW,RW",0,1419,0]
["Taylor Ward","LA - RW",0,1425,0]
["Malte Stromwall","Car - RW",0,1433,0]
["Brandon Coe","SJ - RW",0,1440,0]
["Connor Ford","VGK - RW",0,1444,0]
["Pontus Holmberg","Tor - RW",0,1448,0]
["Stelio Mattheos","Car - RW",0,1459,0]
["Spencer Smallman","Col - RW",0,1464,0]
["Lucas Edmonds","TB - RW",0,1467,0]
["Will Bitten","StL - RW",0,1477,0]
["Anthony Beauregard","Mon - RW",0,1478,0]
["Tyler Tullio","Edm - RW",0,1482,0]
["Lukas Svejkovsky","Pit - C,RW",0,1485,0]
["Thomas Di Pauli","Pit - RW",0,1492,0]
["Jordan Dumais","Cls - RW",0,1496,0]
["Jack Beck","Cgy - RW",0,1500,0]
["David Gust","Chi - RW",0,1503,0]
["Matthew Seminoff","Dal - RW",0,1516,0]
["Fabrice Herzog","Tor - RW",0,1525,0]
["Lukas Sedlak","Col - LW,RW",0,1528,0]
["Ben Hemmerling","VGK - RW",0,1529,0]
["Bobby Orr","Car - RW",0,1530,0]
["Kyle McDonald","Ott - RW",0,1535,0]
["Zac Jordan","NYR - RW",0,1551,0]
["Kyle Olson","Pit - RW",0,1562,0]
["Riley Sutter","Was - RW",0,1565,0]
["Austin Rueschhoff","NYR - RW",0,1571,0]
["Karel Plasek","Van - RW",0,1575,0]
["Ethan Cardwell","SJ - RW",0,1584,0]
["Alex-Olivier Voyer","Bos - RW",0,1588,0]
["Raivis Ansons","Pit - RW",0,1594,0]
["Riley Piercey","Det - RW",0,1595,0]
["Michael Regush","Van - RW",0,1598,0]
["Tristen Robins","SJ - RW",0,1600,0]
["Matthew Maggio","NYI - RW",0,1604,0]
["Oskar Olausson","Col - RW",0,1615,0]
["Gabriel Dumont","TB - C,RW",0,1618,0]
["Jacob Melanson","Sea - RW",0,1632,0]
["Jonatan Berggren","Det - RW",0,1634,0]
["Max Ellis","Tor - RW",0,1638,0]
["Dmitry Osipov","Anh - RW,D",0,1641,0]
["Alexis Gendron","Phi - RW",0,1642,0]
["Maxim Cajkovic","TB - RW",0,1645,0]
["Morgan Adams-Moisan","Chi - RW",0,1658,0]
["Lynden McCallum","VGK - RW",0,1668,0]
["Dominik Bokk","Car - RW",0,1675,0]
["Ethen Frank","Was - RW",0,1683,0]
["Reid Valade","Ott - RW",0,1685,0]
["Chase Stillman","NJ - RW",0,1687,0]
["Graeme Clarke","NJ - RW",0,1703,0]
["Milos Kelemen","Ari - RW",0,1717,0]
["Kody Clark","Was - RW",0,1734,0]
["Todd Burgess","Nsh - RW",0,1736,0]
["Robbie Payne","Cls - RW",0,1737,0]
["Noel Gunler","Car - RW",0,1743,0]
["Easton Brodzinski","NYR - RW",0,1745,0]
["Bobby Lynch","Chi - RW",0,1748,0]
["Danila Klimovich","Van - RW",0,1749,0]
["Corey Andonovski","Pit - RW",0,1759,0]
["Martin Rysavy","Cls - RW",0,1760,0]
["Tuukka Tieksola","Car - RW",0,1765,0]
["Brian Flynn","NJ - C,RW",0,1773,0]
["Nikita Soshnikov","NYI - RW",0,1780,0]
["Dino Kambeitz","Edm - RW",0,1785,0]
["D.J. Busdeker","Chi - RW",0,1800,0]
["Joshua Roy","Mon - RW",0,1817,0]
["Alex Nylander","Pit - LW,RW",0,1825,0]
["Elmer Soderblom","Det - RW",0,1831,0]
["Matej Blumel","Dal - RW",0,1854,0]
["Ty Ronning","Min - RW",0,1856,0]
["Olle Lycksell","Phi - RW",0,1862,0]
["Garrett Mitchell","Chi - RW",0,1882,0]
["Luke Evangelista","Nsh - RW",0,1889,0]
["Denis Malgin","Tor - C,RW",58,1892,21]
["Sam Alfano","NYR - RW",0,1893,0]
["Tyler Boucher","Ott - RW",0,1897,0]
["Landon Sim","StL - RW",0,1899,0]
["Nick Swaney","Min - RW",0,1900,0]
["Ryan Hofer","Was - RW",0,1904,0]
["Jagger Firkus","Sea - RW",0,1905,0]
["James Stefan","LA - RW",0,1909,0]
["Zayde Wisdom","Phi - RW",0,1918,0]
["Kirill Marchenko","Cls - RW",29,1919,10]
["Filip Mesar","Mon - RW",0,1924,0]
["Samu Tuomaala","Phi - RW",0,1925,0]
["Pavel Novak","Min - RW",0,1927,0]
["Walker Duehr","Cgy - RW",0,1929,0]
["Bogdan Trineyev","Was - RW",0,1931,0]
["Charles Hudon","Col - LW,RW",0,1937,0]
["Justin Sourdif","Fla - RW",0,1939,0]
["Joakim Kemell","Nsh - RW",0,1949,0]
["Ville Koivunen","Car - RW",0,1950,0]
["Micheal Ferland","Van - LW,RW",0,1959,0]
["Carson Latimer","Ott - RW",0,1965,0]
["Daniel D'Amato","VGK - RW",0,1968,0]
["Olivier Nadeau","Buf - RW",0,1971,0]
["Mathias Laferriere","StL - RW",0,1982,0]
["Marc Gatcomb","Van - RW",0,1988,0]
["Evan Polei","Wpg - RW",0,1996,0]
["Martin Chromiak","LA - RW",0,1998,0]
["Markus Nurmi","Nsh - RW",0,2012,0]
["Kohen Olischefski","Buf - RW",0,2014,0]
["Mitchell Russell","SJ - RW",0,2021,0]
["Fabian Lysell","Bos - RW",0,2024,0]
["Andrei Altybarmakian","Chi - RW",0,2027,0]
["Tye McSorley","Phi - RW",0,2030,0]
["Serron Noel","Fla - RW",0,2031,0]
["Connor Lockhart","Van - RW",0,2035,0]
["William Dufour","NYI - RW",0,2051,0]
["Mike Vecchione","Was - C,RW",0,2054,0]
["Jean-Sebastien Dea","Ari - C,RW",0,2055,0]
["Michael Chaput","Pit - C,RW",0,2058,0]
["Jacob Perreault","Anh - RW",15,2068,0]
["Cole Schwindt","Cgy - RW",8,2073,1]
["Blake Speers","Ari - C,RW",2,2074,0]

{"sheet":"Defence","index":6,"n_rows":667,"n_cols":5,"rows_kept":667}
["Player","Team","GP","O-Rank","Points"]
["Cale Makar","Col - D",74,5,83]
["Victor Hedman","TB - D",79,14,77]
["Adam Fox","NYR - D",80,15,71]
["Roman Josi","Nsh - D",78,19,81]
["Aaron Ekblad","Fla - D",68,32,60]
["John Carlson","Was - D",78,37,70]
["Moritz Seider","Det - D",82,44,58]
["Quinn Hughes","Van - D",78,48,69]
["Morgan Rielly","Tor - D",79,53,64]
["Devon Toews","Col - D",76,69,54]
["Kris Letang","Pit - D",77,71,67]
["Drew Doughty","LA - D",76,75,52]
["Rasmus Dahlin","Buf - D",80,81,56]
["MacKenzie Weegar","Cgy - D",80,83,39]
["Shea Theodore","VGK - D",78,86,52]
["Alex Pietrangelo","VGK - D",79,87,46]
["Noah Dobson","NYI - D",76,96,52]
["Zach Werenski","Cls - D",68,101,48]
["Miro Heiskanen","Dal - D",80,104,50]
["Torey Krug","StL - D",71,105,45]
["Dougie Hamilton","NJ - D",74,108,43]
["Brent Burns","Car - D",82,112,57]
["Owen Power","Buf - D",78,117,40]
["Evan Bouchard","Edm - D",80,118,46]
["John Klingberg","Anh - D",74,119,48]
["Darnell Nurse","Edm - D",77,121,40]
["Jacob Trouba","NYR - D",76,131,36]
["Bowen Byram","Col - D",61,137,32]
["Thomas Chabot","Ott - D",71,139,44]
["Seth Jones","Chi - D",77,148,48]
["Tony DeAngelo","Phi - D",67,149,49]
["Noah Hanifin","Cgy - D",78,152,41]
["Rasmus Andersson","Cgy - D",82,154,48]
["Erik Karlsson","SJ - D",61,156,50]
["Justin Faulk","StL - D",80,165,44]
["Jared Spurgeon","Min - D",73,168,39]
["Hampus Lindholm","Bos - D",70,171,29]
["Jake Sanderson","Ott - D",72,172,23]
["Mikhail Sergachev","TB - D",78,187,37]
["Jeff Petry","Pit - D",70,194,42]
["Charlie McAvoy","Bos - D",55,195,39]
["Vince Dunn","Sea - D",75,196,35]
["Damon Severson","NJ - D",80,198,41]
["Gustav Forsling","Fla - D",70,199,34]
["Matt Dumba","Min - D",67,201,30]
["Ivan Provorov","Phi - D",82,207,36]
["K'Andre Miller","NYR - D",82,220,21]
["Sean Durzi","LA - D",70,224,32]
["Adam Boqvist","Cls - D",49,230,20]
["Jakob Chychrun","Ari - D",62,233,30]
["Alec Martinez","VGK - D",59,244,17]
["Samuel Girard","Col - D",68,248,31]
["Radko Gudas","Fla - D",77,257,17]
["Neal Pionk","Wpg - D",78,261,38]
["Josh Morrissey","Wpg - D",81,266,35]
["Tyson Barrie","Edm - D",74,268,45]
["Jaccob Slavin","Car - D",79,276,39]
["Dmitry Orlov","Was - D",77,285,33]
["Brady Skjei","Car - D",78,294,32]
["Oliver Ekman-Larsson","Van - D",76,431,31]
["Brandon Montour","Fla - D",77,446,32]
["Mark Giordano","Tor - D",74,447,33]
["Shayne Gostisbehere","Ari - D",75,449,45]
["Mattias Ekholm","Nsh - D",78,458,34]
["Brenden Dillon","Wpg - D",81,460,21]
["Alex Goligoski","Min - D",73,479,28]
["Luke Schenn","Van - D",70,480,16]
["Kevin Shattenkirk","Anh - D",81,483,32]
["Mike Matheson","Mon - D",72,489,28]
["Matt Roy","LA - D",69,491,21]
["Nikita Zadorov","Cgy - D",59,493,16]
["Esa Lindell","Dal - D",78,495,26]
["Tyler Myers","Van - D",81,502,20]
["Erik Johnson","Col - D",71,504,22]
["Cam Fowler","Anh - D",75,509,40]
["Nick Jensen","Was - D",78,516,19]
["Adam Pelech","NYI - D",75,518,28]
["Ryan Suter","Dal - D",82,520,35]
["Rasmus Ristolainen","Phi - D",73,522,20]
["Jani Hakanpaa","Dal - D",76,531,9]
["Colton Parayko","StL - D",78,533,33]
["Ryan Pulock","NYI - D",77,534,31]
["Matt Grzelcyk","Bos - D",64,537,21]
["Martin Fehervary","Was - D",80,538,19]
["Cody Ceci","Edm - D",77,539,25]
["Jonas Brodin","Min - D",76,543,32]
["Brett Pesce","Car - D",75,544,26]
["Erik Gudbranson","Cls - D",76,547,13]
["Christopher Tanev","Cgy - D",62,548,16]
["Oliver Kylington","Cgy - D",74,551,27]
["Alexandre Carrier","Nsh - D",74,552,28]
["Jamie Oleksiak","Sea - D",73,553,16]
["Alexander Romanov","NYI - D",79,555,15]
["Ryan McDonagh","Nsh - D",69,560,22]
["Mike Reilly","Bos - D",74,562,21]
["Ben Chiarot","Det - D",68,563,20]
["Carson Soucy","Sea - D",73,565,24]
["Adam Larsson","Sea - D",82,566,23]
["Justin Holl","Tor - D",76,570,20]
["Ryan Lindgren","NYR - D",76,571,15]
["Erik Cernak","TB - D",64,572,15]
["Zach Whitecloud","VGK - D",69,576,20]
["Brian Dumoulin","Pit - D",69,580,17]
["Filip Hronek","Det - D",78,582,36]
["Brayden McNabb","VGK - D",71,583,15]
["Artem Zub","Ott - D",79,587,23]
["Travis Sanheim","Phi - D",80,594,32]
["Dmitry Kulikov","Anh - D",44,595,10]
["Vladislav Gavrikov","Cls - D",80,596,31]
["Ryan Graves","NJ - D",78,597,30]
["T.J. Brodie","Tor - D",80,604,27]
["Jan Rutta","Pit - D",68,609,16]
["Nate Schmidt","Wpg - D",56,610,22]
["Brandon Carlo","Bos - D",76,619,16]
["Jeremy Lauzon","Nsh - D",66,625,6]
["Ian Cole","TB - D",77,626,17]
["Marco Scandella","StL - D",15,628,3]
["Jake Muzzin","Tor - D",60,632,21]
["Zdeno Chara","NYI - D",0,633,0]
["Nicolas Hague","VGK - D",65,635,20]
["Marcus Pettersson","Pit - D",71,636,19]
["Dante Fabbro","Nsh - D",69,643,22]
["John Marino","NJ - D",78,645,27]
["Connor Clifton","Bos - D",56,655,8]
["Dylan DeMelo","Wpg - D",75,657,15]
["Josh Manson","Col - D",66,665,19]
["Derek Forbort","Bos - D",74,666,14]
["P.K. Subban","NJ - D",0,673,0]
["Logan Stanley","Wpg - D",45,674,12]
["Mario Ferraro","SJ - D",72,675,20]
["Duncan Keith","Edm - D",0,677,0]
["Ilya Lyubushkin","Buf - D",76,679,12]
["Timothy Liljegren","Tor - D",62,681,25]
["Brett Kulak","Edm - D",72,685,17]
["Justin Schultz","Sea - D",74,686,22]
["Alexander Edler","LA - D",64,687,26]
["Chad Ruhwedel","Pit - D",45,690,7]
["Jamie Drysdale","Anh - D",80,692,35]
["Justin Braun","Phi - D",62,697,14]
["Mikey Anderson","LA - D",72,700,11]
["Jake Bean","Cls - D",69,701,26]
["Scott Mayfield","NYI - D",64,703,16]
["Nick Holden","Ott - D",73,708,17]
["Nikita Zaitsev","Ott - D",71,709,15]
["Connor Murphy","Chi - D",63,711,14]
["Marc Staal","Fla - D",70,714,15]
["Jacob Middleton","Min - D",66,715,13]
["Andrew Peeke","Cls - D",76,716,16]
["Anton Stralman","Bos - D",71,718,21]
["Travis Hamonic","Ott - D",54,719,14]
["Calvin de Haan","Car - D",42,723,6]
["Ethan Bear","Car - D",55,728,12]
["Henri Jokiharju","Buf - D",66,729,18]
["Rasmus Sandin","Tor - D",39,733,13]
["Brendan Smith","NJ - D",46,734,8]
["Zach Bogosian","TB - D",49,735,8]
["Jake McCabe","Chi - D",58,736,16]
["Jon Merrill","Min - D",55,738,12]
["Dylan Coghlan","Car - D",29,739,7]
["Nick Leddy","StL - D",77,742,27]
["Erik Gustafsson","Was - D",64,747,20]
["Robert Hagg","Det - D",47,752,7]
["Keith Yandle","Phi - D",0,758,0]
["David Savard","Mon - D",76,759,18]
["Olli Maatta","Det - D",58,760,7]
["Mark Borowiecki","Nsh - D",53,763,6]
["Patrik Nemeth","Ari - D",67,766,10]
["Joel Edmundson","Mon - D",67,767,16]
["Ben Hutton","VGK - D",46,768,8]
["Robert Bortuzzo","StL - D",66,769,5]
["Cal Foote","TB - D",76,770,13]
["Michael Del Zotto","Fla - D",52,771,16]
["Jonas Siegenthaler","NJ - D",75,773,16]
["Riley Stillman","Chi - D",71,775,17]
["Colin Miller","Dal - D",38,776,14]
["Ty Smith","Pit - D",12,781,4]
["Erik Brannstrom","Ott - D",63,787,18]
["Chris Wideman","Mon - D",74,788,32]
["Niko Mikkola","StL - D",56,789,12]
["Simon Benoit","Anh - D",25,793,3]
["Jack Johnson","Chi - D",61,797,7]
["Caleb Jones","Chi - D",72,799,21]
["Jake Walman","Det - D",22,808,4]
["Travis Dermott","Van - D",53,809,8]
["Mark Pysyk","Det - RW,D",41,814,7]
["Josh Brown","Ari - D",53,818,8]
["Kurtis MacDermid","Col - LW,D",28,819,4]
["Jacob Bryson","Buf - D",72,822,13]
["Trevor van Riemsdyk","Was - D",70,823,15]
["Dysin Mayo","Ari - D",74,824,15]
["Danny DeKeyser","Van - D",35,825,7]
["Will Borgen","Sea - D",61,826,12]
["Kyle Burroughs","Van - D",9,831,1]
["Jordie Benn","Tor - D",12,832,2]
["Kris Russell","Edm - D",37,833,10]
["Philippe Myers","TB - D",44,834,7]
["Haydn Fleury","TB - D",16,835,2]
["Nicolas Meloche","Cgy - D",8,838,1]
["Brad Hunt","Col - D",23,843,9]
["Dean Kukan","Cls - D",42,850,9]
["Mattias Samuelsson","Buf - D",62,852,14]
["Braden Schneider","NYR - D",73,854,18]
["Matt Benning","SJ - D",69,855,11]
["Jordan Oesterle","Det - D",49,857,10]
["Andy Greene","NYI - D",70,860,10]
["Tucker Poolman","Van - D",22,861,3]
["Jaycob Megna","SJ - D",38,867,7]
["Lucas Carlsson","Fla - D",58,869,12]
["Gavin Bayreuther","Cls - D",19,870,2]
["Marc-Edouard Vlasic","SJ - D",76,873,13]
["Tobias Bjornfot","LA - D",55,875,9]
["Michael Stone","Cgy - D",16,881,6]
["Gustav Lindstrom","Det - D",47,885,10]
["Ryan Ellis","Phi - D",0,886,0]
["Radim Simek","SJ - D",53,890,5]
["Shea Weber","VGK - D",0,891,0]
["Jordan Spence","LA - D",11,892,4]
["Kevin Connauton","Phi - D",4,894,1]
["William Lagesson","Car - D",10,896,2]
["J.J. Moser","Ari - D",29,897,12]
["Ryan Murray","Edm - D",33,899,6]
["Gabriel Carlsson","Was - D",12,900,4]
["Sebastian Aho","NYI - D",42,902,15]
["Troy Stecher","Ari - D",66,903,12]
["Sean Walker","LA - D",67,906,25]
["Nick Seeler","Phi - D",7,907,1]
["Jakub Zboril","Bos - D",16,908,4]
["Andrej Sekera","Dal - D",40,913,5]
["Matt Irwin","Was - D",14,914,2]
["Joel Hanley","Dal - D",31,915,4]
["Josh Mahura","Anh - D",14,921,3]
["Will Butcher","Dal - D",14,925,6]
["Mark Friedman","Pit - D",18,926,3]
["Kyle Capobianco","Wpg - D",14,930,3]
["Nils Lundkvist","Dal - D",54,933,10]
["Jacob MacDonald","Col - D",25,934,3]
["Casey Fitzgerald","Buf - D",17,935,3]
["Juuso Valimaki","Cgy - D",29,940,8]
["Kale Clague","Buf - D",28,943,7]
["Markus Niemelainen","Edm - D",5,948,1]
["Vladislav Kolyachonok","Ari - D",14,952,2]
["Urho Vaakanainen","Anh - D",24,954,5]
["Cam York","Phi - D",62,955,21]
["Thomas Harley","Dal - D",39,960,7]
["Jalen Chatfield","Car - D",6,964,1]
["Andrej Sustr","Min - D",10,970,2]
["Scott Perunovich","StL - D",6,971,2]
["Colton White","Anh - D",21,975,3]
["Dylan Samberg","Wpg - D",28,978,10]
["Corey Schueneman","Mon - D",48,983,9]
["Ben Harpur","Cls - D",17,984,2]
["Greg Pateryn","Anh - D",13,988,3]
["Slater Koekkoek","Edm - D",22,990,4]
["Sami Niku","Mon - D",13,993,6]
["Nathan Beaulieu","Anh - D",26,994,4]
["Nikolai Knyzhov","SJ - D",6,998,1]
["Derrick Pouliot","SJ - D",9,1005,3]
["Ryan Merkley","SJ - D",68,1008,16]
["Markus Nutivaara","SJ - D",28,1009,4]
["Kevin Bahl","NJ - D",32,1012,8]
["Olli Juolevi","Anh - D",20,1013,1]
["Cam Dineen","Ari - D",25,1014,5]
["Ronnie Attard","Phi - D",5,1016,2]
["Matt Tennyson","Sea - D",13,1019,2]
["Ville Heinola","Wpg - D",19,1020,6]
["Jacob Moverare","LA - D",8,1025,1]
["Calle Rosen","StL - D",3,1026,1]
["Mason Geertsen","NJ - LW,D",5,1027,0]
["Victor Mete","Tor - D",6,1031,1]
["Robin Salo","NYI - D",45,1032,11]
["Jason Demers","Edm - D",0,1033,0]
["Alec Regula","Chi - D",32,1039,4]
["Nick Blankenburg","Cls - D",30,1041,11]
["Lassi Thomson","Ott - D",32,1043,11]
["Grant Hutton","NYI - D",18,1045,1]
["Petteri Lindbohm","Fla - D",9,1051,1]
["Calen Addison","Min - D",72,1052,24]
["Jarred Tinordi","NYR - D",5,1053,0]
["Pierre-Olivier Joseph","Pit - D",56,1058,12]
["Austin Strand","Anh - D",5,1062,1]
["John Moore","Anh - D",3,1063,0]
["Jordan Harris","Mon - D",73,1064,22]
["Steven Kampfer","Det - D",0,1067,0]
["Jake Gardiner","Car - D",0,1070,0]
["Jacob Larsson","Ott - D",9,1073,1]
["Michal Kempny","Sea - D",40,1076,9]
["Conor Timmins","Ari - D",21,1078,4]
["Alex Vlasic","Chi - D",0,1079,0]
["Dennis Cholowski","NYI - D",15,1081,3]
["Wyatt Kalynuk","Van - D",16,1082,3]
["Philip Broberg","Edm - D",51,1084,12]
["Daniil Miromanov","VGK - D",9,1087,1]
["Jacob Bernard-Docker","Ott - D",14,1089,3]
["Libor Hajek","NYR - D",11,1091,1]
["Nikita Okhotiuk","NJ - D",11,1093,2]
["Connor Mackey","Cgy - D",4,1096,1]
["Noah Juulsen","Van - D",8,1098,1]
["Jake Christiansen","Cls - D",8,1101,1]
["Christian Wolanin","Van - D",7,1103,1]
["Carl Dahlstrom","Tor - D",4,1107,1]
["Ian Mitchell","Chi - D",33,1109,7]
["Nicolas Beaudin","Chi - D",15,1111,3]
["Jeremy Davies","Buf - D",10,1113,2]
["Dillon Heatherington","Ott - D",4,1114,0]
["Jack Rathbone","Van - D",37,1115,8]
["Justin Barron","Mon - D",35,1116,9]
["Victor Soderstrom","Ari - D",6,1118,1]
["Andy Welinski","NYR - D",0,1125,0]
["Mattias Norlinder","Mon - D",24,1126,5]
["Maxime Lajoie","Car - D",0,1129,0]
["Dan Renouf","Bos - D",0,1132,0]
["Dakota Mermis","Min - D",0,1137,0]
["Chase Priskie","Buf - D",3,1142,0]
["Alex Biega","Nsh - D",10,1144,1]
["Jack Ahcan","Bos - D",6,1146,1]
["Cale Fleury","Sea - D",14,1149,2]
["Scott Harrington","SJ - D",12,1154,2]
["Anthony Bitetto","Fla - D",0,1156,0]
["Linus Hogberg","Phi - D",0,1158,0]
["Fredrik Claesson","TB - D",9,1162,0]
["Johnathan Kovacevic","Wpg - D",6,1163,0]
["Steven Santini","StL - D",0,1164,0]
["Zac Jones","NYR - D",51,1167,14]
["Jakub Galvas","Chi - D",22,1168,3]
["Kristians Rubins","Ott - D",0,1169,0]
["Darren Raddysh","TB - D",7,1172,0]
["Declan Chisholm","Wpg - D",9,1176,1]
["Connor Carrick","Bos - D",0,1178,0]
["Tyler Lewington","Bos - D",1,1179,0]
["Jordan Gross","Nsh - D",5,1180,1]
["Lucas Johansen","Was - D",3,1183,1]
["Xavier Ouellet","Pit - D",0,1185,0]
["Tarmo Reunanen","Car - D",0,1189,0]
["Reilly Walsh","NJ - D",3,1190,0]
["Ethan Prow","Buf - D",0,1194,0]
["Zachary Hayes","VGK - D",5,1195,0]
["Thomas Hickey","NJ - D",10,1198,0]
["David Farrance","Car - D",0,1199,0]
["Jon Lizotte","Pit - D",1,1211,0]
["Isaak Phillips","Chi - D",18,1212,1]
["Kaedan Korczak","VGK - D",1,1215,0]
["Brandon Davidson","Buf - D",0,1217,0]
["Joey Keane","Car - D",0,1222,0]
["Matt Kiersted","Fla - D",11,1225,3]
["Aaron Ness","Was - D",0,1227,0]
["Luca Sbisa","Nsh - D",0,1230,0]
["Keaton Middleton","Col - D",0,1232,0]
["Brogan Rafferty","Sea - D",0,1233,0]
["Luke Witkowski","StL - RW,D",0,1234,0]
["Alexander Alexeyev","Was - D",16,1235,3]
["Brinson Pasichnuk","SJ - D",0,1238,0]
["Dennis Gilbert","Cgy - D",0,1240,0]
["Louie Belpedio","Phi - D",0,1241,0]
["Otto Leskinen","Mon - D",0,1246,0]
["Brady Keeper","Van - D",0,1247,0]
["Calle Odelius","NYI - D",0,1249,0]
["Joe Fleming","VGK - D",0,1252,0]
["Frederic Brunet","Bos - D",0,1254,0]
["Dylan MacPherson","Van - D",0,1258,0]
["Spencer Sova","Buf - D",0,1260,0]
["Josh Healey","Anh - D",0,1261,0]
["Alex Peters","Edm - D",0,1262,0]
["Cameron Gaunce","LA - D",0,1265,0]
["Kyle Masters","Min - D",0,1268,0]
["Simon Motew","Was - D",0,1269,0]
["Blake Hillman","NYR - D",0,1270,0]
["Jerad Rosburg","Dal - D",0,1273,0]
["Mitch Vande Sompel","Col - D",0,1274,0]
["Drew Helleson","Anh - D",0,1275,0]
["Chandler Romeo","Ott - D",0,1277,0]
["Olen Zellweger","Anh - D",0,1278,0]
["Filip Roos","Chi - D",0,1282,0]
["Daniil Chayka","VGK - D",0,1284,0]
["Jackson Edward","Bos - D",0,1286,0]
["Luke Prokop","Nsh - D",0,1292,0]
["Zach Berzolla","Buf - D",0,1293,0]
["Filip Bratt","NJ - D",0,1297,0]
["Spencer Stastney","Nsh - D",0,1300,0]
["David Jiricek","Cls - D",0,1303,0]
["John Ludvig","Fla - D",0,1306,0]
["Vsevolod Komarov","Buf - D",0,1307,0]
["Roland McKeown","Nsh - D",0,1309,0]
["Declan Carlile","TB - D",0,1312,0]
["Marshall Rifai","Tor - D",0,1313,0]
["Nick Cicek","SJ - D",0,1314,0]
["Peetro Seppala","Sea - D",0,1315,0]
["Maveric Lamoureux","Ari - D",0,1317,0]
["Bobby Nardella","Was - D",0,1321,0]
["Roman Schmidt","TB - D",0,1327,0]
["Dawson Barteaux","Dal - D",0,1328,0]
["Donovan Sebrango","Det - D",0,1334,0]
["Noah Warren","Anh - D",0,1335,0]
["Elias Salomonsson","Wpg - D",0,1337,0]
["Ryan Jones","TB - D",0,1341,0]
["Alex Kannok-Leipert Van","Van - D",0,1343,0]
["Ryker Evans","Sea - D",0,1345,0]
["Cole Jordan","Cgy - D",0,1346,0]
["Connor McCarthy","NYI - D",0,1349,0]
["Ryan Mast","Bos - D",0,1353,0]
["Mats Lindgren","Buf - D",0,1364,0]
["Layton Ahac","VGK - D",0,1367,0]
["Eemil Viro","Det - D",0,1369,0]
["Brandt Clarke","LA - D",0,1374,0]
["Wyatte Wylie","Phi - D",0,1378,0]
["Darien Kielb","Edm - D",0,1379,0]
["Tobie Bisson","LA - D",0,1381,0]
["Filip Johansson","Van - D",0,1385,0]
["Marc-Andre Gaudet","StL - D",0,1390,0]
["Ronan Seeley","Car - D",0,1392,0]
["Case McCarthy","NJ - D",0,1401,0]
["Griffin Mendel","Car - D",0,1402,0]
["Jake Furlong","SJ - D",0,1406,0]
["Keaton Thompson","Nsh - D",0,1410,0]
["Adam Ginning","Phi - D",0,1414,0]
["Artem Grushnikov","Dal - D",0,1418,0]
["Nolan Collins","Pit - D",0,1423,0]
["Gavin White","Dal - D",0,1424,0]
["Cavan Fitzgerald","Car - D",0,1435,0]
["Parker Wotherspoon","NYI - D",0,1436,0]
["Billy Sweezey","Cls - D",0,1438,0]
["Benjamin Finkelstein","Min - D",0,1441,0]
["Gianni Fairbrother","Mon - D",0,1442,0]
["Xavier Bernard","Ott - D",0,1445,0]
["Nate Clurman","Col - D",0,1446,0]
["Joseph Cecconi","Dal - D",0,1450,0]
["Brady Lyle","StL - D",0,1451,0]
["Ronald Knot","Ari - D",0,1452,0]
["Ryan Shea","Dal - D",0,1455,0]
["Jake Bischoff","VGK - D",0,1456,0]
["Jacob Wilson","Bos - D",0,1457,0]
["Jacob Holmes","Dal - D",0,1461,0]
["Olivier Galipeau","Mon - D",0,1462,0]
["Jake Lee","Cgy - D",0,1463,0]
["Logan Day","Was - D",0,1465,0]
["Simon Johansson","Min - D",0,1466,0]
["Tnias Mathurin","Det - D",0,1468,0]
["Josiah Didier","Bos - D",0,1470,0]
["Leon Gawanke","Wpg - D",0,1474,0]
["Marc Del Gaizo","Nsh - D",0,1480,0]
["Lawrence Pilut","Buf - D",0,1483,0]
["Colin Swoyer","Pit - D",0,1484,0]
["Kevin Gravel","Nsh - D",0,1488,0]
["Trevor Carrick","TB - D",0,1491,0]
["Tyrel Bauer","Wpg - D",0,1493,0]
["Ilya Solovyov","Cgy - D",0,1497,0]
["Zach Giuttari","NYR - D",0,1508,0]
["Tyler Wotherspoon","NJ - D",0,1510,0]
["Dillon Simpson","Cls - D",0,1512,0]
["Jake Massie","Was - D",0,1513,0]
["Miguel Tourigny","Mon - D",0,1518,0]
["Ty Nelson","Sea - D",0,1520,0]
["Oskari Laaksonen","Buf - D",0,1521,0]
["Jett Woo","Van - D",0,1523,0]
["Noah Laaouan","Ari - D",0,1524,0]
["Owen Pickering","Pit - D",5,1527,1]
["Tommy Miller","Tor - D",0,1531,0]
["Jarrod Gourley","NJ - D",0,1537,0]
["Jimmy Schuldt","Buf - D",0,1539,0]
["Jack St. Ivany","Pit - D",0,1540,0]
["Ryan MacKinnon","NYI - D",0,1541,0]
["Brennan Menell","Phi - D",0,1543,0]
["Simon Lundmark","Wpg - D",0,1545,0]
["Niclas Almari","Pit - D",0,1546,0]
["Jared McIsaac","Det - D",0,1552,0]
["Lukas Klok","Ari - D",0,1555,0]
["Axel Andersson","Anh - D",0,1557,0]
["Rob Hamilton","Col - D",0,1558,0]
["Andong Song","NYI - D",0,1559,0]
["Kirill Kudryavtsev","Van - D",0,1561,0]
["Cole Hults","Ari - D",0,1567,0]
["Kevin Korchinski","Chi - D",0,1576,0]
["Denton Mateychuk","Cls - D",0,1577,0]
["Daemon Hunt","Min - D",0,1580,0]
["Isaiah George","NYI - D",0,1581,0]
["Max Wanner","Edm - D",0,1586,0]
["Cooper Zech","Phi - D",0,1589,0]
["Tyson Hinds","Anh - D",0,1592,0]
["Wyatt Aamodt","Col - D",0,1593,0]
["Jonathan Aspirot","Ott - D",0,1596,0]
["Ryan McCleary","Pit - D",0,1597,0]
["Vincent Iorio","Was - D",0,1601,0]
["Noel Hoefenmayer","Tor - D",0,1602,0]
["Pavel Mintyukov","Anh - D",0,1605,0]
["Adam Wilsby","Nsh - D",0,1606,0]
["Victor Berglund","Bos - D",0,1608,0]
["Phil Kemp","Edm - D",0,1610,0]
["Michael Kesselring","Edm - D",0,1613,0]
["Tristan Luneau","Anh - D",0,1614,0]
["Angus Booth","LA - D",0,1622,0]
["Josh Brook","Cgy - D",0,1626,0]
["Alexander Petrovic","Dal - D",0,1627,0]
["Mitch Eliot","Buf - D",0,1631,0]
["Charles Cote","Anh - D",0,1639,0]
["Dmitry Osipov","Anh - RW,D",0,1641,0]
["William Villeneuve","Tor - D",0,1643,0]
["Dylan McIlrath","Was - D",0,1644,0]
["Quinn Schmiemann","Van - D",0,1649,0]
["Adam Karashik","Phi - D",0,1650,0]
["Kim Nousiainen","LA - D",0,1651,0]
["Nelson Nogier","LA - D",0,1652,0]
["Tory Dello","Mon - D",0,1654,0]
["Tyler Tucker","StL - D",0,1656,0]
["Simon Edvinsson","Det - D",0,1659,0]
["Nolan Allan","Chi - D",0,1660,0]
["Jack Thompson","TB - D",0,1661,0]
["Zachary Uens","Fla - D",0,1662,0]
["Joe Hicketts","Min - D",0,1663,0]
["Adam Clendening","Chi - D",0,1665,0]
["Arber Xhekaj","Mon - D",0,1670,0]
["Tomas Hamara","Ott - D",0,1671,0]
["Artem Guryev","SJ - D",0,1672,0]
["Dennis Cesana","Fla - D",0,1673,0]
["Simon Lavigne","Cgy - D",0,1674,0]
["Brian Lashoff","Det - D",0,1677,0]
["Stanislav Svozil","Cls - D",0,1679,0]
["Ole Holm","Cls - D",0,1680,0]
["Josh Jacobs","Col - D",0,1681,0]
["Jesper Sellgren","Car - D",0,1684,0]
["Mikko Kokkonen","Tor - D",0,1692,0]
["Oscar Plandowski","Det - D",0,1694,0]
["Graham Sward","Nsh - D",0,1695,0]
["Nathan Staios","Fla - D",0,1696,0]
["Nikolas Brouillard","Anh - D",0,1699,0]
["Danila Zhuravlyov","Col - D",0,1700,0]
["Turner Ottenbreit","Min - D",0,1702,0]
["Ashton Sautner","Wpg - D",0,1704,0]
["Chad Nychuk","Van - D",0,1713,0]
["Jacob Murray","Dal - D",0,1716,0]
["Oscar Klefbom","Edm - D",0,1719,0]
["Jack Matier","Nsh - D",0,1723,0]
["Filip Kral","Tor - D",0,1726,0]
["Gustav Olofsson","Sea - D",0,1731,0]
["Benton Maass","Was - D",0,1738,0]
["Dmitry Kuzmin","Wpg - D",0,1739,0]
["Xavier Bouchard","Nsh - D",0,1740,0]
["Albert Johansson","Det - D",0,1741,0]
["Dru Krebs","Was - D",0,1742,0]
["Ethan Samson","Phi - D",0,1746,0]
["Daniil Sobolev","Mon - D",0,1751,0]
["Nick DeSimone","Cgy - D",0,1753,0]
["Josh Maniscalco","Pit - D",0,1754,0]
["Max Gildon","Fla - D",0,1755,0]
["Eddie Wittchow","Sea - D",0,1758,0]
["Braden Hache","Fla - D",0,1766,0]
["Vincent Desharnais","Edm - D",0,1767,0]
["Kaiden Guhle","Mon - D",0,1768,0]
["Colton Poolman","Cgy - D",0,1771,0]
["Mason Millman","Phi - D",0,1779,0]
["Hunter Skinner","NYR - D",0,1783,0]
["Montana Onyebuchi","SJ - D",0,1784,0]
["Matt Anderson","Van - D",0,1787,0]
["Tyson Feist","TB - D",0,1790,0]
["Evan Nause","Fla - D",0,1791,0]
["Aleksi Heimosalmi","Car - D",0,1793,0]
["Dyllan Gill","TB - D",0,1795,0]
["Landon Kosior","LA - D",0,1796,0]
["Gannon Laroque","SJ - D",0,1799,0]
["Cam Crotty","Ari - D",0,1801,0]
["Seth Helgeson","NYI - D",0,1803,0]
["Alex Green","Mon - D",0,1805,0]
["John Parker-Jones","Mon - D",0,1808,0]
["William Trudeau","Mon - D",0,1810,0]
["Tim Berni","Cls - D",0,1813,0]
["Santtu Kinnunen","Fla - D",0,1815,0]
["Samuel Mayer","SJ - D",0,1816,0]
["Maxence Guenette","Ott - D",0,1818,0]
["Ethan Del Mastro","Chi - D",0,1819,0]
["Artur Cholach","VGK - D",0,1824,0]
["Michael Krutil","Chi - D",0,1827,0]
["Martin Has","Was - D",0,1828,0]
["Lukas Cormier","VGK - D",0,1833,0]
["Karl Alzner","Mon - D",0,1835,0]
["Michael Karow","Dal - D",0,1837,0]
["Cole Clayton","Cls - D",0,1838,0]
["Colin Felix","Phi - D",0,1842,0]
["Bode Wilde","NYI - D",0,1844,0]
["Peter Diliberatore","VGK - D",2,1845,0]
["Jorian Donovan","Ott - D",0,1849,0]
["Ty Emberson","NYR - D",0,1853,0]
["Chad Krys","Tor - D",0,1855,0]
["Christoffer Sedoff","Cgy - D",0,1858,0]
["Christian Kyrou","Dal - D",0,1860,0]
["Simon Nemec","NJ - D",0,1863,0]
["Andrew Perrott","Chi - D",0,1865,0]
["Brian Zanetti","Phi - D",0,1868,0]
["Nick Wolff","Bos - D",0,1873,0]
["Mac Hollowell","Tor - D",0,1875,0]
["David Spacek","Min - D",0,1877,0]
["Anttoni Honka","Car - D",0,1880,0]
["Jeremy Groleau","NJ - D",0,1884,0]
["Ben Roger","Ott - D",0,1885,0]
["Olivier Leblanc","Cls - D",0,1886,0]
["Will MacKinnon","Phi - D",0,1894,0]
["Patrick Holway","SJ - D",0,1896,0]
["Rhett Rhinehart","Cgy - D",0,1898,0]
["Shakir Mukhamadullin","NJ - D",0,1907,0]
["Trevor Cosgrove","NYI - D",0,1912,0]
["Teemu Kivihalme","Tor - D",0,1913,0]
["William Riedell","VGK - D",0,1914,0]
["Griffin Luce","StL - D",0,1915,0]
["Chris Ortiz","Pit - D",0,1921,0]
["Samuel Bolduc","NYI - D",0,1928,0]
["Helge Grans","LA - D",0,1930,0]
["Cliff Watson","Chi - D",0,1932,0]
["Maksymilian Szuber","Ari - D",0,1933,0]
["Ryan O'Rourke","Min - D",0,1934,0]
["Peter Tischke","Buf - D",0,1935,0]
["Topi Niemela","Tor - D",0,1936,0]
["Matthew Kessel","StL - D",0,1940,0]
["Seth Barton","Det - D",0,1943,0]
["Louis Crevier","Chi - D",0,1946,0]
["Connor Corcoran","VGK - D",0,1947,0]
["Luka Profaca","Anh - D",0,1952,0]
["Yanni Kaldis","Edm - D",0,1955,0]
["Jeremie Poirier","Cgy - D",0,1958,0]
["Brandon Scanlin","NYR - D",0,1961,0]
["Jeremie Biakabutuka","Det - D",0,1962,0]
["Robbie Russo","NJ - D",0,1967,0]
["Taylor Fedun","Pit - D",0,1970,0]
["Vincent Sevigny","NYI - D",0,1972,0]
["Santino Centorame","Mon - D",0,1973,0]
["Carson Lambos","Min - D",0,1974,0]
["Bryce Montgomery","Car - D",0,1975,0]
["Marc Lajoie","LA - D",0,1976,0]
["Michael Buchinger","StL - D",0,1977,0]
["Mitch Reinke","Pit - D",0,1978,0]
["Wyatt Newpower","Det - D",0,1979,0]
["Cameron Whynot","Cgy - D",0,1985,0]
["Topias Vilen","NJ - D",0,1994,0]
["Yan Kuznetsov","Cgy - D",0,1995,0]
["Joseph Duszak","Tor - D",0,1999,0]
["Tyson Galloway","StL - D",0,2002,0]
["Ben Gleason","Dal - D",0,2003,0]
["Zach Leslie","Ott - D",0,2006,0]
["Louka Henault","NYR - D",0,2007,0]
["Andreas Englund","Col - D",0,2008,0]
["Matthew Robertson","NYR - D",0,2010,0]
["Marek Alscher","Fla - D",0,2015,0]
["Cameron Supryka","LA - D",0,2016,0]
["Marcus Bjork","Cls - D",0,2017,0]
["Samuel Knazko","Cls - D",0,2019,0]
["Axel Rindell","Tor - D",0,2023,0]
["Tyler Inamoto","LA - D",0,2025,0]
["Isaac Belliveau","Pit - D",0,2026,0]
["Nick Perbix","TB - D",0,2029,0]
["Calle Sjalin","Fla - D",0,2033,0]
["Cameron MacDonald","TB - D",0,2036,0]
["Zachary Massicotte","Ott - D",0,2037,0]
["Luke Martin","NYR - D",0,2042,0]
["Michael Vukojevic","NJ - D",0,2044,0]
["Dmitry Semykin","TB - D",0,2045,0]
["Michael Callahan","Bos - D",0,2046,0]
["Kai Wissmann","Bos - D",0,2047,0]
["Grigorii Dronov","Car - D",0,2048,0]
["Matt Bartkowski","NYR - D",38,2053,7]
["Santeri Hatakka","SJ - D",9,2056,3]
["Sean Day","TB - D",2,2057,0]
["Madison Bowey","Mon - D",23,2063,4]
["Frederic Allard","LA - D",0,2066,0]
["Kevin Czuczman","Min - D",0,2067,0]
["Guillaume Brisebois","Van - D",0,2069,0]
["Artemi Kniazev","SJ - D",0,2070,0]
["Brayden Pachal","VGK - D",8,2071,1]
["Paul LaDue","NYI - D",1,2072,0]
["Dmitri Samorukov","Edm - D",1,2076,0]
["Egor Zamula","Phi - D",0,2077,0]

{"sheet":"Goalies","index":7,"n_rows":230,"n_cols":7,"rows_kept":230}
["Player","Team","GP","O-Rank","Wins","Shutouts","Points"]
["Andrei Vasilevskiy","TB - G",63,9,44,6,106]
["Igor Shesterkin","NYR - G",59,10,37,7,95]
["Ilya Sorokin","NYI - G",53,34,28,6,74]
["Jacob Markstrom","Cgy - G",61,41,33,6,84]
["Juuse Saros","Nsh - G",62,42,35,4,82]
["Jake Oettinger","Dal - G",59,46,34,3,77]
["Frederik Andersen","Car - G",51,58,32,3,73]
["Thatcher Demko","Van - G",65,59,36,5,87]
["Marc-Andre Fleury","Min - G",57,65,35,4,82]
["Sergei Bobrovsky","Fla - G",53,66,37,3,83]
["Darcy Kuemper","Was - G",59,67,35,5,85]
["Tristan Jarry","Pit - G",61,70,33,3,75]
["Connor Hellebuyck","Wpg - G",65,74,30,4,72]
["Jeremy Swayman","Bos - G",43,88,22,3,53]
["Spencer Knight","Fla - G",32,92,18,2,42]
["Cam Talbot","Ott - G",47,94,21,3,51]
["Jack Campbell","Edm - G",55,116,34,4,80]
["Jonathan Quick","LA - G",44,128,23,2,52]
["Alexandar Georgiev","Col - G",55,134,35,4,82]
["Logan Thompson","VGK - G",51,135,27,3,63]
["Ville Husso","Det - G",38,145,18,2,42]
["Anton Forsberg","Ott - G",37,146,16,2,38]
["Ilya Samsonov","Tor - G",48,147,30,3,69]
["Semyon Varlamov","NYI - G",32,159,12,3,33]
["Carter Hart","Phi - G",53,160,18,2,42]
["Jordan Binnington","StL - G",52,163,31,3,71]
["Antti Raanta","Car - G",28,173,14,2,34]
["Pavel Francouz","Col - G",27,175,17,2,40]
["Carey Price","Mon - G",0,176,0,0,0]
["Vitek Vanecek","NJ - G",44,177,20,2,46]
["Alex Nedeljkovic","Det - G",49,178,20,4,52]
["John Gibson","Anh - G",56,186,22,3,53]
["Linus Ullmark","Bos - G",40,193,24,2,54]
["James Reimer","SJ - G",44,205,20,2,46]
["Pyotr Kochetkov","Car - G",7,210,3,0,6]
["Mike Smith","Edm - G",0,225,0,0,0]
["Ukko-Pekka Luukkonen","Buf - G",10,250,5,1,13]
["Anthony Stolarz","Anh - G",26,252,11,2,28]
["Casey DeSmith","Pit - G",22,258,11,2,28]
["Eric Comrie","Buf - G",14,263,8,1,19]
["Spencer Martin","Van - G",9,264,4,0,8]
["Charlie Lindgren","Was - G",22,265,11,2,28]
["Adin Hill","VGK - G",8,267,2,0,4]
["Brian Elliott","TB - G",19,271,11,1,25]
["Dan Vladar","Cgy - G",23,275,12,2,30]
["Robin Lehner","VGK - G",0,277,0,0,0]
["Zach Fucale","Was - G",3,278,1,0,2]
["Stuart Skinner","Edm - G",30,283,17,2,40]
["Joseph Woll","Tor - G",2,284,1,0,2]
["Louis Domingue","NYR - G",3,286,1,0,2]
["Michael Houser","Buf - G",0,287,2,0,4]
["Chris Driedger","Sea - G",5,288,2,0,4]
["Daniil Tarasov","Cls - G",4,290,1,0,2]
["Garret Sparks","LA - G",0,291,1,0,2]
["Keith Kinkaid","Bos - G",2,292,2,0,4]
["Kaapo Kahkonen","SJ - G",34,297,15,2,36]
["Troy Grosenick","Phi - G",28,299,11,0,22]
["Kevin Mandolese","Ott - G",0,301,0,0,0]
["Clay Stevenson","Was - G",0,302,0,0,0]
["Henrik Tikkanen","NYI - G",0,303,0,0,0]
["Gage Alexander","Anh - G",0,304,0,0,0]
["Jesper Wallstedt","Min - G",0,305,0,0,0]
["Olof Lindbom","NYR - G",0,306,0,0,0]
["Kaden Fulcher","Det - G",0,307,0,0,0]
["John Lethemon","Det - G",0,308,0,0,0]
["Taylor Gauthier","Pit - G",0,309,0,0,0]
["Keith Petruzzelli","Tor - G",0,310,0,0,0]
["Tristan Lennox","NYI - G",0,311,0,0,0]
["Riley Mercer","Mon - G",0,312,0,0,0]
["Jacob Ingham","LA - G",0,313,0,0,0]
["Will Cranley","StL - G",0,314,0,0,0]
["Jakub Vondras","Car - G",0,315,0,0,0]
["Andrew Oke","Det - G",0,316,0,0,0]
["David Hrenak","LA - G",0,317,0,0,0]
["Patrik Hamrla","Car - G",0,318,0,0,0]
["Evan Cormier","Tor - G",0,319,0,0,0]
["Jan Bednar","Det - G",0,320,0,0,0]
["Mikhail Berdin","Wpg - G",0,321,0,0,0]
["Daniel Mannella","Anh - G",0,322,0,0,0]
["Tomas Vomacka","Nsh - G",0,323,0,0,0]
["Tyler Wall","Phi - G",0,324,0,0,0]
["Dustin Wolf","Cgy - G",0,325,0,0,0]
["Yaroslav Askarov","Nsh - G",0,326,0,0,0]
["Oskari Salminen","Wpg - G",0,327,0,0,0]
["Antoine Coulombe","Mon - G",0,328,0,0,0]
["Hunter Jones","Min - G",0,329,0,0,0]
["Kevin Poulin","Mon - G",0,330,0,0,0]
["Francois Brassard","Bos - G",0,331,0,0,0]
["Alex D'Orio","Pit - G",0,332,0,0,0]
["Filip Lindberg","Pit - G",0,333,0,0,0]
["Brad Arvanitis","Cgy - G",0,334,0,0,0]
["Jussi Olkinuora","Det - G",3,335,0,0,0]
["Benjamin Gaudreau","SJ - G",0,336,0,0,0]
["Jordan Papirny","VGK - G",0,337,0,0,0]
["Zachary Emond","SJ - G",0,338,0,0,0]
["Cale Morris","Chi - G",0,339,0,0,0]
["Matt Murray","Dal - G",0,340,0,0,0]
["Talyn Boyko","NYR - G",0,341,0,0,0]
["Devin Cooley","Nsh - G",0,342,0,0,0]
["Eetu Makiniemi","SJ - G",0,343,0,0,0]
["Brad Barone","TB - G",0,344,0,0,0]
["Pavel Cajan","Cls - G",0,345,0,0,0]
["Victor Brattstrom","Det - G",0,346,0,0,0]
["Ivan Fedotov","Phi - G",0,347,0,0,0]
["Colton Point","Dal - G",0,348,0,0,0]
["Ty Young","Van - G",0,349,0,0,0]
["Francis Marotte","Anh - G",0,350,0,0,0]
["Jakub Skarek","NYI - G",0,351,0,0,0]
["Nolan Lalonde","Cls - G",0,352,0,0,0]
["Tommy Nappier","Pit - G",0,353,0,0,0]
["Remi Poirier","Dal - G",0,354,0,0,0]
["Daniil Chechelev","Cgy - G",0,355,0,0,0]
["Samuel Ersson","Phi - G",0,356,0,0,0]
["Matt Villalta","LA - G",0,357,0,0,0]
["Strauss Mann","SJ - G",0,358,0,0,0]
["Hunter Shepard","Was - G",0,359,0,0,0]
["Isaac Poulter","NJ - G",0,360,0,0,0]
["Jaxson Stauber","Chi - G",0,361,0,0,0]
["Jesper Vikman","VGK - G",0,362,0,0,0]
["Arvid Holm","Wpg - G",0,363,0,0,0]
["Jonathan Lemieux","Phi - G",0,364,0,0,0]
["Tyler Parsons","Cgy - G",0,365,0,0,0]
["Mason Beaupit","SJ - G",0,366,0,0,0]
["Trent Miner","Col - G",0,367,0,0,0]
["Pat Nagle","Phi - G",0,368,0,0,0]
["Antoine Bibeau","Ott - G",0,369,0,0,0]
["Ivan Zhigalov","Col - G",0,370,0,0,0]
["Jet Greaves","Cls - G",0,371,0,0,0]
["Callum Booth","Sea - G",0,372,0,0,0]
["Garin Bjorklund","Was - G",0,373,0,0,0]
["Kenneth Appleby","NYI - G",0,374,0,0,0]
["Jiri Patera","VGK - G",0,375,0,0,0]
["Logan Flodell","Ott - G",0,376,0,0,0]
["Colten Ellis","StL - G",0,377,0,0,0]
["Vadim Zherenko","StL - G",0,378,0,0,0]
["Tyler Brennan","NJ - G",0,379,0,0,0]
["Dylan Wells","Chi - G",0,380,0,0,0]
["C.J. Motte","Min - G",0,381,0,0,0]
["Calle Clang","Anh - G",0,382,0,0,0]
["Sebastian Cossa","Det - G",0,383,0,0,0]
["Joe Vrbetic","Mon - G",0,384,0,0,0]
["Dylan Garand","NYR - G",0,385,0,0,0]
["Thomas Milic","Min - G",0,386,0,0,0]
["Olle Eriksson Ek","Anh - G",0,387,0,0,0]
["Evan Fitzpatrick","Fla - G",0,388,0,0,0]
["Parker Gahagen","NYR - G",0,389,0,0,0]
["Mack Guzda","Fla - G",0,390,0,0,0]
["Hayden Stewart","Cls - G",0,391,0,0,0]
["Dylan Ferguson","Tor - G",0,392,0,0,0]
["Adam Scheel","Dal - G",0,393,0,0,0]
["Mitchell Weeks","Chi - G",0,394,0,0,0]
["Anson Thornton","Ari - G",0,395,0,0,0]
["Ryan Fanti","Edm - G",0,396,0,0,0]
["Dennis Hildeby","Tor - G",0,397,0,0,0]
["Philippe Desrosiers","Mon - G",0,398,0,0,0]
["Olivier Rodrigue","Edm - G",0,399,0,0,0]
["Zane McIntyre","Min - G",2,400,0,0,0]
["Dryden McKay","Tor - G",0,401,0,0,0]
["Domenic DiVincentiis","Wpg - G",0,402,0,0,0]
["Brandon Bussi","Bos - G",0,403,0,0,0]
["Nolan Maier","Phi - G",0,404,0,0,0]
["Kyle Keyser","Bos - G",0,405,0,0,0]
["Isaiah Saville","VGK - G",0,406,0,0,0]
["David Tendeck","Ari - G",0,407,0,0,0]
["Beck Warm","Buf - G",0,408,0,0,0]
["Leevi Merilainen","Ott - G",0,409,0,0,0]
["Arturs Silovs","Van - G",0,410,0,0,0]
["Cory Schneider","NYI - G",0,411,1,0,2]
["Christopher Gibson","Ari - G",0,412,0,0,0]
["Magnus Hellberg","Ott - G",0,413,0,0,0]
["Oscar Dansk","Cgy - G",0,414,0,0,0]
["Lukas Dostal","Anh - G",5,417,1,0,2]
["Mads Sogaard","Ott - G",2,419,1,0,2]
["Joel Hofer","StL - G",2,420,1,0,2]
["Michael DiPietro","Van - G",0,421,0,0,0]
["Pheonix Copley","LA - G",2,423,0,0,0]
["Michael Hutchinson","VGK - G",6,424,2,0,4]
["Laurent Brossoit","VGK - G",22,425,11,1,25]
["Alex Lyon","Fla - G",0,426,0,0,0]
["Jaroslav Halak","NYR - G",22,429,8,1,19]
["Felix Sandstrom","Phi - G",5,433,1,0,2]
["Hugo Alnefelt","TB - G",0,434,0,0,0]
["Michael McNiven","Ott - G",1,436,0,0,0]
["Justus Annunen","Col - G",0,437,0,0,0]
["Zach Sawchenko","Car - G",2,438,1,0,2]
["Cal Petersen","LA - G",37,439,19,3,47]
["Connor Ingram","Nsh - G",1,442,1,0,2]
["Jonathan Bernier","NJ - G",4,443,1,0,2]
["Devan Dubnyk","Col - G",0,444,0,0,0]
["Maxime Lagace","TB - G",2,448,0,0,0]
["Alex Stalock","Chi - G",36,452,10,0,20]
["Calvin Pickard","Edm - G",3,453,0,0,0]
["Adam Huska","NYR - G",0,454,0,0,0]
["J-F Berube","Fla - G",6,455,3,0,6]
["Erik Kallgren","Tor - G",5,457,2,0,4]
["Braden Holtby","Dal - G",0,463,0,0,0]
["Petr Mrazek","Chi - G",44,465,15,2,36]
["Anton Khudobin","Dal - G",6,470,2,0,4]
["Arvid Soderblom","Chi - G",12,472,2,0,4]
["Jack Lafontaine","TB - G",0,473,0,0,0]
["Scott Wedgewood","Dal - G",22,474,11,1,25]
["Ivan Prosvetov","Ari - G",0,477,0,0,0]
["Collin Delia","Van - G",12,482,4,0,8]
["Matt Murray","Tor - G",31,488,19,2,44]
["Harri Sateri","Ari - G",6,494,2,0,4]
["Elvis Merzlikins","Cls - G",53,497,27,2,60]
["Malcolm Subban","Buf - G",14,499,4,0,8]
["Nico Daws","NJ - G",9,506,3,0,6]
["Mikko Koskinen","Edm - G",0,513,0,0,0]
["Akira Schmid","NJ - G",0,517,0,0,0]
["Craig Anderson","Buf - G",35,519,17,1,37]
["Jake Allen","Mon - G",51,521,20,2,46]
["Philipp Grubauer","Sea - G",54,525,22,3,53]
["Joey Daccord","Sea - G",2,527,1,0,2]
["Andrew Hammond","Fla - G",1,532,0,0,0]
["Filip Gustavsson","Min - G",25,541,14,1,31]
["David Rittich","Wpg - G",22,545,8,1,19]
["MacKenzie Blackwood","NJ - G",33,558,14,2,34]
["Dustin Tokarski","Pit - G",6,561,9,0,18]
["Aaron Dell","SJ - G",10,564,0,0,0]
["Jon Gillies","Ari - G",26,601,6,0,12]
["Jonas Johansson","Ari - G",4,616,2,0,4]
["Cayden Primeau","Mon - G",6,620,1,0,2]
["Thomas Greiss","StL - G",33,637,16,1,35]
["Martin Jones","Sea - G",25,680,8,1,19]
["Kevin Lankinen","Nsh - G",21,694,8,1,19]
["Sam Montembeault","Mon - G",33,743,12,1,27]
["Joonas Korpisalo","Cls - G",32,778,9,0,18]
["Karel Vejmelka","Ari - G",56,803,19,1,41]

{"sheet":"Data","index":8,"n_rows":51,"n_cols":7,"rows_kept":51}
["Owners - change team names here","Position"]
["Phenomenal Team (Brad)","goalie 1"]
["Amazing Team (Brandon)","goalie 2"]
["Barons (Bruce)","defence #1"]
["Champion Team (Cathy)","defence #2"]
["Bruins (Jessica)","defence #3"]
["Woap (Mike)","defence #4"]
["Nice Team (Nick)","left wing #1"]
["Kayi Alps (Rhonda)","left wing #2"]
["Lugnuts (Rob)","left wing #3"]
["Fine Team (Todd)","right wing #1"]
["n/a","right wing #2"]
[null,"right wing #3"]
[null,"centre #1"]
[null,"centre #2"]
[null,"centre #3"]
[null,"utility"]
[null,"Reserve Roster #1"]
[null,"Reserve Roster #2"]
[null,"Reserve Roster #3"]
[null,"Reserve Roster #4"]
[null,"Reserve Roster #5"]
[null,"Reserve Roster #6"]
[null,"Reserve Roster #7"]
["Make sure every year to select all the players for each position and recreate the bookmark name (delete name first, then recreate name) to ensure all players get listed.",null,"goalie","defence","left wing","right wing","centre"]
["Ensure that all players are listed when clicking on the button."]
[]
["When changing the toolbar, customize/hockey/attach/delete previous hockey/reattach new hockey toolbar."]
["Draft Order - only have to change draft numbers as all the teams are linked"]
[{"$f":"A2","v":"Phenomenal Team (Brad)"},1]
[{"$f":"A3","v":"Amazing Team (Brandon)"},2]
["Barons (Bruce)",3]
["Champion Team (Cathy)",4]
["Bruins (Jessica)",5]
["Woap (Mike)",6]
["Nice Team (Nick)",7]
["Kayi Alps (Rhonda)",8]
["Lugnuts (Rob)",9]
["Fine Team (Todd)",10]
["n/a",11]
[]
["Formulas to Retreive Name and Position"]
["=RIGHT(A1,LEN(A1)+ 5-FIND(\"-\",A1))","Position"]
["=LEFT(A1,FIND(\"-\",A1) -5)","Name"]
["=Trim(cell)","Trim the positions for extra space"]
[]
[]
["When changing names, change the following:"]
["Draft Roster Tab - Change name of team in the draft order cell."]
["Visual Basic - Find and replace old name with new name, ensure that project is selected so it changes it for all forms."]
["Data Tab (this tab) - change team names at the top of this page"]