{"text_format":"3","workbook":"xlsx","n_sheets":9,"sheets":["Draft Roster","Draft List","Summary","Centre","Left Wing","Right Wing","Defence","Goalies","Data"],"not_rendered":{"macros":1,"external_links":1,"defined_names":46},"read":"whole","date_system":"1900"}

{"sheet":"Draft Roster","index":0,"n_rows":27,"n_cols":45,"rows_kept":27,"merged":[[0,1,0,4],[0,5,0,8],[0,9,0,12],[0,13,0,16],[0,17,0,20],[0,21,0,24],[0,25,0,28],[0,29,0,32],[0,33,0,36],[0,37,0,40],[0,41,0,44],[1,1,1,4],[1,5,1,8],[1,9,1,12],[1,13,1,16],[1,17,1,20],[1,21,1,24],[1,25,1,28],[1,29,1,32],[1,33,1,36],[1,37,1,39],[1,41,1,43],[21,1,21,2],[21,5,21,6],[21,13,21,14],[21,17,21,18],[21,21,21,22],[21,25,21,26],[21,29,21,30],[21,33,21,34],[21,37,21,38],[21,41,21,42],[22,1,22,2],[22,5,22,6],[22,9,22,10],[22,13,22,14],[22,17,22,18],[22,21,22,22],[22,25,22,26],[22,29,22,30],[22,33,22,34],[22,37,22,38],[22,41,22,42]]}
[null,{"$f":"C25","v":"Draft Order = 11"},{"$nulls":3},{"$f":"G25","v":"Draft Order = 10"},{"$nulls":3},{"$f":"K25","v":"Draft Order = 9"},{"$nulls":3},{"$f":"O25","v":"Draft Order = 7"},{"$nulls":3},{"$f":"S25","v":"Draft Order = 3"},{"$nulls":3},{"$f":"W25","v":"Draft Order = 2"},{"$nulls":3},{"$f":"AA25","v":"Draft Order = 5"},{"$nulls":3},{"$f":"AE25","v":"Draft Order = 4"},{"$nulls":3},{"$f":"AI25","v":"Draft Order = 6"},{"$nulls":3},{"$f":"AM25","v":"Draft Order = 8"},{"$nulls":3},{"$f":"AQ25","v":"Draft Order = 1"}]
[null,"Bruins (Bruce)",{"$nulls":3},"Dominant Brandon (Brandon)",{"$nulls":3},"Booya's (Cathy)",{"$nulls":3},"  VanekDownByTheRiver (Colin)",{"$nulls":3},"Woap (Mike)",{"$nulls":3},"Tad Nugents (Nick)",{"$nulls":3},"Riverdogs (Rhonda)",{"$nulls":3},"Robs Chiefs (Rob)",{"$nulls":3},"Curtis Crazy Canucks (Todd)",{"$nulls":3},"Cold Warriors (Tom)",{"$nulls":3},"Brad's Boss Team (Brad)"]
[null,"Pos.","Player","$","years","Pos.","Player","$","years","Pos.","Player","$","years","Pos.","Player","$","years","Pos.","Player","$","years","Pos.","Player","$","years","Pos.","Player","$","years","Pos.","Player","$","years","Pos.","Player","$","years","Pos.","Player","$","years","Pos.","Player","$","years"]
[{"$f":"22-COUNT(D4,H4,L4,P4,T4,X4, AB4,AF4,AJ4,AN4,D5,H5,L5,P5,T5,X5,AB5,AF5,AJ5,AN5)","v":9},"G1","Tuukka Rask \nBos - G",4,1,"G1","Jake Allen \nStL - G",8,1,"G1","Devan Dubnyk \nMin - G",3,1,"G1","Braden Holtby \nWas - G",14,1,"G1",{"$nulls":3},"G1",{"$nulls":3},"G1","Frederik Andersen \nTor - G",3,1,"G1",{"$nulls":3},"G1","Craig Anderson \nOtt - G",3,1,"G1","Cam Talbot \nEdm - G",3,1,"G1"]
[null,"G2","Martin Jones\n SJ - G",6,1,"G2","Mike Smith \nCgy - G",3,1,"G2","Andrei Vasilevskiy\n TB - G",3,1,"G2",{"$nulls":3},"G2",{"$nulls":3},"G2",{"$nulls":3},"G2",{"$nulls":3},"G2","Matt Murray \nPit - G",4,2,"G2","Carey Price \nMon - G",14,2,"G2","Sergei Bobrovsky \nCls - G",3,1,"G2"]
[{"$f":"44-COUNT(D6:D9,H6:H9,L6:L9,P6:P9,T6:T9,X6:X9,AB6:AB9,AF6:AF9,AJ6:AJ9,AN6:AN9)","v":26},"D",{"$nulls":3},"D","Nick Leddy \nNYI - D",1,1,"D","Brent Burns\n SJ - D",17,1,"D","Erik Karlsson \nOtt - D",31,1,"D","Rasmus Ristolainen \nBuf - D",6,1,"D","Alec Martinez\n LA - D",1,1,"D","P.K. Subban \nNsh - D",19,1,"D","Jacob Trouba \nWpg - D",3,1,"D","Hampus Lindholm \nAnh - D",6,1,"D",{"$nulls":3},"D"]
[null,"D",{"$nulls":3},"D",{"$nulls":3},"D","Duncan Keith \nChi - D",12,1,"D","Zach Werenski \nCls - D",3,1,"D",{"$nulls":3},"D",{"$nulls":3},"D",{"$nulls":3},"D","Ryan Suter \nMin - D",4,1,"D",{"$nulls":3},"D",{"$nulls":3},"D"]
[null,"D",{"$nulls":3},"D",{"$nulls":3},"D","John Carlson \nWas - D",16,1,"D","Justin Schultz \nPit - D",3,1,"D",{"$nulls":3},"D",{"$nulls":3},"D",{"$nulls":3},"D",{"$nulls":3},"D",{"$nulls":3},"D","T.J. Brodie \nCgy - D",2,1,"D"]
[null,"D","Cam Fowler \nAnh - D",6,2,"D",{"$nulls":3},"D",{"$nulls":3},"D","Roman Josi \nNsh - D",7,1,"D",{"$nulls":3},"D","Kevin Shattenkirk \nNYR - D",4,1,"D",{"$nulls":3},"D",{"$nulls":3},"D",{"$nulls":3},"D","Shayne Gostisbehere \nPhi - D",9,2,"D"]
[{"$f":"33-COUNT(D10:D12,H10:H12,L10:L12,P10:P12,#REF!,T10:T12,X10:X12,AB10:AB12,AF10:AF12,AJ10:AJ12,AN10:AN12)","v":16},"LW","Jaden Schwartz \nStL - LW",13,1,"LW",{"$nulls":3},"LW",{"$nulls":3},"LW",{"$nulls":3},"LW","Jonathan Drouin \nMon - LW,RW",8,1,"LW","Jussi Jokinen \nEdm - LW",6,1,"LW","Rickard Rakell \nAnh - C,LW",3,1,"LW","Nino Niederreiter \nMin - LW,RW",3,1,"LW","Brayden Schenn \nStL - C,LW",1,1,"LW",{"$nulls":3},"LW"]
[null,"LW","Artemi Panarin \nCls - C,LW",7,2,"LW","Jeff Skinner \nCar - LW",4,2,"LW","Filip Forsberg \nNsh - LW",9,1,"LW",{"$nulls":3},"LW",{"$nulls":3},"LW","Max Domi \nAri - LW",6,1,"LW","Loui Eriksson \nVan - LW,RW",6,1,"LW",{"$nulls":3},"LW",{"$nulls":3},"LW","Viktor Arvidsson \nNsh - LW,RW",3,1,"LW"]
[null,"LW","Nikolaj Ehlers \nWpg - LW",9,3,"LW","Johnny Gaudreau \nCgy - LW",9,2,"LW","Andre Burakovsky \nWas - LW,RW",6,2,"LW",{"$nulls":3},"LW",{"$nulls":3},"LW",{"$nulls":3},"LW",{"$nulls":3},"LW","James van Riemsdyk \nTor - LW",4,2,"LW",{"$nulls":3},"LW","Jonathan Huberdeau \nFla - LW",6,1,"LW"]
[{"$f":"33-COUNT(D13:D15,H13:H15,L13:L15,P13:P15,T13:T15,X13:X15,AB13:AB15,AF13:AF15,AJ13:AJ15,AN13:AN15)","v":18},"RW","Patrick Kane \nChi - RW",33,1,"RW",{"$nulls":3},"RW",{"$nulls":3},"RW",{"$nulls":3},"RW",{"$nulls":3},"RW","Wayne Simmonds \nPhi - RW",4,1,"RW",{"$nulls":3},"RW",{"$nulls":3},"RW","Mats Zuccarello \nNYR - RW",1,1,"RW",{"$nulls":3},"RW"]
[null,"RW","Vladimir Tarasenko \nStL - RW",8,1,"RW",{"$nulls":3},"RW","Conor Sheary \nPit - LW,RW",6,2,"RW",{"$nulls":3},"RW","Dylan Larkin \nDet - C,RW",9,2,"RW","James Neal \nVGK - LW,RW",9,1,"RW",{"$nulls":3},"RW",{"$nulls":3},"RW",{"$nulls":3},"RW","T.J. Oshie \nWas - RW",3,1,"RW"]
[null,"RW","David Pastrnak \nBos - RW",9,3,"RW",{"$nulls":3},"RW","Mitchell Marner \nTor - C,RW",9,3,"RW","Jordan Eberle \nNYI - RW",15,2,"RW","Patrik Laine \nWpg - RW",20,3,"RW",{"$nulls":3},"RW","Sebastian Aho \nCar - LW,RW",9,3,"RW",{"$nulls":3},"RW","Alexander Radulov \nDal - RW",6,2,"RW","Cam Atkinson \nCls - RW",6,2,"RW"]
[{"$f":"33-COUNT(D16:D18,H16:H18,L16:L18,P16:P18,T16:T18,X16:X18,AB16:AB18,AF16:AF18,AJ16:AJ18,AN16:AN18)","v":15},"C",{"$nulls":3},"C","Eric Staal \nMin - C",3,1,"C","John Tavares \nNYI - C",40,1,"C","Tyler Johnson\n TB - C",7,1,"C",{"$nulls":3},"C","Patrice Bergeron \nBos - C",10,1,"C","Mark Scheifele \nWpg - C",4,1,"C","Jonathan Toews \nChi - C",6,1,"C","Aleksander Barkov \nFla - C",6,1,"C",{"$nulls":3},"C"]
[null,"C",{"$nulls":3},"C","Sidney Crosby \nPit - C",35,1,"C",{"$nulls":3},"C","Alex Galchenyuk \nMon - C,LW",9,1,"C","Ryan Johansen \nNsh - C",10,2,"C",{"$nulls":3},"C","Mika Zibanejad \nNYR - C",1,1,"C",{"$nulls":3},"C",{"$nulls":3},"C","Alexander Wennberg \nCls - C",3,1,"C"]
[null,"C",{"$nulls":3},"C","Jeff Carter\n LA - C",5,2,"C",{"$nulls":3},"C","Jack Eichel \nBuf - C",11,3,"C","Auston Matthews \nTor - C",20,3,"C",{"$nulls":3},"C",{"$nulls":3},"C","Henrik Zetterberg \nDet - C,LW",5,2,"C","Connor McDavid \nEdm - C",34,2,"C","William Nylander \nTor - C,RW",9,3,"C"]
[{"$f":"11-COUNT(D19,H19,L19,P19,T19,X19,AB19,AF19,AJ19,AN19)","v":11},"U",{"$nulls":3},"U",{"$nulls":3},"U",{"$nulls":3},"U",{"$nulls":3},"U",{"$nulls":3},"U",{"$nulls":3},"U",{"$nulls":3},"U",{"$nulls":3},"U",{"$nulls":3},"U",{"$nulls":3},"U"]
[null,null,"Current Used Points",{"$f":"SUM(D4:D19)","v":95},null,null,"Current Used Points",{"$f":"SUM(H4:H19)","v":68},null,null,"Current Used Points",{"$f":"SUM(L4:L19)","v":121},null,null,"Current Used Points",{"$f":"SUM(P4:P19)","v":100},null,null,"Current Used Points",{"$f":"SUM(T4:T19)","v":73},null,null,"Current Used Points",{"$f":"SUM(X4:X19)","v":40},null,null,"Current Used Points",{"$f":"SUM(AB4:AB19)","v":45},null,null,"Current Used Points",{"$f":"SUM(AF4:AF19)","v":29},null,null,"Current Used Points",{"$f":"SUM(AJ4:AJ19)","v":71},null,null,"Current Used Points",{"$f":"SUM(AN4:AN19)","v":47},null,null,"Current Used Points",{"$f":"SUM(AR4:AR19)","v":0}]
[null,null,"Remaining Points",{"$f":"SUM(150-D20)","v":55},null,null,"Remaining Points",{"$f":"SUM(150-H20)","v":82},null,null,"Remaining Points",{"$f":"SUM(150-L20)","v":29},null,null,"Remaining Points",{"$f":"SUM(150-P20)","v":50},null,null,"Remaining Points",{"$f":"SUM(150-T20)","v":77},null,null,"Remaining Points",{"$f":"SUM(150-X20)","v":110},null,null,"Remaining Points",{"$f":"SUM(150-AB20)","v":105},null,null,"Remaining Points",{"$f":"SUM(150-AF20)","v":121},null,null,"Remaining Points",{"$f":"SUM(150-AJ20)","v":79},null,null,"Remaining Points",{"$f":"SUM(150-AN20)","v":103},null,null,"Remaining Points",{"$f":"SUM(150-AR20)","v":150}]
[null,"Maximum Bidding Points",null,{"$f":"(D21-(16-COUNT(D4:D19))+(IF(COUNT(D4:D19)=16,0,1)))","v":49},null,"Maximum Bidding Points",null,{"$f":"(H21-(16-COUNT(H4:H19))+(IF(COUNT(H4:H19)=16,0,1)))","v":75},null,null,"Maximum Bidding Points",{"$f":"(L21-(16-COUNT(L4:L19))+(IF(COUNT(L4:L19)=16,0,1)))","v":24},null,"Maximum Bidding Points",null,{"$f":"(P21-(16-COUNT(P4:P19))+(IF(COUNT(P4:P19)=16,0,1)))","v":44},null,"Maximum Bidding Points",null,{"$f":"(T21-(16-COUNT(T4:T19))+(IF(COUNT(T4:T19)=16,0,1)))","v":68},null,"Maximum Bidding Points",null,{"$f":"(X21-(16-COUNT(X4:X19))+(IF(COUNT(X4:X19)=16,0,1)))","v":102},null,"Maximum Bidding Points",null,{"$f":"(AB21-(16-COUNT(AB4:AB19))+(IF(COUNT(AB4:AB19)=16,0,1)))","v":97},null,"Maximum Bidding Points",null,{"$f":"(AF21-(16-COUNT(AF4:AF19))+(IF(COUNT(AF4:AF19)=16,0,1)))","v":113},null,"Maximum Bidding Points",null,{"$f":"(AJ21-(16-COUNT(AJ4:AJ19))+(IF(COUNT(AJ4:AJ19)=16,0,1)))","v":72},null,"Maximum Bidding Points",null,{"$f":"(AN21-(16-COUNT(AN4:AN19))+(IF(COUNT(AN4:AN19)=16,0,1)))","v":98},null,"Maximum Bidding Points",null,{"$f":"(AR21-(16-COUNT(AR4:AR19))+(IF(COUNT(AR4:AR19)=16,0,1)))","v":135}]
[null,"Remaining Players to Draft",null,{"$f":"16-COUNT(D4:D19)","v":7},null,"Remaining Players to Draft",null,{"$f":"16-COUNT(H4:H19)","v":8},null,"Remaining Players to Draft",null,{"$f":"16-COUNT(L4:L19)","v":6},null,"Remaining Players to Draft",null,{"$f":"16-COUNT(P4:P19)","v":7},null,"Remaining Players to Draft",null,{"$f":"16-COUNT(T4:T19)","v":10},null,"Remaining Players to Draft",null,{"$f":"16-COUNT(X4:X19)","v":9},null,"Remaining Players to Draft",null,{"$f":"16-COUNT(AB4:AB19)","v":9},null,"Remaining Players to Draft",null,{"$f":"16-COUNT(AF4:AF19)","v":9},null,"Remaining Players to Draft",null,{"$f":"16-COUNT(AJ4:AJ19)","v":8},null,"Remaining Players to Draft",null,{"$f":"16-COUNT(AN4:AN19)","v":6},null,"Remaining Players to Draft",null,{"$f":"16-COUNT(AR4:AR19)","v":16}]
[]
[null,null,{"$f":"\"Draft Order = \"&VLOOKUP(\"Bruins (Bruce)\",draftorder,2,FALSE)","v":"Draft Order = 11"},{"$nulls":3},{"$f":"\"Draft Order = \"&VLOOKUP(\"Dominant Brandon (Brandon)\",draftorder,2,FALSE)","v":"Draft Order = 10"},{"$nulls":3},{"$f":"\"Draft Order = \"&VLOOKUP(\"Booya's (Cathy)\",draftorder,2,FALSE)","v":"Draft Order = 9"},{"$nulls":3},{"$f":"\"Draft Order = \"&VLOOKUP(\"VanekDownByTheRiver (Colin)\",draftorder,2,FALSE)","v":"Draft Order = 7"},{"$nulls":3},{"$f":"\"Draft Order = \"&VLOOKUP(\"Woap (Mike)\",draftorder,2,FALSE)","v":"Draft Order = 3"},{"$nulls":3},{"$f":"\"Draft Order = \"&VLOOKUP(\"Tad Nugents (Nick)\",draftorder,2,FALSE)","v":"Draft Order = 2"},{"$nulls":3},{"$f":"\"Draft Order = \"&VLOOKUP(\"Riverdogs (Rhonda)\",draftorder,2,FALSE)","v":"Draft Order = 5"},{"$nulls":3},{"$f":"\"Draft Order = \"&VLOOKUP(\"Robs Chiefs (Rob)\",draftorder,2,FALSE)","v":"Draft Order = 4"},{"$nulls":3},{"$f":"\"Draft Order = \"&VLOOKUP(\"Curtis Crazy Canucks (Todd)\",draftorder,2,FALSE)","v":"Draft Order = 6"},{"$nulls":3},{"$f":"\"Draft Order = \"&VLOOKUP(\"Cold Warriors (Tom)\",draftorder,2,FALSE)","v":"Draft Order = 8"},{"$nulls":3},{"$f":"\"Draft Order = \"&VLOOKUP(\"Brad's Boss Team (Brad)\",draftorder,2,FALSE)","v":"Draft Order = 1"}]
[null,null,"Jesse Puljujarvi \nEdm - RW",2,"r2017",{"$nulls":9},"Matthew Tkachuk \nCgy - LW",3,"r2017",null,"Mikko Rantanen \nCol - LW,RW",3,"r2017",{"$nulls":9},"Ryan Nugent-Hopkins\nEdm - C",3,"r2017",null,"Dylan Strome \nAri - C",3,"r2017",null,"Jake Guentzel\nPit - C,LW",3,"r2017"]
[null,null,"Clayton Keller \nAri - C",3,"r2017"]

{"sheet":"Draft List","index":1,"n_rows":89,"n_cols":9,"rows_kept":89}
[88,"Team","Player","Bid","NHL Team","Rank","Points","Wins","Shutouts"]
[1,"Cold Warriors (Tom)","Cam Talbot ",3,"Edm - G",26,42,7,91]
[2,"Cold Warriors (Tom)","Sergei Bobrovsky ",3,"Cls - G",25,41,7,89]
[3,"Cold Warriors (Tom)","T.J. Brodie ",2,"Cgy - D",189,36]
[4,"Cold Warriors (Tom)","Shayne Gostisbehere ",9,"Phi - D",136,39]
[5,"Cold Warriors (Tom)","Viktor Arvidsson ",3,"Nsh - LW,RW",117,61]
[6,"Cold Warriors (Tom)","Jonathan Huberdeau ",6,"Fla - LW",77,26]
[7,"Cold Warriors (Tom)","Cam Atkinson ",6,"Cls - RW",74,62]
[8,"Cold Warriors (Tom)","T.J. Oshie ",3,"Was - RW",86,56]
[9,"Cold Warriors (Tom)","Alexander Wennberg ",3,"Cls - C",145,59]
[10,"Cold Warriors (Tom)","William Nylander ",9,"Tor - C,RW",52,61]
[11,"Cold Warriors (Tom)","Jake Guentzel ",3,"Pit - C,LW",123,33]
[12,"Riverdogs (Rhonda)","Frederik Andersen ",3,"Tor - G",76,33,4,70]
[13,"Riverdogs (Rhonda)","P.K. Subban ",19,"Nsh - D",40,40]
[14,"Riverdogs (Rhonda)","Rickard Rakell ",3,"Anh - C,LW",97,51]
[15,"Riverdogs (Rhonda)","Loui Eriksson ",6,"Van - LW,RW",165,24]
[16,"Riverdogs (Rhonda)","Sebastian Aho ",9,"Car - LW,RW",91,49]
[17,"Riverdogs (Rhonda)","Mark Scheifele ",4,"Wpg - C",20,82]
[18,"Riverdogs (Rhonda)","Mika Zibanejad ",1,"NYR - C",157,37]
[19,"Woap (Mike)","Rasmus Ristolainen ",6,"Buf - D",71,45]
[20,"Woap (Mike)","Jonathan Drouin ",8,"Mon - LW,RW",99,53]
[21,"Woap (Mike)","Dylan Larkin ",9,"Det - C,RW",153,32]
[22,"Woap (Mike)","Patrik Laine ",20,"Wpg - RW",13,64]
[23,"Woap (Mike)","Ryan Johansen ",10,"Nsh - C",75,61]
[24,"Woap (Mike)","Auston Matthews ",20,"Tor - C",4,69]
[25,"Woap (Mike)","Mikko Rantanen ",3,"Col - LW,RW",253,39]
[26,"VanekDownByTheRiver (Colin)","Braden Holtby ",14,"Was - G",15,42,9,93]
[27,"VanekDownByTheRiver (Colin)","Erik Karlsson ",31,"Ott - D",17,71]
[28,"VanekDownByTheRiver (Colin)","Zach Werenski ",3,"Cls - D",54,47]
[29,"VanekDownByTheRiver (Colin)","Justin Schultz ",3,"Pit - D",89,51]
[30,"VanekDownByTheRiver (Colin)","Roman Josi ",7,"Nsh - D",33,49]
[31,"VanekDownByTheRiver (Colin)","Jordan Eberle ",15,"NYI - RW",96,51]
[32,"VanekDownByTheRiver (Colin)","Tyler Johnson",7," TB - C",154,45]
[33,"VanekDownByTheRiver (Colin)","Alex Galchenyuk ",9,"Mon - C,LW",131,44]
[34,"VanekDownByTheRiver (Colin)","Jack Eichel ",11,"Buf - C",11,57]
[35,"VanekDownByTheRiver (Colin)","Matthew Tkachuk ",3,"Cgy - LW",168,48]
[36,"Bruins (Bruce)","Tuukka Rask ",4,"Bos - G",49,37,8,82]
[37,"Bruins (Bruce)","Martin Jones",6," SJ - G",46,35,2,72]
[38,"Bruins (Bruce)","Cam Fowler ",6,"Anh - D",143,39]
[39,"Bruins (Bruce)","Nikolaj Ehlers ",9,"Wpg - LW",81,64]
[40,"Bruins (Bruce)","Artemi Panarin ",7,"Cls - C,LW",29,74]
[41,"Bruins (Bruce)","Jaden Schwartz ",13,"StL - LW",105,55]
[42,"Bruins (Bruce)","Patrick Kane ",33,"Chi - RW",3,89]
[43,"Bruins (Bruce)","Vladimir Tarasenko ",8,"StL - RW",7,75]
[44,"Bruins (Bruce)","David Pastrnak ",9,"Bos - RW",43,70]
[45,"Bruins (Bruce)","Jesse Puljujarvi ",2,"Edm - RW",190,8]
[46,"Bruins (Bruce)","Clayton Keller ",3,"Ari - C",261,2]
[47,"Tad Nugents (Nick)","Kevin Shattenkirk ",4,"NYR - D",63,56]
[48,"Tad Nugents (Nick)","Jussi Jokinen ",6,"Edm - LW",201,28]
[49,"Tad Nugents (Nick)","Wayne Simmonds ",4,"Phi - RW",41,54]
[50,"Tad Nugents (Nick)","James Neal ",9,"VGK - LW,RW",102,41]
[51,"Tad Nugents (Nick)","Patrice Bergeron ",10,"Bos - C",50,53]
[52,"Tad Nugents (Nick)","Max Domi ",6,"Ari - LW",138,38]
[53,"Tad Nugents (Nick)","Alec Martinez",1," LA - D",241,39]
[54,"Booya's (Cathy)","Devan Dubnyk ",3,"Min - G",56,40,5,85]
[55,"Booya's (Cathy)","Andrei Vasilevskiy",3," TB - G",60,23,2,48]
[56,"Booya's (Cathy)","Brent Burns",17," SJ - D",6,76]
[57,"Booya's (Cathy)","Duncan Keith ",12,"Chi - D",36,53]
[58,"Booya's (Cathy)","John Carlson ",16,"Was - D",127,37]
[59,"Booya's (Cathy)","Andre Burakovsky ",6,"Was - LW,RW",125,35]
[60,"Booya's (Cathy)","Conor Sheary ",6,"Pit - LW,RW",126,53]
[61,"Booya's (Cathy)","Mitchell Marner ",9,"Tor - C,RW",31,61]
[62,"Booya's (Cathy)","Filip Forsberg ",9,"Nsh - LW",42,58]
[63,"Booya's (Cathy)","John Tavares ",40,"NYI - C",21,66]
[64,"Robs Chiefs (Rob)","Matt Murray ",4,"Pit - G",22,32,4,68]
[65,"Robs Chiefs (Rob)","Jacob Trouba ",3,"Wpg - D",156,33]
[66,"Robs Chiefs (Rob)","Ryan Suter ",4,"Min - D",82,40]
[67,"Robs Chiefs (Rob)","James van Riemsdyk ",4,"Tor - LW",80,62]
[68,"Robs Chiefs (Rob)","Nino Niederreiter ",3,"Min - LW,RW",132,57]
[69,"Robs Chiefs (Rob)","Jonathan Toews ",6,"Chi - C",83,58]
[70,"Robs Chiefs (Rob)","Henrik Zetterberg ",5,"Det - C,LW",167,68]
[71,"Robs Chiefs (Rob)","Ryan Nugent-Hopkins",3,"Edm - C",248,43]
[72,"Curtis Crazy Canucks (Todd)","Carey Price ",14,"Mon - G",5,37,3,77]
[73,"Curtis Crazy Canucks (Todd)","Craig Anderson ",3,"Ott - G",108,25,5,55]
[74,"Curtis Crazy Canucks (Todd)","Hampus Lindholm ",6,"Anh - D",284,20]
[75,"Curtis Crazy Canucks (Todd)","Brayden Schenn ",1,"StL - C,LW",85,55]
[76,"Curtis Crazy Canucks (Todd)","Alexander Radulov ",6,"Dal - RW",87,54]
[77,"Curtis Crazy Canucks (Todd)","Mats Zuccarello ",1,"NYR - RW",146,59]
[78,"Curtis Crazy Canucks (Todd)","Connor McDavid ",34,"Edm - C",1,100]
[79,"Curtis Crazy Canucks (Todd)","Aleksander Barkov ",6,"Fla - C",66,52]
[80,"Curtis Crazy Canucks (Todd)","Dylan Strome ",3,"Ari - C",244,1]
[81,"Dominant Brandon (Brandon)","Jake Allen ",8,"StL - G",32,33,4,70]
[82,"Dominant Brandon (Brandon)","Mike Smith ",3,"Cgy - G",92,19,3,41]
[83,"Dominant Brandon (Brandon)","Nick Leddy ",1,"NYI - D",225,46]
[84,"Dominant Brandon (Brandon)","Jeff Skinner ",4,"Car - LW",84,63]
[85,"Dominant Brandon (Brandon)","Johnny Gaudreau ",9,"Cgy - LW",34,61]
[86,"Dominant Brandon (Brandon)","Eric Staal ",3,"Min - C",116,65]
[87,"Dominant Brandon (Brandon)","Sidney Crosby ",35,"Pit - C",2,89]
[88,"Dominant Brandon (Brandon)","Jeff Carter",5," LA - C",62,66]

{"sheet":"Summary","index":2,"n_rows":13,"n_cols":11,"rows_kept":13}
["Owners","Current Used Points","Remaining Points","Maximum Bidding Points","Remaining # Players to Draft","Goalies","Defence","Left Wingers","Right Wingers","Centres","Utility"]
["Bruins (Bruce)",95,55,49,7,{"$f":"2-COUNT('Draft Roster'!D4:D5)","v":0},{"$f":"4-COUNT('Draft Roster'!D6:D9)","v":3},{"$f":"3-COUNT('Draft Roster'!D10:D12)","v":0},{"$f":"3-COUNT('Draft Roster'!D13:D15)","v":0},{"$f":"3-COUNT('Draft Roster'!D16:D18)","v":3},{"$f":"1-COUNT('Draft Roster'!D19)","v":1}]
["Dominant Brandon (Brandon)",68,82,75,8,{"$f":"2-COUNT('Draft Roster'!H4:H5)","v":0},{"$f":"4-COUNT('Draft Roster'!H6:H9)","v":3},{"$f":"3-COUNT('Draft Roster'!H10:H12)","v":1},{"$f":"3-COUNT('Draft Roster'!H13:H15)","v":3},{"$f":"3-COUNT('Draft Roster'!H16:H18)","v":0},{"$f":"1-COUNT('Draft Roster'!H19)","v":1}]
["Booya's (Cathy)",121,29,24,6,{"$f":"2-COUNT('Draft Roster'!L4:L5)","v":0},{"$f":"4-COUNT('Draft Roster'!L6:L9)","v":1},{"$f":"3-COUNT('Draft Roster'!L10:L12)","v":1},{"$f":"3-COUNT('Draft Roster'!L13:L15)","v":1},{"$f":"3-COUNT('Draft Roster'!L16:L18)","v":2},{"$f":"1-COUNT('Draft Roster'!L19)","v":1}]
["VanekDownByTheRiver (Colin)",100,50,44,7,{"$f":"2-COUNT('Draft Roster'!P4:P5)","v":1},{"$f":"4-COUNT('Draft Roster'!P6:P9)","v":0},{"$f":"3-COUNT('Draft Roster'!P10:P12)","v":3},{"$f":"3-COUNT('Draft Roster'!P13:P15)","v":2},{"$f":"3-COUNT('Draft Roster'!P16:P18)","v":0},{"$f":"1-COUNT('Draft Roster'!P19)","v":1}]
["Woap (Mike)",73,77,68,10,{"$f":"2-COUNT('Draft Roster'!T4:T5)","v":2},{"$f":"4-COUNT('Draft Roster'!T6:T9)","v":3},{"$f":"3-COUNT('Draft Roster'!T10:T12)","v":2},{"$f":"3-COUNT('Draft Roster'!T13:T15)","v":1},{"$f":"3-COUNT('Draft Roster'!T16:T18)","v":1},{"$f":"1-COUNT('Draft Roster'!T19)","v":1}]
["Tad Nugents (Nick)",40,110,102,9,{"$f":"2-COUNT('Draft Roster'!X4:X5)","v":2},{"$f":"4-COUNT('Draft Roster'!X6:X9)","v":2},{"$f":"3-COUNT('Draft Roster'!X10:X12)","v":1},{"$f":"3-COUNT('Draft Roster'!X13:X15)","v":1},{"$f":"3-COUNT('Draft Roster'!X16:X18)","v":2},{"$f":"1-COUNT('Draft Roster'!X19)","v":1}]
["Riverdogs (Rhonda)",45,105,97,9,{"$f":"2-COUNT('Draft Roster'!AB4:AB5)","v":1},{"$f":"4-COUNT('Draft Roster'!AB6:AB9)","v":3},{"$f":"3-COUNT('Draft Roster'!AB10:AB12)","v":1},{"$f":"3-COUNT('Draft Roster'!AB13:AB15)","v":2},{"$f":"3-COUNT('Draft Roster'!AB16:AB18)","v":1},{"$f":"1-COUNT('Draft Roster'!AB19)","v":1}]
["Robs Chiefs (Rob)",29,121,113,9,{"$f":"2-COUNT('Draft Roster'!AF4:AF5)","v":1},{"$f":"4-COUNT('Draft Roster'!AF6:AF9)","v":2},{"$f":"3-COUNT('Draft Roster'!AF10:AF12)","v":1},{"$f":"3-COUNT('Draft Roster'!AF13:AF15)","v":3},{"$f":"3-COUNT('Draft Roster'!AF16:AF18)","v":1},{"$f":"1-COUNT('Draft Roster'!AF19)","v":1}]
["Curtis Crazy Canucks (Todd)",71,79,72,8,{"$f":"2-COUNT('Draft Roster'!AJ4:AJ5)","v":0},{"$f":"4-COUNT('Draft Roster'!AJ6:AJ9)","v":3},{"$f":"3-COUNT('Draft Roster'!AJ10:AJ12)","v":2},{"$f":"3-COUNT('Draft Roster'!AJ13:AJ15)","v":1},{"$f":"3-COUNT('Draft Roster'!AJ16:AJ18)","v":1},{"$f":"1-COUNT('Draft Roster'!AJ19)","v":1}]
["Cold Warriors (Tom)",47,103,98,6,{"$f":"2-COUNT('Draft Roster'!AN4:AN5)","v":0},{"$f":"4-COUNT('Draft Roster'!AN6:AN9)","v":2},{"$f":"3-COUNT('Draft Roster'!AN10:AN12)","v":1},{"$f":"3-COUNT('Draft Roster'!AN13:AN15)","v":1},{"$f":"3-COUNT('Draft Roster'!AN16:AN18)","v":1},{"$f":"1-COUNT('Draft Roster'!AN19)","v":1}]
["Brad's Boss Team (Brad)",0,150,135,16,{"$f":"2-COUNT('Draft Roster'!AR4:AR5)","v":2},{"$f":"4-COUNT('Draft Roster'!AR6:AR9)","v":4},{"$f":"3-COUNT('Draft Roster'!AR10:AR12)","v":3},{"$f":"3-COUNT('Draft Roster'!AR13:AR15)","v":3},{"$f":"3-COUNT('Draft Roster'!AR16:AR18)","v":3},{"$f":"1-COUNT('Draft Roster'!AR19)","v":1}]
[{"$nulls":4},{"$f":"SUM(E2:E12)","v":95},{"$f":"SUM(F2:F12)","v":9},{"$f":"SUM(G2:G12)","v":26},{"$f":"SUM(H2:H12)","v":16},18,15,11]

{"sheet":"Centre","index":3,"n_rows":238,"n_cols":5,"rows_kept":238}
["Player","Team","GP","O-Rank","Points"]
["Evgeni Malkin ","Pit - C",62,10,72]
["Leon Draisaitl ","Edm - C,RW",82,16,77]
["Nicklas Backstrom ","Was - C",82,19,86]
["Tyler Seguin ","Dal - C,RW",82,24,72]
["Steven Stamkos"," TB - C",17,30,20]
["Joe Pavelski"," SJ - C,RW",81,38,68]
["Evgeny Kuznetsov ","Was - C",82,47,59]
["Ryan Getzlaf ","Anh - C",74,48,73]
["Sean Monahan ","Cgy - C",82,55,58]
["Claude Giroux ","Phi - C",82,64,58]
["Logan Couture"," SJ - C",73,65,52]
["Anze Kopitar"," LA - C",76,70,52]
["Mikael Granlund ","Min - C,RW",81,72,69]
["Jason Spezza ","Dal - C,RW",68,103,50]
["Kyle Turris ","Ott - C",78,104,55]
["Ryan Kesler ","Anh - C",82,106,58]
["Ryan O'Reilly ","Buf - C",72,109,55]
["Nathan MacKinnon ","Col - C",82,111,53]
["Nazem Kadri ","Tor - C",82,112,61]
["Tyler Toffoli"," LA - C,RW",63,118,34]
["Alexander Steen ","StL - C,LW",76,137,51]
["Patrick Marleau ","Tor - C,LW",82,144,46]
["Derek Stepan ","Ari - C",81,148,55]
["Bryan Little ","Wpg - C",59,150,47]
["Sam Reinhart ","Buf - C,RW",79,152,47]
["Vadim Shipachyov ","VGK - C,LW","-",162,"-"]
["Vincent Trocheck ","Fla - C",82,163,54]
["Bo Horvat ","Van - C",81,169,52]
["Joe Thornton"," SJ - C",79,172,50]
["Tomas Hertl"," SJ - C,LW",49,173,22]
["Teuvo Teravainen ","Car - C,LW",81,179,42]
["Robby Fabbri ","StL - C,LW",51,183,29]
["Henrik Sedin ","Van - C",82,185,51]
["David Krejci ","Bos - C",82,186,54]
["Mikko Koivu ","Min - C",80,188,58]
["Charlie Coyle ","Min - C,RW",82,192,56]
["Ryan Strome ","Edm - C,RW",69,197,30]
["Matt Duchene ","Col - C,RW",77,199,41]
["Boone Jenner ","Cls - C,LW",82,204,34]
["Mikael Backlund ","Cgy - C",81,206,53]
["Adam Henrique"," NJ - C",82,207,40]
["Sam Bennett ","Cgy - C,LW",81,208,26]
["Elias Lindholm ","Car - C,RW",72,216,45]
["Brandon Dubinsky ","Cls - C",80,219,41]
["Artem Anisimov ","Chi - C",64,220,45]
["Victor Rask ","Car - C",82,228,45]
["Martin Hanzal ","Dal - C",71,230,39]
["Tyson Jost ","Col - C",6,232,1]
["Tomas Plekanec ","Mon - C",78,233,28]
["Mathew Barzal ","NYI - C",2,235,0]
["Derick Brassard ","Ott - C",81,242,39]
["Nolan Patrick ","Phi - C","-",246,"-"]
["Jordan Staal ","Car - C",75,255,45]
["Nico Hischier"," NJ - C","-",256,"-"]
["Sean Couturier ","Phi - C",66,262,34]
["Nick Schmaltz ","Chi - C,LW",61,264,28]
["Kevin Hayes ","NYR - C,RW",76,265,49]
["Mathieu Perreault ","Wpg - C,LW",65,266,45]
["Brayden Point"," TB - C,RW",68,267,40]
["Brock Nelson ","NYI - C,LW",81,273,45]
["Frans Nielsen ","Det - C",79,275,41]
["Paul Stastny ","StL - C",66,278,40]
["Ryan Spooner ","Bos - C,LW",78,279,39]
["Jonathan Marchessault ","VGK - C,LW",75,280,51]
["Andreas Athanasiou ","Det - C,LW",64,282,29]
["Nick Bonino ","Nsh - C",80,286,37]
["Frank Vatrano ","Bos - C,LW",44,287,18]
["Zack Smith ","Ott - C,LW",74,289,32]
["Leo Komarov ","Tor - C,LW",82,297,32]
["Carl Soderberg ","Col - C",80,306,14]
["Nick Bjugstad ","Fla - C,RW",54,320,14]
["Andrew Shaw ","Mon - C,RW",68,321,29]
["Jean-Gabriel Pageau","Ott - C",82,323,33]
["Vladislav Namestnikov"," TB - C,LW",74,326,28]
["Sam Gagner ","Van - C,RW",81,327,50]
["Phillip Danault ","Mon - C,LW",82,329,40]
["Valtteri Filppula ","Phi - C",79,330,42]
["Radek Faksa ","Dal - C",80,331,33]
["Pavel Zacha"," NJ - C,LW",70,341,24]
["Jori Lehtera ","Phi - C",64,343,22]
["Tommy Wingels ","Chi - C,RW",73,348,12]
["Tyler Bozak ","Tor - C",78,351,55]
["Travis Zajac"," NJ - C",80,363,45]
["Brian Boyle"," NJ - C,LW",75,381,25]
["Adam Lowry ","Wpg - C",82,389,29]
["Antoine Vermette ","Anh - C",72,390,28]
["Michael Cammalleri"," LA - C,LW",61,395,31]
["Mark Letestu ","Edm - C",78,397,35]
["Patrik Berglund ","StL - C",82,399,34]
["Colin Wilson ","Col - C,LW",70,403,35]
["Erik Haula ","VGK - C,LW",72,407,26]
["Lars Eller ","Was - C",81,408,25]
["Calle Jarnkrok ","Nsh - C,LW",81,409,31]
["Matt Cullen ","Min - C",72,414,31]
["Jay Beagle ","Was - C,RW",81,418,30]
["Micheal Haley ","Fla - C,LW",58,432,12]
["Zach Hyman ","Tor - C,LW",82,433,28]
["Travis Konecny ","Phi - C,LW",70,434,28]
["Casey Cizikas ","NYI - C",59,435,25]
["Colton Sceviour ","Fla - C,RW",80,437,24]
["Trevor Lewis"," LA - C,RW",82,438,24]
["Dominic Moore ","Tor - C",82,440,25]
["Oscar Lindberg ","VGK - C",65,442,20]
["Brandon Sutter ","Van - C,RW",81,444,34]
["Christian Dvorak ","Ari - C",78,447,33]
["Brandon Pirri ","Fla - C,RW",60,448,18]
["Jordan Martinook ","Ari - C,LW",77,450,25]
["Devin Shore ","Dal - C,LW",82,459,33]
["William Karlsson ","VGK - C",81,464,25]
["Cody Eakin ","VGK - C",60,465,12]
["Matt Stajan ","Cgy - C",81,479,23]
["Markus Granlund ","Van - C,LW",69,480,32]
["Melker Karlsson"," SJ - C,LW",67,481,22]
["Torrey Mitchell ","Mon - C,RW",78,485,17]
["Darren Helm ","Det - C",50,488,17]
["Derek MacKenzie ","Fla - C,LW",82,493,16]
["Cedric Paquette"," TB - C,LW",58,494,10]
["Riley Nash ","Bos - C,RW",81,495,17]
["Derek Ryan ","Car - C,RW",67,498,29]
["Marcus Kruger ","Car - C",70,503,17]
["Andrew Copp ","Wpg - C,LW",64,512,17]
["Chris Tierney"," SJ - C",80,516,23]
["Adam Cracknell ","Dal - C,RW",69,518,16]
["Zemgus Girgensons ","Buf - C,LW",75,522,16]
["Nick Cousins ","Ari - C,LW",60,526,16]
["Drake Caggiula ","Edm - C,LW",60,530,18]
["Anthony Beauvillier ","NYI - C,LW",66,534,24]
["David Desharnais ","NYR - C",49,542,14]
["Nick Shore"," LA - C",70,543,17]
["Luke Glendening ","Det - C,RW",74,545,14]
["Andy Andreoff"," LA - C,LW",36,546,2]
["Kyle Brodziak ","StL - C",69,549,15]
["Nic Dowd"," LA - C",70,551,22]
["Tanner Kero ","Chi - C",47,556,16]
["Pierre-Edouard Bellemare","VGK - C,LW",82,562,8]
["Lukas Sedlak ","Cls - C",62,563,13]
["Josh Jooris ","Car - C,RW",54,564,12]
["Alexander Burmistrov ","Van - C",49,566,16]
["Peter Holland ","Mon - C",48,567,12]
["Alan Quine ","NYI - C",61,571,18]
["Eric Fehr ","Tor - C,RW",53,572,11]
["Tim Schaller ","Bos - C,LW",59,577,14]
["Brad Richardson ","Ari - C,RW",16,578,9]
["Jordan Nolan"," LA - C,RW",46,584,8]
["Colton Sissons ","Nsh - C,LW",58,587,10]
["Joe Colborne ","Col - C,RW",62,588,8]
["Johan Larsson ","Buf - C",36,589,11]
["Vinnie Hinostroza ","Chi - C,LW",49,596,14]
["Lance Bouma ","Chi - C,LW",61,599,7]
["Riley Sheahan ","Det - C,RW",80,600,13]
["Jacob Josefson ","Buf - C",38,603,10]
["Logan Shaw ","Anh - C,RW",55,604,10]
["Nic Petan ","Wpg - C,LW",54,605,13]
["Reid Boucher ","Van - C,LW",39,609,10]
["Jordan Weal ","Phi - C,LW",23,611,12]
["Dennis Rasmussen ","Anh - C,LW",68,615,8]
["Marko Dano ","Wpg - C,LW",38,616,11]
["Joseph Blandisi"," NJ - C,LW",27,618,9]
["Jared McCann ","Fla - C,LW",29,624,7]
["Brian Flynn ","Dal - C,RW",51,627,10]
["Tyler Graovac ","Was - C",52,628,9]
["Michael McCarron ","Mon - C,RW",31,631,5]
["Jordan Schroeder ","Cls - C,RW",37,632,13]
["Austin Czarnik ","Bos - C,RW",49,637,13]
["Brendan Gaunce ","Van - C,LW",57,642,5]
["Chris Wagner ","Anh - C,RW",43,646,7]
["Denis Malgin ","Fla - C,RW",47,649,10]
["Michael Chaput ","Van - C,RW",68,652,8]
["Tyler Pitlick ","Dal - C,LW,RW",31,653,11]
["Jayson Megna ","Van - C,RW",58,656,8]
["Gabriel Dumont"," TB - C,LW",39,663,4]
["Nate Thompson ","Ott - C",30,666,2]
["Greg McKegg ","Pit - C,LW",46,667,7]
["Zach Sanford ","StL - C,LW",39,670,8]
["Ivan Barbashev ","StL - C,LW",30,671,12]
["Noel Acciari ","Bos - C,RW",29,680,5]
["Seth Griffith ","Buf - C,LW",24,684,5]
["Michael Sgarbossa ","Wpg - C",38,686,9]
["Yanni Gourde"," TB - C",20,688,8]
["Gemel Smith ","Dal - C,LW",17,689,6]
["Derek Grant ","Anh - C",46,690,4]
["Mattias Janmark ","Dal - C","-",692,"-"]
["Frederik Gauthier ","Tor - C",21,696,3]
["Curtis Lazar ","Cgy - C,RW",37,699,4]
["Evan Rodrigues ","Buf - C,LW",30,700,6]
["Carter Rowney ","Pit - C,RW",27,701,7]
["Adrian Kempe"," LA - C,LW",25,702,6]
["J.T. Compher ","Col - C,LW",21,703,5]
["Laurent Dauphin ","Chi - C,LW",24,708,3]
["Ryan Carpenter"," SJ - C",11,710,4]
["Scott Laughton ","Phi - C,LW",2,712,0]
["Joel Eriksson Ek ","Min - C",15,713,7]
["John Quenneville"," NJ - C,LW",12,715,4]
["Freddie Hamilton ","Cgy - C,RW",26,724,2]
["Cory Conacher"," TB - C",11,725,4]
["Ben Smith ","Tor - C,RW",40,728,4]
["Cody Bass ","Nsh - C,LW",9,732,0]
["Zac Dalpe ","Cls - C",9,736,3]
["Brad Malone ","Edm - C","-",741,"-"]
["Jonny Brodzinski"," LA - C,RW",6,742,2]
["Kyle Rau ","Min - C,RW",24,744,3]
["Jujhar Khaira ","Edm - C,LW",10,749,1]
["Landon Ferraro ","Min - C","-",751,"-"]
["Tomas Nosek ","VGK - C,LW",11,761,1]
["Byron Froese ","Mon - C",6,768,0]
["Ben Street ","Det - C",6,772,1]
["Rocco Grimaldi ","Col - C",4,773,1]
["Christoph Bertschy ","Min - C,RW",5,774,1]
["Connor Brickley ","Fla - C","-",775,"-"]
["Frederick Gaudreau ","Nsh - C,LW",9,776,1]
["Christopher DiDomenico ","Ott - C,RW",3,777,0]
["Sean Kuraly ","Bos - C,LW",8,779,1]
["Jason Dickinson ","Dal - C,LW",10,783,2]
["Tyler Gaudet ","Ari - C,LW",4,785,1]
["Connor Jones ","NYI - C",4,791,0]
["Hunter Shinkaruk ","Cgy - C,LW",7,793,1]
["Oskar Sundqvist ","StL - C",10,796,0]
["Kevin Porter ","Buf - C",2,798,0]
["Zach Sill ","Was - C","-",799,"-"]
["Dominik Simon ","Pit - C",2,801,1]
["Stefan Matteau ","VGK - C","-",805,"-"]
["Blake Speers"," NJ - C,RW",3,806,0]
["Chandler Stephenson ","Was - C",4,812,0]
["Colin White ","Ott - C",2,814,0]
["Sean Malone ","Buf - C",1,816,0]
["Sam Carrick ","Anh - C","-",819,"-"]
["Jakob Forsbacka Karlsson ","Bos - C",1,822,0]
["Tage Thompson ","StL - C,RW","-",823,"-"]
["Cody Glass ","VGK - C","-",824,"-"]
["Mark Jankowski ","Cgy - C",1,832,0]
["Jayce Hawryluk ","Fla - C","-",833,"-"]
["Curtis Valk ","Fla - C","-",836,"-"]
["Travis Boyd ","Was - C","-",837,"-"]
["Spencer Foo ","Cgy - C,RW","-",846,"-"]
["Cal O'Reilly ","Min - C",11,851,1]
["Mike Vecchione ","Phi - C",2,852,0]
["Cristoval Nieves ","NYR - C",1,854,0]

{"sheet":"Left Wing","index":4,"n_rows":228,"n_cols":5,"rows_kept":228}
["Player","Team","GP","O-Rank","Points"]
["Alex Ovechkin ","Was - LW",82,8,69]
["Jamie Benn ","Dal - LW",77,12,69]
["Brad Marchand ","Bos - LW",80,14,85]
["Max Pacioretty ","Mon - LW",81,28,67]
["Mike Hoffman ","Ott - LW,RW",74,67,61]
["Brandon Saad ","Chi - LW",82,73,53]
["Taylor Hall"," NJ - LW",72,93,53]
["Evander Kane ","Buf - LW",70,113,43]
["Zach Parise ","Min - LW",69,115,42]
["Milan Lucic ","Edm - LW",82,130,50]
["Ondrej Palat"," TB - LW",75,133,52]
["Marcus Johansson"," NJ - LW",82,134,58]
["Chris Kreider ","NYR - LW",75,135,53]
["Alexander Steen ","StL - C,LW",76,137,51]
["Patrick Marleau ","Tor - C,LW",82,144,46]
["Gabriel Landeskog ","Col - LW",72,149,33]
["Rick Nash ","NYR - LW,RW",67,158,38]
["Daniel Sedin ","Van - LW",82,159,44]
["Patrick Maroon ","Edm - LW",81,160,42]
["Vadim Shipachyov ","VGK - C,LW","-",162,"-"]
["Anders Lee ","NYI - LW",81,164,52]
["Tomas Hertl"," SJ - C,LW",49,173,22]
["Nick Foligno ","Cls - LW,RW",79,176,51]
["Andrew Ladd ","NYI - LW",78,178,31]
["Teuvo Teravainen ","Car - C,LW",81,179,42]
["Gustav Nyquist ","Det - LW,RW",76,182,48]
["Robby Fabbri ","StL - C,LW",51,183,29]
["Tomas Tatar ","Det - LW,RW",82,187,46]
["Patrick Sharp ","Chi - LW,RW",48,193,18]
["Scott Hartnell ","Nsh - LW",78,195,37]
["J.T. Miller ","NYR - LW,RW",82,202,56]
["Boone Jenner ","Cls - C,LW",82,204,34]
["Sam Bennett ","Cgy - C,LW",81,208,26]
["Anthony Mantha ","Det - LW,RW",60,214,36]
["Chris Kunitz"," TB - LW",71,215,29]
["Richard Panik ","Chi - LW,RW",82,218,44]
["David Perron ","VGK - LW,RW",82,224,46]
["Jimmy Vesey ","NYR - LW",80,226,27]
["Kyle Connor ","Wpg - LW",20,243,5]
["Jason Zucker ","Min - LW,RW",79,252,47]
["Nick Schmaltz ","Chi - C,LW",61,264,28]
["Mathieu Perreault ","Wpg - C,LW",65,266,45]
["Tyler Ennis ","Min - LW,RW",51,272,13]
["Brock Nelson ","NYI - C,LW",81,273,45]
["Ryan Spooner ","Bos - C,LW",78,279,39]
["Jonathan Marchessault ","VGK - C,LW",75,280,51]
["Justin Abdelkader ","Det - LW,RW",64,281,21]
["Andreas Athanasiou ","Det - C,LW",64,282,29]
["Frank Vatrano ","Bos - C,LW",44,287,18]
["Zack Smith ","Ott - C,LW",74,289,32]
["Alex Killorn"," TB - LW",81,295,36]
["Jarome Iginla"," LA - LW,RW",80,296,27]
["Leo Komarov ","Tor - C,LW",82,297,32]
["Kevin Fiala ","Nsh - LW,RW",54,298,16]
["Thomas Vanek ","Van - LW,RW",68,305,48]
["Jiri Hudler ","Dal - LW,RW",32,307,11]
["Matt Beleskey ","Bos - LW",49,309,8]
["Marian Gaborik"," LA - LW,RW",56,310,21]
["Andrew Cogliano ","Anh - LW",82,324,35]
["Vladislav Namestnikov"," TB - C,LW",74,326,28]
["Phillip Danault ","Mon - C,LW",82,329,40]
["Dustin Brown"," LA - LW,RW",80,336,36]
["Carl Hagelin ","Pit - LW",61,338,22]
["Pavel Zacha"," NJ - C,LW",70,341,24]
["Joonas Donskoi"," SJ - LW,RW",61,342,17]
["Anthony Duclair ","Ari - LW,RW",58,344,15]
["Mikkel Boedker"," SJ - LW,RW",81,346,26]
["Alexandre Burrows ","Ott - LW,RW",75,349,31]
["Josh Bailey ","NYI - LW,RW",82,355,56]
["Kris Versteeg ","Cgy - LW,RW",69,357,37]
["Tanner Pearson"," LA - LW",80,358,44]
["Antoine Roussel ","Dal - LW",60,362,27]
["Michael Grabner ","NYR - LW,RW",76,376,40]
["Ryan Hartman ","Chi - LW",76,378,31]
["Brian Boyle"," NJ - C,LW",75,381,25]
["Paul Byron ","Mon - LW,RW",81,383,43]
["Jason Chimera ","NYI - LW,RW",82,388,33]
["Chris Stewart ","Min - LW,RW",79,391,21]
["Matt Moulson ","Buf - LW,RW",81,393,32]
["Michael Cammalleri"," LA - C,LW",61,395,31]
["Nick Ritchie ","Anh - LW",77,398,28]
["Colin Wilson ","Col - C,LW",70,403,35]
["Austin Watson ","Nsh - LW,RW",77,404,17]
["Matt Martin ","Tor - LW",82,405,9]
["Erik Haula ","VGK - C,LW",72,407,26]
["Calle Jarnkrok ","Nsh - C,LW",81,409,31]
["Marcus Foligno ","Min - LW",80,410,23]
["Tobias Rieder ","Ari - LW,RW",80,412,34]
["Brett Connolly ","Was - LW,RW",66,413,23]
["Cody McLeod ","Nsh - LW,RW",59,415,6]
["Ryan Dzingel ","Ott - LW",81,422,32]
["Micheal Ferland ","Cgy - LW,RW",76,423,25]
["Drew Stafford"," NJ - LW,RW",58,425,21]
["Kyle Clifford"," LA - LW,RW",73,426,12]
["Sven Baertschi ","Van - LW",68,431,35]
["Micheal Haley ","Fla - C,LW",58,432,12]
["Zach Hyman ","Tor - C,LW",82,433,28]
["Travis Konecny ","Phi - C,LW",70,434,28]
["Blake Comeau ","Col - LW,RW",77,441,20]
["Jannik Hansen"," SJ - LW,RW",43,446,20]
["Dale Weise ","Phi - LW,RW",64,449,15]
["Jordan Martinook ","Ari - C,LW",77,450,25]
["Artturi Lehkonen ","Mon - LW",73,454,28]
["Scott Wilson ","Pit - LW,RW",78,455,26]
["Devin Shore ","Dal - C,LW",82,459,33]
["Matt Calvert ","Cls - LW",65,461,15]
["Nikolay Kulemin ","NYI - LW,RW",72,468,23]
["Markus Granlund ","Van - C,LW",69,480,32]
["Melker Karlsson"," SJ - C,LW",67,481,22]
["Matt Read ","Phi - LW,RW",63,487,19]
["Curtis McKenzie ","Dal - LW",53,490,16]
["Miles Wood"," NJ - LW",60,492,17]
["Derek MacKenzie ","Fla - C,LW",82,493,16]
["Cedric Paquette"," TB - C,LW",58,494,10]
["Benoit Pouliot ","Buf - LW",67,497,14]
["Jamie McGinn ","Ari - LW,RW",72,499,17]
["Sven Andrighetto ","Col - LW,RW",46,505,23]
["Tom Pyatt ","Ott - LW,RW",82,509,23]
["Beau Bennett ","StL - LW,RW",65,510,19]
["Andrew Copp ","Wpg - C,LW",64,512,17]
["Zemgus Girgensons ","Buf - C,LW",75,522,16]
["Kevin Labanc"," SJ - LW,RW",55,525,20]
["Nick Cousins ","Ari - C,LW",60,526,16]
["Drake Caggiula ","Edm - C,LW",60,530,18]
["Brendan Perlini ","Ari - LW",57,531,21]
["Anthony Beauvillier ","NYI - C,LW",66,534,24]
["Tom Kuhnhackl ","Pit - LW,RW",57,541,16]
["Andy Andreoff"," LA - C,LW",36,546,2]
["Shane Prince ","NYI - LW,RW",50,550,18]
["Michael Raffl ","Phi - LW",52,552,11]
["Pavel Buchnevich ","NYR - LW,RW",41,554,20]
["Dmitrij Jaskin ","StL - LW,RW",51,559,11]
["Pierre-Edouard Bellemare","VGK - C,LW",82,562,8]
["Joakim Nordstrom ","Car - LW",82,565,12]
["Magnus Paajarvi ","StL - LW,RW",32,574,13]
["Tim Schaller ","Bos - C,LW",59,577,14]
["Matt Hendricks ","Wpg - LW",42,579,7]
["Shawn Matthias ","Wpg - LW",45,582,12]
["Colton Sissons ","Nsh - C,LW",58,587,10]
["Ondrej Kase ","Anh - LW,RW",53,592,15]
["Vinnie Hinostroza ","Chi - C,LW",49,596,14]
["Lance Bouma ","Chi - C,LW",61,599,7]
["Nic Petan ","Wpg - C,LW",54,605,13]
["Matt Nieto ","Col - LW,RW",59,608,13]
["Reid Boucher ","Van - C,LW",39,609,10]
["Jordan Weal ","Phi - C,LW",23,611,12]
["Andreas Martinsen ","Mon - LW,RW",64,612,7]
["Lawson Crouse ","Ari - LW",72,614,12]
["Dennis Rasmussen ","Anh - C,LW",68,615,8]
["Marko Dano ","Wpg - C,LW",38,616,11]
["Joseph Blandisi"," NJ - C,LW",27,618,9]
["Jared McCann ","Fla - C,LW",29,624,7]
["Timo Meier"," SJ - LW,RW",34,630,6]
["Phillip Di Giuseppe ","Car - LW,RW",36,633,7]
["Brendan Gaunce ","Van - C,LW",57,642,5]
["Nicolas Deslauriers ","Buf - LW,RW",42,644,2]
["Anton Slepyshev ","Edm - LW,RW",41,645,10]
["Josh Leivo ","Tor - LW,RW",13,647,10]
["William Carrier ","VGK - LW,RW",41,648,8]
["Brock McGinn ","Car - LW",57,651,16]
["Tyler Pitlick ","Dal - C,LW,RW",31,653,11]
["Stephen Gionta ","NYI - LW,RW",26,657,6]
["Tyler Motte ","Cls - LW,RW",33,659,7]
["Tom Sestito ","Pit - LW",13,661,2]
["Gabriel Dumont"," TB - C,LW",39,663,4]
["Greg McKegg ","Pit - C,LW",46,667,7]
["Zach Sanford ","StL - C,LW",39,670,8]
["Ivan Barbashev ","StL - C,LW",30,671,12]
["Brandon Tanev ","Wpg - LW,RW",51,673,4]
["Matt Puempel ","NYR - LW",40,676,9]
["Jakub Vrana ","Was - LW,RW",21,677,6]
["Seth Griffith ","Buf - C,LW",24,684,5]
["Gemel Smith ","Dal - C,LW",17,689,6]
["Remi Elie ","Dal - LW",18,693,7]
["Evan Rodrigues ","Buf - C,LW",30,700,6]
["Adrian Kempe"," LA - C,LW",25,702,6]
["J.T. Compher ","Col - C,LW",21,703,5]
["Teemu Pulkkinen ","VGK - LW,RW",13,705,2]
["Justin Bailey ","Buf - LW,RW",32,707,4]
["Laurent Dauphin ","Chi - C,LW",24,708,3]
["Chris Terry ","Mon - LW,RW",14,709,4]
["Scott Laughton ","Phi - C,LW",2,712,0]
["Paul Thompson ","VGK - LW,RW",21,714,3]
["John Quenneville"," NJ - C,LW",12,715,4]
["John Hayden ","Chi - LW,RW",12,716,4]
["Marcus Sorensen"," SJ - LW,RW",19,722,4]
["Emerson Etem ","Ari - LW",3,731,0]
["Cody Bass ","Nsh - C,LW",9,732,0]
["Adam Erne"," TB - LW",26,733,3]
["Steve Downie ","Ari - LW,RW","-",739,"-"]
["Nikolay Goldobin ","Van - LW,RW",14,745,3]
["Jujhar Khaira ","Edm - C,LW",10,749,1]
["Michael Bournival"," TB - LW",19,750,3]
["Kerby Rychel ","Tor - LW","-",752,"-"]
["Markus Hannikainen ","Cls - LW",10,755,2]
["Charles Hudon ","Mon - LW",3,760,2]
["Tomas Nosek ","VGK - C,LW",11,761,1]
["Gabriel Bourque ","Col - LW,RW",6,762,0]
["Pontus Aberg ","Nsh - LW,RW",15,765,2]
["Taylor Leier ","Phi - LW",10,767,2]
["Tomas Jurco ","Chi - LW,RW",29,770,1]
["Frederick Gaudreau ","Nsh - C,LW",9,776,1]
["Sean Kuraly ","Bos - C,LW",8,779,1]
["Garrett Wilson ","Pit - LW","-",780,"-"]
["A.J. Greer ","Col - LW",5,782,1]
["Jason Dickinson ","Dal - C,LW",10,783,2]
["Tyler Gaudet ","Ari - C,LW",4,785,1]
["Matt Lorito ","Det - LW",2,787,1]
["Nick Paul ","Ott - LW",1,792,0]
["Hunter Shinkaruk ","Cgy - C,LW",7,793,1]
["Blake Pietila"," NJ - LW",10,794,1]
["Vladimir Sobotka ","StL - LW",1,795,1]
["Nicolas Kerdiles ","Anh - LW",1,803,0]
["Andrew Agozzino ","Col - LW","-",804,"-"]
["C.J. Smith ","Buf - LW",2,807,1]
["Jacob De La Rose ","Mon - LW",9,809,0]
["Clarke MacArthur ","Ott - LW",4,813,0]
["Emile Poirier ","Cgy - LW","-",820,"-"]
["Pierre-Cedric Labrie","Nsh - LW","-",825,"-"]
["Nathan Walker ","Was - LW","-",827,"-"]
["Eric Tangradi ","Det - LW","-",829,"-"]
["Michael Dal Colle ","NYI - LW","-",838,"-"]
["Pierre-Luc Dubois","Cls - LW","-",840,"-"]
["Anders Bjork ","Bos - LW","-",841,"-"]
["Michael Zalewski ","Van - LW",1,848,0]
["Tyler Bertuzzi ","Det - LW,RW",7,850,0]
["Sonny Milano ","Cls - LW",4,856,0]

{"sheet":"Right Wing","index":5,"n_rows":209,"n_cols":5,"rows_kept":209}
["Player","Team","GP","O-Rank","Points"]
["Nikita Kucherov"," TB - RW",74,9,85]
["Leon Draisaitl ","Edm - C,RW",82,16,77]
["Tyler Seguin ","Dal - C,RW",82,24,72]
["Phil Kessel ","Pit - RW",82,27,70]
["Joe Pavelski"," SJ - C,RW",81,38,68]
["Blake Wheeler ","Wpg - RW",82,39,74]
["Mike Hoffman ","Ott - LW,RW",74,67,61]
["Corey Perry ","Anh - RW",82,69,53]
["Mikael Granlund ","Min - C,RW",81,72,69]
["Jakub Voracek ","Phi - RW",82,88,61]
["Mark Stone ","Ott - RW",71,100,54]
["Jason Spezza ","Dal - C,RW",68,103,50]
["Tyler Toffoli"," LA - C,RW",63,118,34]
["Kyle Palmieri"," NJ - RW",80,122,53]
["Patric Hornqvist ","Pit - RW",70,124,44]
["Jakob Silfverberg ","Anh - RW",79,141,49]
["Brendan Gallagher ","Mon - RW",64,151,29]
["Sam Reinhart ","Buf - C,RW",79,152,47]
["Rick Nash ","NYR - LW,RW",67,158,38]
["Kyle Okposo ","Buf - RW",65,161,45]
["Craig Smith ","Nsh - RW",78,166,29]
["Bobby Ryan ","Ott - RW",62,171,25]
["Nick Foligno ","Cls - LW,RW",79,176,51]
["Joshua Ho-Sang","NYI - RW",21,180,10]
["Justin Williams ","Car - RW",80,181,48]
["Gustav Nyquist ","Det - LW,RW",76,182,48]
["Tomas Tatar ","Det - LW,RW",82,187,46]
["Michael Frolik ","Cgy - RW",82,191,44]
["Charlie Coyle ","Min - C,RW",82,192,56]
["Patrick Sharp ","Chi - LW,RW",48,193,18]
["Reilly Smith ","VGK - RW",80,194,37]
["Ryan Strome ","Edm - C,RW",69,197,30]
["Matt Duchene ","Col - C,RW",77,199,41]
["J.T. Miller ","NYR - LW,RW",82,202,56]
["Anthony Mantha ","Det - LW,RW",60,214,36]
["Elias Lindholm ","Car - C,RW",72,216,45]
["Richard Panik ","Chi - LW,RW",82,218,44]
["David Perron ","VGK - LW,RW",82,224,46]
["Jason Pominville ","Buf - RW",78,229,47]
["Patrick Eaves ","Anh - RW",79,237,51]
["Jason Zucker ","Min - LW,RW",79,252,47]
["Brock Boeser ","Van - RW",9,258,5]
["Radim Vrbata ","Fla - RW",81,259,55]
["Kevin Hayes ","NYR - C,RW",76,265,49]
["Brayden Point"," TB - C,RW",68,267,40]
["Lee Stempniak ","Car - RW",82,270,40]
["Tyler Ennis ","Min - LW,RW",51,272,13]
["David Backes ","Bos - RW",74,276,38]
["Justin Abdelkader ","Det - LW,RW",64,281,21]
["Shane Doan ","Ari - RW",74,290,27]
["Jaromir Jagr ","Fla - RW",82,293,46]
["Jarome Iginla"," LA - LW,RW",80,296,27]
["Kevin Fiala ","Nsh - LW,RW",54,298,16]
["Thomas Vanek ","Van - LW,RW",68,305,48]
["Jiri Hudler ","Dal - LW,RW",32,307,11]
["Marian Gaborik"," LA - LW,RW",56,310,21]
["Nick Bjugstad ","Fla - C,RW",54,320,14]
["Andrew Shaw ","Mon - C,RW",68,321,29]
["Sam Gagner ","Van - C,RW",81,327,50]
["Ryan Callahan"," TB - RW",18,328,4]
["Dustin Brown"," LA - LW,RW",80,336,36]
["P.A. Parenteau ","Nsh - RW",67,337,28]
["Nail Yakupov ","Col - RW",40,340,9]
["Joonas Donskoi"," SJ - LW,RW",61,342,17]
["Anthony Duclair ","Ari - LW,RW",58,344,15]
["Troy Brouwer ","Cgy - RW",74,345,25]
["Mikkel Boedker"," SJ - LW,RW",81,346,26]
["Tommy Wingels ","Chi - C,RW",73,348,12]
["Alexandre Burrows ","Ott - LW,RW",75,349,31]
["Josh Bailey ","NYI - LW,RW",82,355,56]
["Marian Hossa ","Chi - RW",73,356,45]
["Kris Versteeg ","Cgy - LW,RW",69,357,37]
["Tom Wilson ","Was - RW",82,361,19]
["Michael Grabner ","NYR - LW,RW",76,376,40]
["Paul Byron ","Mon - LW,RW",81,383,43]
["Zack Kassian ","Edm - RW",79,384,24]
["Josh Anderson ","Cls - RW",78,386,29]
["Jason Chimera ","NYI - LW,RW",82,388,33]
["Chris Stewart ","Min - LW,RW",79,391,21]
["Matt Moulson ","Buf - LW,RW",81,393,32]
["Austin Watson ","Nsh - LW,RW",77,404,17]
["Tobias Rieder ","Ari - LW,RW",80,412,34]
["Brett Connolly ","Was - LW,RW",66,413,23]
["Cody McLeod ","Nsh - LW,RW",59,415,6]
["Brett Ritchie ","Dal - RW",78,416,24]
["Joel Ward"," SJ - RW",78,417,29]
["Jay Beagle ","Was - C,RW",81,418,30]
["Micheal Ferland ","Cgy - LW,RW",76,423,25]
["Connor Brown ","Tor - RW",82,424,36]
["Drew Stafford"," NJ - LW,RW",58,425,21]
["Kyle Clifford"," LA - LW,RW",73,426,12]
["Ryan Reaves ","Pit - RW",80,436,13]
["Colton Sceviour ","Fla - C,RW",80,437,24]
["Trevor Lewis"," LA - C,RW",82,438,24]
["Blake Comeau ","Col - LW,RW",77,441,20]
["Brandon Sutter ","Van - C,RW",81,444,34]
["Jannik Hansen"," SJ - LW,RW",43,446,20]
["Brandon Pirri ","Fla - C,RW",60,448,18]
["Dale Weise ","Phi - LW,RW",64,449,15]
["Cal Clutterbuck ","NYI - RW",66,452,20]
["Scott Wilson ","Pit - LW,RW",78,455,26]
["Nikolay Kulemin ","NYI - LW,RW",72,468,23]
["Bryan Rust ","Pit - RW",57,471,28]
["J.T. Brown"," TB - RW",64,478,6]
["Torrey Mitchell ","Mon - C,RW",78,485,17]
["Matt Read ","Phi - LW,RW",63,487,19]
["Riley Nash ","Bos - C,RW",81,495,17]
["Derek Ryan ","Car - C,RW",67,498,29]
["Jamie McGinn ","Ari - LW,RW",72,499,17]
["Jesper Fast ","NYR - RW",68,500,21]
["Chris Thorburn ","StL - RW",64,504,4]
["Sven Andrighetto ","Col - LW,RW",46,505,23]
["Tom Pyatt ","Ott - LW,RW",82,509,23]
["Beau Bennett ","StL - LW,RW",65,510,19]
["Adam Cracknell ","Dal - C,RW",69,518,16]
["Joel Armia ","Wpg - RW",57,523,19]
["Kevin Labanc"," SJ - LW,RW",55,525,20]
["Tom Kuhnhackl ","Pit - LW,RW",57,541,16]
["Luke Glendening ","Det - C,RW",74,545,14]
["Jimmy Hayes"," NJ - RW",58,548,5]
["Shane Prince ","NYI - LW,RW",50,550,18]
["Pavel Buchnevich ","NYR - LW,RW",41,554,20]
["Dmitrij Jaskin ","StL - LW,RW",51,559,11]
["Jared Boll ","Anh - RW",51,560,3]
["Josh Jooris ","Car - C,RW",54,564,12]
["Eric Fehr ","Tor - C,RW",53,572,11]
["Magnus Paajarvi ","StL - LW,RW",32,574,13]
["Derek Dorsett ","Van - RW",14,576,4]
["Brad Richardson ","Ari - C,RW",16,578,9]
["Jordan Nolan"," LA - C,RW",46,584,8]
["Stefan Noesen"," NJ - RW",44,586,10]
["Joe Colborne ","Col - C,RW",62,588,8]
["Ales Hemsky ","Mon - RW",15,591,7]
["Ondrej Kase ","Anh - LW,RW",53,592,15]
["Riley Sheahan ","Det - C,RW",80,600,13]
["Nikita Soshnikov ","Tor - RW",56,601,9]
["Oliver Bjorkstrand ","Cls - RW",26,602,13]
["Logan Shaw ","Anh - C,RW",55,604,10]
["Matt Nieto ","Col - LW,RW",59,608,13]
["Andreas Martinsen ","Mon - LW,RW",64,612,7]
["Devante Smith-Pelly","Was - RW",53,621,9]
["Jordin Tootoo ","Chi - RW",50,622,3]
["Garnet Hathaway ","Cgy - RW",26,623,5]
["Brian Flynn ","Dal - C,RW",51,627,10]
["Timo Meier"," SJ - LW,RW",34,630,6]
["Michael McCarron ","Mon - C,RW",31,631,5]
["Jordan Schroeder ","Cls - C,RW",37,632,13]
["Phillip Di Giuseppe ","Car - LW,RW",36,633,7]
["Austin Czarnik ","Bos - C,RW",49,637,13]
["Nicolas Deslauriers ","Buf - LW,RW",42,644,2]
["Anton Slepyshev ","Edm - LW,RW",41,645,10]
["Chris Wagner ","Anh - C,RW",43,646,7]
["Josh Leivo ","Tor - LW,RW",13,647,10]
["William Carrier ","VGK - LW,RW",41,648,8]
["Denis Malgin ","Fla - C,RW",47,649,10]
["Michael Chaput ","Van - C,RW",68,652,8]
["Tyler Pitlick ","Dal - C,LW,RW",31,653,11]
["Jayson Megna ","Van - C,RW",58,656,8]
["Stephen Gionta ","NYI - LW,RW",26,657,6]
["Tyler Motte ","Cls - LW,RW",33,659,7]
["Brandon Tanev ","Wpg - LW,RW",51,673,4]
["Jakub Vrana ","Was - LW,RW",21,677,6]
["Noel Acciari ","Bos - C,RW",29,680,5]
["Jake Virtanen ","Van - RW",10,694,1]
["Iiro Pakarinen ","Edm - RW",14,698,4]
["Curtis Lazar ","Cgy - C,RW",37,699,4]
["Carter Rowney ","Pit - C,RW",27,701,7]
["Teemu Pulkkinen ","VGK - LW,RW",13,705,2]
["Kurtis Gabriel ","Min - RW",13,706,1]
["Justin Bailey ","Buf - LW,RW",32,707,4]
["Chris Terry ","Mon - LW,RW",14,709,4]
["Paul Thompson ","VGK - LW,RW",21,714,3]
["John Hayden ","Chi - LW,RW",12,716,4]
["Nick Lappin"," NJ - RW",43,718,7]
["Marcus Sorensen"," SJ - LW,RW",19,722,4]
["Freddie Hamilton ","Cgy - C,RW",26,724,2]
["Josh Archibald ","Pit - RW",10,727,3]
["Ben Smith ","Tor - C,RW",40,728,4]
["Miikka Salomaki ","Nsh - RW",5,735,0]
["Erik Condra"," TB - RW",13,738,0]
["Steve Downie ","Ari - LW,RW","-",739,"-"]
["Jonny Brodzinski"," LA - C,RW",6,742,2]
["Mike Blunden ","Ott - RW",2,743,0]
["Kyle Rau ","Min - C,RW",24,744,3]
["Nikolay Goldobin ","Van - LW,RW",14,745,3]
["Anthony Peluso ","Was - RW","-",747,"-"]
["Christian Fischer ","Ari - RW",7,758,3]
["Ty Rattie ","Edm - RW",9,759,2]
["Gabriel Bourque ","Col - LW,RW",6,762,0]
["Max McCormick ","Ott - RW",7,764,0]
["Pontus Aberg ","Nsh - LW,RW",15,765,2]
["Barclay Goodrow"," SJ - RW",3,769,1]
["Tomas Jurco ","Chi - LW,RW",29,770,1]
["Colin McDonald ","Phi - RW",3,771,1]
["Christoph Bertschy ","Min - C,RW",5,774,1]
["Christopher DiDomenico ","Ott - C,RW",3,777,0]
["Anton Rodin ","Van - RW",3,788,1]
["Kasperi Kapanen ","Tor - RW",8,790,1]
["Evgeny Svechnikov ","Det - RW",2,802,0]
["Blake Speers"," NJ - C,RW",3,806,0]
["Alexander Nylander ","Buf - RW",4,818,1]
["Tage Thompson ","StL - C,RW","-",823,"-"]
["Adam Chapie ","NYR - RW","-",835,"-"]
["Vitaly Abramov ","Cls - RW","-",842,"-"]
["Evgenii Dadonov ","Fla - RW","-",843,"-"]
["Spencer Foo ","Cgy - C,RW","-",846,"-"]
["Tyler Bertuzzi ","Det - LW,RW",7,850,0]
["Alex DeBrincat\n","Chi - RW","-",1757,"-"]

{"sheet":"Defence","index":6,"n_rows":245,"n_cols":5,"rows_kept":245}
["Player","Team","GP","O-Rank","Points"]
["Victor Hedman"," TB - D",79,18,72]
["Dustin Byfuglien ","Wpg - D",80,23,52]
["Kris Letang ","Pit - D",41,35,34]
["Shea Weber ","Mon - D",78,44,42]
["Drew Doughty"," LA - D",82,51,44]
["Dougie Hamilton ","Cgy - D",81,61,50]
["Alex Pietrangelo ","StL - D",80,68,48]
["Mark Giordano ","Cgy - D",81,78,39]
["Oliver Ekman-Larsson","Ari - D",79,79,39]
["Torey Krug ","Bos - D",81,90,51]
["Justin Faulk ","Car - D",75,95,37]
["Seth Jones ","Cls - D",75,98,42]
["Ryan McDonagh ","NYR - D",77,101,42]
["Jake Gardiner ","Tor - D",82,107,43]
["John Klingberg ","Dal - D",80,119,49]
["Oscar Klefbom ","Edm - D",82,121,38]
["Aaron Ekblad ","Fla - D",68,128,21]
["Colton Parayko ","StL - D",81,129,35]
["Keith Yandle ","Fla - D",82,139,41]
["Ryan Ellis ","Nsh - D",71,142,38]
["Tyson Barrie ","Col - D",74,147,38]
["Brent Seabrook ","Chi - D",79,170,39]
["Matt Niskanen ","Was - D",78,174,39]
["Jared Spurgeon ","Min - D",76,177,38]
["Marc-Edouard Vlasic","SJ - D",75,184,28]
["Jake Muzzin"," LA - D",82,196,28]
["Charlie McAvoy ","Bos - D","-",200,"-"]
["Morgan Rielly ","Tor - D",76,203,27]
["Shea Theodore ","VGK - D",34,205,9]
["Matt Dumba ","Min - D",76,211,34]
["Nikita Zaitsev ","Tor - D",82,213,36]
["Dmitry Orlov ","Was - D",82,217,33]
["Mattias Ekholm ","Nsh - D",82,221,23]
["Ivan Provorov ","Phi - D",82,223,30]
["Jaccob Slavin ","Car - D",82,227,34]
["Dion Phaneuf ","Ott - D",81,231,30]
["Alex Goligoski ","Ari - D",82,234,36]
["Sami Vatanen ","Anh - D",71,238,24]
["Josh Morrissey ","Wpg - D",82,239,20]
["Andrei Markov ","Mon - D",62,249,36]
["Nick Holden ","NYR - D",80,250,34]
["Trevor Daley ","Det - D",56,254,19]
["Brady Skjei ","NYR - D",80,257,39]
["Damon Severson"," NJ - D",80,263,31]
["Zdeno Chara ","Bos - D",75,268,29]
["Radko Gudas ","Phi - D",67,269,23]
["Noah Hanifin ","Car - D",81,271,29]
["Esa Lindell ","Dal - D",73,274,18]
["Alexander Edler ","Van - D",68,277,21]
["Mike Green ","Det - D",72,283,36]
["Julius Honka ","Dal - D",16,285,5]
["David Savard ","Cls - D",74,292,23]
["Niklas Kronwall ","Det - D",57,301,13]
["Olli Maatta ","Pit - D",55,302,7]
["Adam Larsson ","Edm - D",79,303,19]
["Michael Stone ","Cgy - D",64,311,15]
["Jack Johnson ","Cls - D",82,313,23]
["Anton Stralman"," TB - D",73,314,22]
["Mark Streit ","Mon - D",68,316,27]
["Erik Johnson ","Col - D",46,317,17]
["Jason Demers ","Fla - D",81,322,28]
["Johnny Boychuk ","NYI - D",66,333,23]
["Dan Hamhuis ","Dal - D",79,334,16]
["Ian Cole ","Pit - D",81,335,26]
["Brandon Carlo ","Bos - D",82,339,16]
["Dmitry Kulikov ","Wpg - D",47,350,5]
["Andrej Sekera ","Edm - D",80,372,35]
["Nathan Beaulieu ","Buf - D",74,382,28]
["Josh Manson ","Anh - D",82,400,17]
["Jeff Petry ","Mon - D",80,401,28]
["Calvin de Haan ","NYI - D",82,411,25]
["Deryk Engelland ","VGK - D",81,419,16]
["Brooks Orpik ","Was - D",79,420,14]
["Chris Wideman ","Ott - D",76,421,17]
["Mark Borowiecki ","Ott - D",70,427,3]
["Dennis Seidenberg ","NYI - D",73,428,22]
["Kevin Bieksa ","Anh - D",81,429,14]
["Brett Pesce ","Car - D",82,430,20]
["Joel Edmundson ","StL - D",69,439,15]
["Alex Petrovic ","Fla - D",49,443,14]
["Karl Alzner ","Mon - D",82,445,13]
["Francois Beauchemin ","Anh - D",81,451,18]
["John Moore"," NJ - D",63,453,22]
["Luke Schenn ","Ari - D",78,456,8]
["Jonas Brodin ","Min - D",68,457,25]
["Derek Forbort"," LA - D",82,458,18]
["Adam McQuaid ","Bos - D",77,460,10]
["Colin Miller ","VGK - D",61,462,13]
["Alexei Emelin ","Nsh - D",76,463,10]
["Thomas Hickey ","NYI - D",76,466,20]
["Braydon Coburn"," TB - D",80,467,12]
["Trevor van Riemsdyk ","Car - D",58,469,16]
["Michael Matheson ","Fla - D",81,470,17]
["Paul Martin"," SJ - D",81,472,26]
["Brendan Smith ","NYR - D",51,473,9]
["Ben Hutton ","Van - D",71,474,19]
["David Schlemko ","Mon - D",62,475,18]
["Jay Bouwmeester ","StL - D",81,476,15]
["Nate Schmidt ","VGK - D",60,477,17]
["Brenden Dillon"," SJ - D",81,482,10]
["Kyle Quincey ","Min - D",73,483,15]
["Niklas Hjalmarsson ","Ari - D",73,484,18]
["Brandon Manning ","Phi - D",65,486,12]
["Cody Ceci ","Ott - D",79,489,17]
["Justin Braun"," SJ - D",81,491,13]
["Kevan Miller ","Bos - D",58,496,13]
["Jake McCabe ","Buf - D",76,501,20]
["Marc Methot ","Dal - D",68,502,12]
["Troy Stecher ","Van - D",71,506,24]
["Connor Carrick ","Tor - D",67,507,8]
["Connor Murphy ","Chi - D",77,508,17]
["Marc Staal ","NYR - D",72,511,10]
["Marco Scandella ","Buf - D",71,513,13]
["Matt Irwin ","Nsh - D",74,514,14]
["Brayden McNabb ","VGK - D",49,515,4]
["Toby Enstrom ","Wpg - D",60,517,14]
["Brian Dumoulin ","Pit - D",70,519,15]
["Michael Del Zotto ","Van - D",51,520,18]
["Jonathan Ericsson ","Det - D",51,521,9]
["Darnell Nurse ","Edm - D",44,524,11]
["Matt Hunwick ","Pit - D",72,527,19]
["Andrej Sustr"," TB - D",80,528,14]
["Dan Girardi"," TB - D",63,529,15]
["Travis Hamonic ","Cgy - D",49,532,14]
["Xavier Ouellet ","Det - D",66,533,12]
["Ryan Murray ","Cls - D",60,535,11]
["Matt Benning ","Edm - D",62,536,15]
["Kris Russell ","Edm - D",68,537,13]
["Luca Sbisa ","VGK - D",82,538,13]
["Jordie Benn ","Mon - D",71,539,17]
["Zach Bogosian ","Buf - D",56,540,11]
["Eric Gryba ","Edm - D",40,544,6]
["Jakob Chychrun ","Ari - D",68,547,20]
["Mark Pysyk ","Fla - D",82,553,17]
["Ben Lovejoy"," NJ - D",82,555,7]
["Ron Hainsey ","Tor - D",72,557,17]
["Ben Chiarot ","Wpg - D",59,558,12]
["Andrew MacDonald ","Phi - D",73,561,18]
["Josh Gorges ","Buf - D",66,568,6]
["Jake Dotchin"," TB - D",35,569,11]
["Anthony DeAngelo ","NYR - D",39,570,14]
["Mark Barberio ","Col - D",60,573,13]
["Tyler Myers ","Wpg - D",11,575,5]
["Nikita Zadorov ","Col - D",56,580,10]
["Dalton Prout"," NJ - D",29,581,6]
["Yannick Weber ","Nsh - D",73,583,8]
["Danny DeKeyser ","Det - D",82,585,12]
["Adam Clendening ","Ari - D",31,590,11]
["Stephen Johns ","Dal - D",61,593,10]
["Andy Greene"," NJ - D",66,594,13]
["Christian Folin"," LA - D",51,595,8]
["Robert Bortuzzo ","StL - D",38,597,4]
["Jason Garrison ","VGK - D",70,598,9]
["Chad Ruhwedel ","Pit - D",34,606,10]
["Paul Postma ","Bos - D",65,607,14]
["Johnny Oduya ","Ott - D",52,610,9]
["Christopher Tanev ","Van - D",53,613,10]
["Brandon Montour ","Anh - D",27,617,6]
["Kevin Connauton ","Ari - D",24,619,1]
["Michal Kempny ","Chi - D",50,620,8]
["Scott Mayfield ","NYI - D",25,625,9]
["Alexei Marchenko ","Tor - D",41,626,8]
["Markus Nutivaara ","Cls - D",66,629,7]
["Jamie Oleksiak ","Dal - D",41,634,7]
["Brandon Davidson ","Mon - D",38,635,3]
["Clayton Stoner ","VGK - D",14,636,3]
["Dylan DeMelo"," SJ - D",25,638,8]
["Justin Falk ","Buf - D",52,639,8]
["Patrick Wiercioch ","Van - D",57,640,12]
["Martin Marincin ","Tor - D",25,641,7]
["Greg Pateryn ","Dal - D",36,643,9]
["Taylor Chorney ","Was - D",18,650,5]
["Kevin Gravel"," LA - D",49,654,7]
["Taylor Fedun ","Buf - D",27,655,7]
["Nick Jensen ","Det - D",49,658,13]
["Luke Witkowski ","Det - D",34,660,4]
["Anthony Bitetto ","Nsh - D",29,662,7]
["Nate Prosser ","StL - D",39,664,7]
["Klas Dahlbeck ","Car - D",43,665,6]
["Matt Bartkowski ","Cgy - D",24,668,2]
["Fredrik Claesson ","Ott - D",33,669,11]
["Erik Gudbranson ","Van - D",30,672,6]
["Korbinian Holzer ","Anh - D",32,674,7]
["Jon Merrill ","VGK - D",51,675,6]
["Gustav Forsling ","Chi - D",38,678,5]
["Patrik Nemeth ","Dal - D",40,679,3]
["Carl Gunnarsson ","StL - D",56,681,6]
["Michal Rozsival ","Chi - D",22,682,3]
["Alex Biega ","Van - D",36,683,3]
["Yohann Auvitu ","Edm - D",25,685,4]
["Steven Santini"," NJ - D",38,687,7]
["Adam Pelech ","NYI - D",44,691,10]
["Ryan Sproul ","Det - D",27,695,7]
["Paul LaDue"," LA - D",22,697,8]
["Steve Oleksy ","Anh - D",11,704,1]
["Scott Harrington ","Cls - D",22,711,3]
["Steven Kampfer ","NYR - D",11,717,2]
["Cameron Gaunce ","Cls - D",12,719,4]
["Marek Zidlicky ","NYI - D","-",720,"-"]
["Seth Helgeson ","NYI - D",9,721,1]
["Mike Reilly ","Min - D",17,723,1]
["Slater Koekkoek"," TB - D",29,726,4]
["Brett Kulak ","Cgy - D",21,729,3]
["Julian Melchiori ","Wpg - D",18,730,2]
["Mark Fayne ","Edm - D",4,734,2]
["Brian Strait"," NJ - D",5,737,2]
["Matt Tennyson ","Buf - D",45,740,6]
["Petter Granberg ","Nsh - D",10,746,0]
["Frank Corrado ","Pit - D",4,748,0]
["Robbie Russo ","Det - D",19,753,0]
["Jordan Schmaltz ","StL - D",9,754,2]
["Gustav Olofsson ","Min - D",13,756,3]
["Ryan Murphy ","Min - D",27,757,2]
["Derrick Pouliot ","Pit - D",11,763,0]
["Mirco Mueller"," NJ - D",4,766,2]
["Ryan Pulock ","NYI - D",1,778,0]
["Chris Bigras ","Col - D","-",781,"-"]
["Jordan Oesterle ","Chi - D",2,784,0]
["MacKenzie Weegar ","Fla - D",3,786,0]
["Griffin Reinhart ","VGK - D","-",789,"-"]
["Dillon Simpson ","Edm - D",3,797,0]
["Ian McCoshen ","Fla - D",3,800,1]
["Chris Butler ","StL - D",1,808,0]
["Samuel Morin ","Phi - D",1,810,0]
["Jacob Larsson ","Anh - D",4,811,0]
["Tim Heed"," SJ - D",1,815,0]
["Dan Renouf ","Det - D",1,817,0]
["Andrei Mironov ","Col - D","-",821,"-"]
["Jakub Jerabek ","Mon - D","-",826,"-"]
["Jan Rutta ","Chi - D","-",828,"-"]
["Yaroslav Dyblenko"," NJ - D","-",830,"-"]
["Victor Antipin ","Buf - D","-",831,"-"]
["Travis Sanheim ","Phi - D","-",834,"-"]
["Haydn Fleury ","Car - D","-",839,"-"]
["Christian Djoos ","Was - D","-",844,"-"]
["Kyle Wood ","Ari - D","-",845,"-"]
["Gabriel Carlsson ","Cls - D",2,847,1]
["Tyler Wotherspoon ","Cgy - D",4,849,0]
["Rasmus Andersson ","Cgy - D",1,853,0]
["Thomas Chabot ","Ott - D",1,855,0]
["Brian Lashoff ","Det - D",5,857,0]
["Anton Lindholm ","Col - D",12,858,0]
["Mikhail Sergachev"," TB - D","-",991,"-"]
["Will Butcher"," NJ - D","-",1427,"-"]

{"sheet":"Goalies","index":7,"n_rows":65,"n_cols":7,"rows_kept":65}
["Player","Team","GP","O-Rank","Wins","Shutouts","Points"]
["Pekka Rinne ","Nsh - G",61,37,31,3,65]
["John Gibson ","Anh - G",52,45,25,6,56]
["Corey Crawford ","Chi - G",55,53,32,2,66]
["Jonathan Quick"," LA - G",17,57,8,2,18]
["Ben Bishop ","Dal - G",39,58,18,1,37]
["Henrik Lundqvist ","NYR - G",57,59,31,2,64]
["Cory Schneider"," NJ - G",60,94,20,2,42]
["Brian Elliott ","Phi - G",49,110,26,2,54]
["Jaroslav Halak ","NYI - G",28,114,12,2,26]
["Scott Darling ","Car - G",32,120,18,2,38]
["Robin Lehner ","Buf - G",59,140,23,2,48]
["Marc-Andre Fleury","VGK - G",38,155,18,1,37]
["Thomas Greiss ","NYI - G",51,175,26,3,55]
["Roberto Luongo ","Fla - G",40,198,17,1,35]
["Connor Hellebuyck ","Wpg - G",56,209,26,4,56]
["Jimmy Howard ","Det - G",26,210,10,1,21]
["Petr Mrazek ","Det - G",50,212,18,1,37]
["Semyon Varlamov ","Col - G",24,222,6,1,13]
["Ryan Miller ","Anh - G",54,236,18,3,39]
["Ondrej Pavelec ","NYR - G",8,240,4,0,8]
["Antti Niemi ","Pit - G",37,245,12,0,24]
["Anton Forsberg ","Chi - G",1,247,0,0,0]
["Antti Raanta ","Ari - G",30,251,16,4,36]
["Peter Budaj"," TB - G",60,260,30,7,67]
["Michael Hutchinson ","Wpg - G",28,288,9,1,19]
["Kari Lehtonen ","Dal - G",59,291,22,3,47]
["James Reimer ","Fla - G",43,294,18,3,39]
["Cam Ward ","Car - G",61,299,26,2,54]
["Steve Mason ","Wpg - G",58,300,26,3,55]
["Eddie Lack ","Cgy - G",20,304,8,1,17]
["Michal Neuvirth ","Phi - G",28,308,11,0,22]
["Jonathan Bernier ","Col - G",39,312,21,2,44]
["Calvin Pickard ","VGK - G",50,315,15,2,32]
["Anton Khudobin ","Bos - G",16,318,7,0,14]
["Carter Hutton ","StL - G",30,319,13,4,30]
["Aaron Dell"," SJ - G",20,325,11,1,23]
["Philipp Grubauer ","Was - G",24,332,13,3,29]
["Keith Kinkaid"," NJ - G",26,347,8,1,17]
["Mike Condon ","Ott - G",41,352,19,5,43]
["Chad Johnson ","Buf - G",36,353,18,3,39]
["Juuse Saros ","Nsh - G",21,354,10,1,21]
["Al Montoya ","Mon - G",19,359,8,2,18]
["Anthony Stolarz ","Phi - G",7,360,2,1,5]
["Jon Gillies ","Cgy - G",1,364,1,0,2]
["Laurent Brossoit ","Edm - G",8,365,4,0,8]
["Kristers Gudlevskis ","NYI - G",1,366,0,0,0]
["Anders Nilsson ","Van - G",26,367,10,1,21]
["Troy Grosenick"," SJ - G","-",368,"-","-",0]
["Joonas Korpisalo ","Cls - G",14,369,7,1,15]
["Alex Stalock ","Min - G",2,370,1,0,2]
["Tristan Jarry ","Pit - G",1,371,0,0,0]
["Malcolm Subban ","Bos - G",1,373,0,0,0]
["Curtis McElhinney ","Tor - G",21,374,8,1,17]
["Chris Driedger ","Ott - G",1,375,0,0,0]
["Jacob Markstrom ","Van - G",26,377,10,0,20]
["Anders Lindback ","Nsh - G","-",379,"-","-",0]
["Reto Berra ","Anh - G",7,380,0,0,0]
["Jared Coreau ","Det - G",14,385,5,2,12]
["Darcy Kuemper"," LA - G",18,387,8,0,16]
["Marek Mazanec ","Nsh - G",4,392,0,0,0]
["Andrew Hammond ","Ott - G",6,394,0,0,0]
["Jean-Francois Berube","Chi - G",14,396,3,0,6]
["Zane McIntyre ","Bos - G",8,402,0,0,0]
["Louis Domingue ","Ari - G",31,406,11,0,22]

{"sheet":"Data","index":8,"n_rows":50,"n_cols":7,"rows_kept":50}
["Owners","Position"]
["Booya's (Cathy)","goalie 1"]
["Bruins (Bruce)","goalie 2"]
["VanekDownByTheRiver (Colin)","defence #1"]
["Curtis Crazy Canucks (Todd)","defence #2"]
["Dominant Brandon (Brandon)","defence #3"]
["Cold Warriors (Tom)","defence #4"]
["Robs Chiefs (Rob)","left wing #1"]
["Riverdogs (Rhonda)","left wing #2"]
["Tad Nugents (Nick)","left wing #3"]
["Woap (Mike)","right wing #1"]
["Brad's Boss Team (Brad)","right wing #2"]
[null,"right wing #3"]
[null,"centre #1"]
[null,"centre #2"]
[null,"centre #3"]
[null,"utility"]
[null,"Reserve Roster #1"]
[null,"Reserve Roster #2"]
[null,"Reserve Roster #3"]
[null,"Reserve Roster #4"]
[null,"Reserve Roster #5"]
[null,"Reserve Roster #6"]
[null,"Reserve Roster #7"]
["Make sure every year to select all the players for each position and recreate the bookmark name (delete name first, then recreate name) to ensure all players get listed.",null,"goalie","defence","left wing","right wing","centre"]
["Ensure that all players are listed when clicking on the button."]
[]
["When changing the toolbar, customize/hockey/attach/delete previous hockey/reattach new hockey toolbar."]
["Draft Order"]
["Brad's Boss Team (Brad)",1]
["Tad Nugents (Nick)",2]
["Woap (Mike)",3]
["Robs Chiefs (Rob)",4]
["Riverdogs (Rhonda)",5]
["Curtis Crazy Canucks (Todd)",6]
["VanekDownByTheRiver (Colin)",7]
["Cold Warriors (Tom)",8]
["Booya's (Cathy)",9]
["Dominant Brandon (Brandon)",10]
["Bruins (Bruce)",11]
[]
["Formulas to Retreive Name and Position"]
["=RIGHT(A1,LEN(A1)+ 5-FIND(\"-\",A1))","Position"]
["=LEFT(A1,FIND(\"-\",A1) -5)","Name"]
["=Trim(cell)","Trim the positions for extra space"]
[]
[]
["When changing names, change the following:"]
["Draft Roster Tab - Change name of team at top of column and in the draft order cell."]
["Visual Basic - Find and replace old name with new name, ensure that project is selected so it changes it for all forms."]