{"text_format":"3","workbook":"xlsx","n_sheets":9,"sheets":["Draft Roster","Draft List","Summary","Centre","Left Wing","Right Wing","Defence","Goalies","Data"],"not_rendered":{"macros":1,"external_links":1,"defined_names":43},"read":"whole","date_system":"1900"}

{"sheet":"Draft Roster","index":0,"n_rows":28,"n_cols":41,"rows_kept":28,"merged":[[0,1,0,4],[0,5,0,8],[0,9,0,12],[0,13,0,16],[0,17,0,20],[0,21,0,24],[0,25,0,28],[0,29,0,32],[0,33,0,36],[0,37,0,40],[1,1,1,4],[1,5,1,8],[1,9,1,12],[1,13,1,16],[1,17,1,20],[1,21,1,24],[1,25,1,28],[1,29,1,32],[1,33,1,36],[1,37,1,39],[21,1,21,2],[21,5,21,6],[21,13,21,14],[21,17,21,18],[21,21,21,22],[21,25,21,26],[21,29,21,30],[21,33,21,34],[21,37,21,38],[22,1,22,2],[22,5,22,6],[22,9,22,10],[22,13,22,14],[22,17,22,18],[22,21,22,22],[22,25,22,26],[22,29,22,30],[22,33,22,34],[22,37,22,38]]}
[null,{"$f":"C25","v":"Draft Order = 8"},{"$nulls":3},{"$f":"G25","v":"Draft Order = 10"},{"$nulls":3},{"$f":"K25","v":"Draft Order = 7"},{"$nulls":3},{"$f":"O25","v":"Draft Order = 5"},{"$nulls":3},{"$f":"S25","v":"Draft Order = 6"},{"$nulls":3},{"$f":"W25","v":"Draft Order = 4"},{"$nulls":3},{"$f":"AA25","v":"Draft Order = 2"},{"$nulls":3},{"$f":"AE25","v":"Draft Order = 1"},{"$nulls":3},{"$f":"AI25","v":"Draft Order = 3"},{"$nulls":3},{"$f":"AM25","v":"Draft Order = 9"}]
[null,"Bruins (Bruce)",{"$nulls":3},"Dominant Brandon (Brandon)",{"$nulls":3},"Booya's (Cathy)",{"$nulls":3},"Killa Chinchillas (Colin)",{"$nulls":3},"Woap (Mike)",{"$nulls":3},"Tad Nugents (Nick)",{"$nulls":3},"Riverdogs (Rhonda)",{"$nulls":3},"Robs Chiefs (Rob)",{"$nulls":3},"Curtis Crazy Canucks (Todd)",{"$nulls":3},"Cold Warriors (Tom)"]
[null,"Pos.","Player","$","years","Pos.","Player","$","years","Pos.","Player","$","years","Pos.","Player","$","years","Pos.","Player","$","years","Pos.","Player","$","years","Pos.","Player","$","years","Pos.","Player","$","years","Pos.","Player","$","years","Pos.","Player","$","years"]
[{"$f":"20-COUNT(D4,H4,L4,P4,T4,X4, AB4,AF4,AJ4,AN4,D5,H5,L5,P5,T5,X5,AB5,AF5,AJ5,AN5)","v":12},"G1","Pekka Rinne\nNsh - G",9,1,"G1",{"$nulls":3},"G1",{"$nulls":3},"G1",{"$nulls":3},"G1","Cory Schneider\nNJ - G",1,1,"G1",{"$nulls":3},"G1","Henrik Lundqvist\nNYR - G",7,1,"G1","Ryan Miller\nVan - G",1,1,"G1",{"$nulls":3},"G1"]
[null,"G2","Martin Jones\nSJ - G",6,2,"G2","Corey Crawford\nChi - G",5,1,"G2",{"$nulls":3},"G2",{"$nulls":3},"G2",{"$nulls":3},"G2","Ben Bishop\nTB - G",8,1,"G2","John Gibson\nAnh - G",3,1,"G2",{"$nulls":3},"G2",{"$nulls":3},"G2"]
[{"$f":"40-COUNT(D6:D9,H6:H9,L6:L9,P6:P9,T6:T9,X6:X9,AB6:AB9,AF6:AF9,AJ6:AJ9,AN6:AN9)","v":15},"D","Alex Pietrangelo\nStL - D",15,1,"D","Dougie Hamilton\nCgy - D",4,1,"D","Brent Burns\nSJ - D",17,2,"D",{"$nulls":3},"D",{"$nulls":3},"D",{"$nulls":3},"D",{"$nulls":3},"D","Dion Phaneuf\nOtt - D",3,1,"D","Aaron Ekblad\nFla - D",9,1,"D"]
[null,"D","Torey Krug\nBos - D",6,1,"D",{"$nulls":3},"D","Duncan Keith\nChi - D",12,2,"D",{"$nulls":3},"D",{"$nulls":3},"D",{"$nulls":3},"D","Seth Jones\nCls - D",1,1,"D","Nick Leddy\nNYI - D",5,1,"D","Shea Weber\nMon - D",17,1,"D"]
[null,"D","Morgan Rielly\nTor - D",6,1,"D",{"$nulls":3},"D","John Carlson\nWas - D",16,2,"D","Sami Vatanen\nAnh - D",6,1,"D","Mark Giordano\nCgy - D",9,1,"D",{"$nulls":3},"D","Justin Faulk\nCar - D",4,1,"D","Ryan Suter\nMin - D",4,2,"D","Drew Doughty\nLA - D",17,1,"D","Dustin Byfuglien\nWpg - D",10,1]
[null,"D",{"$nulls":3},"D",{"$nulls":3},"D",{"$nulls":3},"D","Roman Josi\nNsh - D",7,2,"D","Rasmus Ristolainen\nBuf - D",6,2,"D","Keith Yandle\nFla - D",12,1,"D","Victor Hedman\nTB - D",7,1,"D","Marc-Edouard Vlasic\nSJ - D",3,1,"D","Hampus Lindholm\nAnh - D",6,2,"D","Shayne Gostisbehere\nPhi - D",9,3]
[{"$f":"30-COUNT(D10:D12,H10:H12,L10:L12,P10:P12,#REF!,T10:T12,X10:X12,AB10:AB12,AF10:AF12,AJ10:AJ12,AN10:AN12)","v":14},"LW","Mike Hoffman\nOtt - LW",3,1,"LW","Andrew Ladd\nNYI - LW",7,1,"LW",{"$nulls":3},"LW",{"$nulls":3},"LW",{"$nulls":3},"LW","Zach Parise\nMin - LW",16,1,"LW",{"$nulls":3},"LW",{"$nulls":3},"LW","Milan Lucic\nEdm - LW",3,1,"LW"]
[null,"LW","Artemi Panarin\nChi - LW",7,3,"LW","Max Pacioretty\nMon - LW",15,1,"LW",{"$nulls":3},"LW",{"$nulls":3},"LW",{"$nulls":3},"LW","Jamie Benn\nDal - LW",28,1,"LW","Nick Foligno\nCls - LW",6,1,"LW","Ryan O'Reilly\nBuf - C,LW",6,1,"LW",{"$nulls":3},"LW"]
[null,"LW","Jaden Schwartz\nStL - LW",13,2,"LW","Johnny Gaudreau\nCgy - LW",9,3,"LW",{"$nulls":3},"LW","Ondrej Palat\nTB - LW",7,1,"LW","Jonathan Drouin\nTB - LW",8,2,"LW","Jussi Jokinen\nFla - LW",6,2,"LW","Loui Eriksson\nVan - LW",6,2,"LW","Chris Kreider\nNYR - LW",1,1,"LW",{"$nulls":3},"LW"]
[{"$f":"30-COUNT(D13:D15,H13:H15,L13:L15,P13:P15,T13:T15,X13:X15,AB13:AB15,AF13:AF15,AJ13:AJ15,AN13:AN15)","v":14},"RW",{"$nulls":3},"RW",{"$nulls":3},"RW","Jiri Hudler\nDal - C,RW",7,1,"RW",{"$nulls":3},"RW",{"$nulls":3},"RW","Blake Wheeler\nWpg - RW",12,1,"RW","Tomas Tatar\nDet - LW",6,1,"RW","Jaromir Jagr\nFla - RW",3,1,"RW","Joel Ward\nSJ - RW",3,1,"RW"]
[null,"RW",{"$nulls":3},"RW",{"$nulls":3},"RW","Nikita Kucherov\nTB - RW",6,1,"RW","Patric Hornqvist\nPit - RW",8,1,"RW","Nathan MacKinnon\nCol - C,RW",13,1,"RW","Wayne Simmonds\nPhi - RW",4,2,"RW",{"$nulls":3},"RW","Phil Kessel\nPit - RW",29,1,"RW",{"$nulls":3},"RW"]
[null,"RW","Vladimir Tarasenko\nStL - RW",8,2,"RW","Bobby Ryan\nOtt - RW",2,1,"RW",{"$nulls":3},"RW","Jordan Eberle\nEdm - RW",15,3,"RW","Brandon Saad\nCls - LW,RW",5,1,"RW","James Neal\nNsh - RW",9,2,"RW",{"$nulls":3},"RW","Mark Stone\nOtt - RW",6,1,"RW",{"$nulls":3},"RW"]
[{"$f":"30-COUNT(D16:D18,H16:H18,L16:L18,P16:P18,T16:T18,X16:X18,AB16:AB18,AF16:AF18,AJ16:AJ18,AN16:AN18)","v":8},"C","Claude Giroux\nPhi - C",29,1,"C","Matt Duchene\nCol - C",12,1,"C","Derick Brassard\nOtt - C",6,1,"C","Joe Thornton\nSJ - C",4,1,"C",{"$nulls":3},"C",{"$nulls":3},"C","Evgeni Malkin\nPit - C",32,1,"C",{"$nulls":3},"C","Sean Monahan\nCgy - C",6,1,"C"]
[null,"C","Leon Draisaitl\nEdm - C",3,1,"C",{"$nulls":3},"C","Filip Forsberg\nNsh - LW",9,2,"C","Alex Galchenyuk\nMon - C",9,2,"C",{"$nulls":3},"C",{"$nulls":3},"C","Ryan Getzlaf\nAnh - C",28,1,"C","Nicklas Backstrom\nWas - C",29,1,"C","Aleksander Barkov\nFla - C",6,2,"C","Anze Kopitar\nLA - C",23,1]
[null,"C","Tyler Seguin\nDal - C",40,1,"C",{"$nulls":3},"C","John Tavares\nNYI - C",40,2,"C","Tyler Johnson\nTB - C",7,2,"C","Dylan Larkin\nDet - C,RW",9,3,"C","Patrice Bergeron\nBos - C",10,2,"C","Mark Scheifele\nWpg - C",4,2,"C","Steven Stamkos\nTB - C",35,1,"C","Connor McDavid\nEdm - C",34,3,"C","Henrik Sedin\nVan - C",14,1]
[{"$f":"10-COUNT(D19,H19,L19,P19,T19,X19,AB19,AF19,AJ19,AN19)","v":6},"U","David Krejci\nBos - C",1,1,"U","Brad Marchand\nBos - LW",3,1,"U",{"$nulls":3},"U","Evgeny Kuznetsov\nWas - C",6,1,"U",{"$nulls":3},"U","Max Domi\nAri - LW",6,2,"U",{"$nulls":3},"U",{"$nulls":3},"U",{"$nulls":3},"U"]
[null,null,"Current Used Points",{"$f":"SUM(D4:D19)","v":146},null,null,"Current Used Points",{"$f":"SUM(H4:H19)","v":57},null,null,"Current Used Points",{"$f":"SUM(L4:L19)","v":113},null,null,"Current Used Points",{"$f":"SUM(P4:P19)","v":69},null,null,"Current Used Points",{"$f":"SUM(T4:T19)","v":51},null,null,"Current Used Points",{"$f":"SUM(X4:X19)","v":111},null,null,"Current Used Points",{"$f":"SUM(AB4:AB19)","v":104},null,null,"Current Used Points",{"$f":"SUM(AF4:AF19)","v":125},null,null,"Current Used Points",{"$f":"SUM(AJ4:AJ19)","v":101},null,null,"Current Used Points",{"$f":"SUM(AN4:AN19)","v":56}]
[null,null,"Remaining Points",{"$f":"SUM(150-D20)","v":4},null,null,"Remaining Points",{"$f":"SUM(150-H20)","v":93},null,null,"Remaining Points",{"$f":"SUM(150-L20)","v":37},null,null,"Remaining Points",{"$f":"SUM(150-P20)","v":81},null,null,"Remaining Points",{"$f":"SUM(150-T20)","v":99},null,null,"Remaining Points",{"$f":"SUM(150-X20)","v":39},null,null,"Remaining Points",{"$f":"SUM(150-AB20)","v":46},null,null,"Remaining Points",{"$f":"SUM(150-AF20)","v":25},null,null,"Remaining Points",{"$f":"SUM(150-AJ20)","v":49},null,null,"Remaining Points",{"$f":"SUM(150-AN20)","v":94}]
[null,"Maximum Bidding Points",null,{"$f":"(D21-(16-COUNT(D4:D19))+(IF(COUNT(D4:D19)=16,0,1)))","v":2},null,"Maximum Bidding Points",null,{"$f":"(H21-(16-COUNT(H4:H19))+(IF(COUNT(H4:H19)=16,0,1)))","v":86},null,null,"Maximum Bidding Points",{"$f":"(L21-(16-COUNT(L4:L19))+(IF(COUNT(L4:L19)=16,0,1)))","v":30},null,"Maximum Bidding Points",null,{"$f":"(P21-(16-COUNT(P4:P19))+(IF(COUNT(P4:P19)=16,0,1)))","v":75},null,"Maximum Bidding Points",null,{"$f":"(T21-(16-COUNT(T4:T19))+(IF(COUNT(T4:T19)=16,0,1)))","v":91},null,"Maximum Bidding Points",null,{"$f":"(X21-(16-COUNT(X4:X19))+(IF(COUNT(X4:X19)=16,0,1)))","v":34},null,"Maximum Bidding Points",null,{"$f":"(AB21-(16-COUNT(AB4:AB19))+(IF(COUNT(AB4:AB19)=16,0,1)))","v":42},null,"Maximum Bidding Points",null,{"$f":"(AF21-(16-COUNT(AF4:AF19))+(IF(COUNT(AF4:AF19)=16,0,1)))","v":22},null,"Maximum Bidding Points",null,{"$f":"(AJ21-(16-COUNT(AJ4:AJ19))+(IF(COUNT(AJ4:AJ19)=16,0,1)))","v":43},null,"Maximum Bidding Points",null,{"$f":"(AN21-(16-COUNT(AN4:AN19))+(IF(COUNT(AN4:AN19)=16,0,1)))","v":83}]
[null,"Remaining Players to Draft",null,{"$f":"16-COUNT(D4:D19)","v":3},null,"Remaining Players to Draft",null,{"$f":"16-COUNT(H4:H19)","v":8},null,"Remaining Players to Draft",null,{"$f":"16-COUNT(L4:L19)","v":8},null,"Remaining Players to Draft",null,{"$f":"16-COUNT(P4:P19)","v":7},null,"Remaining Players to Draft",null,{"$f":"16-COUNT(T4:T19)","v":9},null,"Remaining Players to Draft",null,{"$f":"16-COUNT(X4:X19)","v":6},null,"Remaining Players to Draft",null,{"$f":"16-COUNT(AB4:AB19)","v":5},null,"Remaining Players to Draft",null,{"$f":"16-COUNT(AF4:AF19)","v":4},null,"Remaining Players to Draft",null,{"$f":"16-COUNT(AJ4:AJ19)","v":7},null,"Remaining Players to Draft",null,{"$f":"16-COUNT(AN4:AN19)","v":12}]
[]
[null,null,{"$f":"\"Draft Order = \"&VLOOKUP(\"Bruins (Bruce)\",draftorder,2,FALSE)","v":"Draft Order = 8"},{"$nulls":3},{"$f":"\"Draft Order = \"&VLOOKUP(\"Dominant Brandon (Brandon)\",draftorder,2,FALSE)","v":"Draft Order = 10"},{"$nulls":3},{"$f":"\"Draft Order = \"&VLOOKUP(\"Booya's (Cathy)\",draftorder,2,FALSE)","v":"Draft Order = 7"},{"$nulls":3},{"$f":"\"Draft Order = \"&VLOOKUP(\"Killa Chinchillas (Colin)\",draftorder,2,FALSE)","v":"Draft Order = 5"},{"$nulls":3},{"$f":"\"Draft Order = \"&VLOOKUP(\"Woap (Mike)\",draftorder,2,FALSE)","v":"Draft Order = 6"},{"$nulls":3},{"$f":"\"Draft Order = \"&VLOOKUP(\"Tad Nugents (Nick)\",draftorder,2,FALSE)","v":"Draft Order = 4"},{"$nulls":3},{"$f":"\"Draft Order = \"&VLOOKUP(\"Riverdogs (Rhonda)\",draftorder,2,FALSE)","v":"Draft Order = 2"},{"$nulls":3},{"$f":"\"Draft Order = \"&VLOOKUP(\"Robs Chiefs (Rob)\",draftorder,2,FALSE)","v":"Draft Order = 1"},{"$nulls":3},{"$f":"\"Draft Order = \"&VLOOKUP(\"Curtis Crazy Canucks (Todd)\",draftorder,2,FALSE)","v":"Draft Order = 3"},{"$nulls":3},{"$f":"\"Draft Order = \"&VLOOKUP(\"Cold Warriors (Tom)\",draftorder,2,FALSE)","v":"Draft Order = 9"}]
[null,null,"William Nylander\nTor - C,RW",3,"r2016",null,"Sam Bennett\nCgy - C",3,"r2016",{"$nulls":5},"Jack Eichel\nBuf - C",5,"r2016"]
[null,null,"David Pastrnak\nBos - RW",3,"r2016"]
[null,null,"Nikolaj Ehlers\nWpg - LW,RW",3,"r2016"]

{"sheet":"Draft List","index":1,"n_rows":97,"n_cols":9,"rows_kept":97}
[96,"Team","Player","Bid","NHL Team","Rank","Points","Wins","Shutouts"]
[1,"Bruins (Bruce)","Pekka Rinne",9,"Nsh - G",34,34,4,72]
[2,"Bruins (Bruce)","Martin Jones",6,"SJ - G",23,37,6,80]
[3,"Bruins (Bruce)","Alex Pietrangelo",15,"StL - D",143,37]
[4,"Bruins (Bruce)","Torey Krug",6,"Bos - D",75,44]
[5,"Bruins (Bruce)","Morgan Rielly",6,"Tor - D",219,36]
[6,"Bruins (Bruce)","Mike Hoffman",3,"Ott - LW",130,59]
[7,"Bruins (Bruce)","Artemi Panarin",7,"Chi - LW",27,77]
[8,"Bruins (Bruce)","Jaden Schwartz",13,"StL - LW",127,22]
[9,"Bruins (Bruce)","Vladimir Tarasenko",8,"StL - RW",6,74]
[10,"Bruins (Bruce)","Claude Giroux",29,"Phi - C",15,67]
[11,"Bruins (Bruce)","Leon Draisaitl",3,"Edm - C",177,51]
[12,"Bruins (Bruce)","Tyler Seguin",40,"Dal - C",12,73]
[13,"Bruins (Bruce)","David Krejci",1,"Bos - C",105,63]
[14,"Bruins (Bruce)","William Nylander",3,"Tor - C,RW",188,13]
[15,"Bruins (Bruce)","David Pastrnak",3,"Bos - RW",159,26]
[16,"Bruins (Bruce)","Nikolaj Ehlers",3,"Wpg - LW,RW",213,38]
[17,"Dominant Brandon (Brandon)","Corey Crawford",5,"Chi - G",30,35,7,77]
[18,"Dominant Brandon (Brandon)","Dougie Hamilton",4,"Cgy - D",110,43]
[19,"Dominant Brandon (Brandon)","Andrew Ladd",7,"NYI - LW",79,46]
[20,"Dominant Brandon (Brandon)","Max Pacioretty",15,"Mon - LW",47,64]
[21,"Dominant Brandon (Brandon)","Johnny Gaudreau",9,"Cgy - LW",8,78]
[22,"Dominant Brandon (Brandon)","Bobby Ryan",2,"Ott - RW",126,56]
[23,"Dominant Brandon (Brandon)","Matt Duchene",12,"Col - C",72,59]
[24,"Dominant Brandon (Brandon)","Brad Marchand",3,"Bos - LW",58,61]
[25,"Dominant Brandon (Brandon)","Sam Bennett",3,"Cgy - C",295,36]
[26,"Booya's (Cathy)","Brent Burns",17,"SJ - D",13,75]
[27,"Booya's (Cathy)","Duncan Keith",12,"Chi - D",63,43]
[28,"Booya's (Cathy)","John Carlson",16,"Was - D",56,39]
[29,"Booya's (Cathy)","Jiri Hudler",7,"Dal - C,RW",241,46]
[30,"Booya's (Cathy)","Nikita Kucherov",6,"TB - RW",29,66]
[31,"Booya's (Cathy)","John Tavares",40,"NYI - C",11,70]
[32,"Booya's (Cathy)","Derick Brassard",6,"Ott - C",137,58]
[33,"Booya's (Cathy)","Filip Forsberg",9,"Nsh - LW",50,64]
[34,"Killa Chinchillas (Colin)","Sami Vatanen",6,"Anh - D",138,38]
[35,"Killa Chinchillas (Colin)","Roman Josi",7,"Nsh - D",57,61]
[36,"Killa Chinchillas (Colin)","Ondrej Palat",7,"TB - LW",161,40]
[37,"Killa Chinchillas (Colin)","Jordan Eberle",15,"Edm - RW",93,47]
[38,"Killa Chinchillas (Colin)","Patric Hornqvist",8,"Pit - RW",124,51]
[39,"Killa Chinchillas (Colin)","Joe Thornton",4,"SJ - C",40,82]
[40,"Killa Chinchillas (Colin)","Alex Galchenyuk",9,"Mon - C",96,56]
[41,"Killa Chinchillas (Colin)","Tyler Johnson",7,"TB - C",114,38]
[42,"Killa Chinchillas (Colin)","Evgeny Kuznetsov",6,"Was - C",17,77]
[43,"Killa Chinchillas (Colin)","Jack Eichel",5,"Buf - C",39,56]
[44,"Woap (Mike)","Cory Schneider",1,"NJ - G",25,27,4,58]
[45,"Woap (Mike)","Rasmus Ristolainen",6,"Buf - D",104,41]
[46,"Woap (Mike)","Mark Giordano",9,"Cgy - D",70,56]
[47,"Woap (Mike)","Jonathan Drouin",8,"TB - LW",117,10]
[48,"Woap (Mike)","Nathan MacKinnon",13,"Col - C,RW",52,52]
[49,"Woap (Mike)","Brandon Saad",5,"Cls - LW,RW",82,53]
[50,"Woap (Mike)","Dylan Larkin",9,"Det - C,RW",111,45]
[51,"Tad Nugents (Nick)","Ben Bishop",8,"TB - G",14,35,6,76]
[52,"Tad Nugents (Nick)","Keith Yandle",12,"Fla - D",77,47]
[53,"Tad Nugents (Nick)","Zach Parise",16,"Min - LW",59,53]
[54,"Tad Nugents (Nick)","Jamie Benn",28,"Dal - LW",4,89]
[55,"Tad Nugents (Nick)","Jussi Jokinen",6,"Fla - LW",103,60]
[56,"Tad Nugents (Nick)","Blake Wheeler",12,"Wpg - RW",36,78]
[57,"Tad Nugents (Nick)","Wayne Simmonds",4,"Phi - RW",43,60]
[58,"Tad Nugents (Nick)","James Neal",9,"Nsh - RW",33,58]
[59,"Tad Nugents (Nick)","Patrice Bergeron",10,"Bos - C",35,68]
[60,"Tad Nugents (Nick)","Max Domi",6,"Ari - LW",90,52]
[61,"Riverdogs (Rhonda)","Henrik Lundqvist",7,"NYR - G",37,35,4,74]
[62,"Riverdogs (Rhonda)","John Gibson",3,"Anh - G",28,21,4,46]
[63,"Riverdogs (Rhonda)","Seth Jones",1,"Cls - D",157,31]
[64,"Riverdogs (Rhonda)","Justin Faulk",4,"Car - D",78,37]
[65,"Riverdogs (Rhonda)","Victor Hedman",7,"TB - D",76,47]
[66,"Riverdogs (Rhonda)","Nick Foligno",6,"Cls - LW",318,37]
[67,"Riverdogs (Rhonda)","Loui Eriksson",6,"Van - LW",112,63]
[68,"Riverdogs (Rhonda)","Evgeni Malkin",32,"Pit - C",21,58]
[69,"Riverdogs (Rhonda)","Tomas Tatar",6,"Det - LW",200,45]
[70,"Riverdogs (Rhonda)","Ryan Getzlaf",28,"Anh - C",54,63]
[71,"Riverdogs (Rhonda)","Mark Scheifele",4,"Wpg - C",51,61]
[72,"Curtis Crazy Canucks (Todd)","Hampus Lindholm",6,"Anh - D",167,28]
[73,"Curtis Crazy Canucks (Todd)","Shea Weber",17,"Mon - D",62,51]
[74,"Curtis Crazy Canucks (Todd)","Drew Doughty",17,"LA - D",44,51]
[75,"Curtis Crazy Canucks (Todd)","Aaron Ekblad",9,"Fla - D",83,36]
[76,"Curtis Crazy Canucks (Todd)","Milan Lucic",3,"Edm - LW",91,55]
[77,"Curtis Crazy Canucks (Todd)","Joel Ward",3,"SJ - RW",320,43]
[78,"Curtis Crazy Canucks (Todd)","Aleksander Barkov",6,"Fla - C",46,59]
[79,"Curtis Crazy Canucks (Todd)","Sean Monahan",6,"Cgy - C",49,63]
[80,"Curtis Crazy Canucks (Todd)","Connor McDavid",34,"Edm - C",5,48]
[81,"Cold Warriors (Tom)","Dustin Byfuglien",10,"Wpg - D",38,53]
[82,"Cold Warriors (Tom)","Shayne Gostisbehere",9,"Phi - D",53,46]
[83,"Cold Warriors (Tom)","Anze Kopitar",23,"LA - C",26,74]
[84,"Cold Warriors (Tom)","Henrik Sedin",14,"Van - C",125,55]
[85,"Robs Chiefs (Rob)","Ryan Miller",1,"Van - G",170,17,1,35]
[86,"Robs Chiefs (Rob)","Dion Phaneuf",3,"Ott - D",193,32]
[87,"Robs Chiefs (Rob)","Nick Leddy",5,"NYI - D",191,40]
[88,"Robs Chiefs (Rob)","Ryan Suter",4,"Min - D",122,51]
[89,"Robs Chiefs (Rob)","Marc-Edouard Vlasic",3,"SJ - D",139,39]
[90,"Robs Chiefs (Rob)","Ryan O'Reilly",6,"Buf - C,LW",86,60]
[91,"Robs Chiefs (Rob)","Chris Kreider",1,"NYR - LW",141,43]
[92,"Robs Chiefs (Rob)","Jaromir Jagr",3,"Fla - RW",116,66]
[93,"Robs Chiefs (Rob)","Phil Kessel",29,"Pit - RW",32,59]
[94,"Robs Chiefs (Rob)","Mark Stone",6,"Ott - RW",107,61]
[95,"Robs Chiefs (Rob)","Nicklas Backstrom",29,"Was - C",31,70]
[96,"Robs Chiefs (Rob)","Steven Stamkos",35,"TB - C",7,64]

{"sheet":"Summary","index":2,"n_rows":12,"n_cols":11,"rows_kept":12}
["Owners","Current Used Points","Remaining Points","Maximum Bidding Points","Remaining # Players to Draft","Goalies","Defence","Left Wingers","Right Wingers","Centres","Utility"]
["Bruins (Bruce)",146,4,2,3,{"$f":"2-COUNT('Draft Roster'!D4:D5)","v":0},{"$f":"4-COUNT('Draft Roster'!D6:D9)","v":1},{"$f":"3-COUNT('Draft Roster'!D10:D12)","v":0},{"$f":"3-COUNT('Draft Roster'!D13:D15)","v":2},{"$f":"3-COUNT('Draft Roster'!D16:D18)","v":0},{"$f":"1-COUNT('Draft Roster'!D19)","v":0}]
["Dominant Brandon (Brandon)",57,93,86,8,{"$f":"2-COUNT('Draft Roster'!H4:H5)","v":1},{"$f":"4-COUNT('Draft Roster'!H6:H9)","v":3},{"$f":"3-COUNT('Draft Roster'!H10:H12)","v":0},{"$f":"3-COUNT('Draft Roster'!H13:H15)","v":2},{"$f":"3-COUNT('Draft Roster'!H16:H18)","v":2},{"$f":"1-COUNT('Draft Roster'!H19)","v":0}]
["Booya's (Cathy)",113,37,30,8,{"$f":"2-COUNT('Draft Roster'!L4:L5)","v":2},{"$f":"4-COUNT('Draft Roster'!L6:L9)","v":1},{"$f":"3-COUNT('Draft Roster'!L10:L12)","v":3},{"$f":"3-COUNT('Draft Roster'!L13:L15)","v":1},{"$f":"3-COUNT('Draft Roster'!L16:L18)","v":0},{"$f":"1-COUNT('Draft Roster'!L19)","v":1}]
["Killa Chinchillas (Colin)",69,81,75,7,{"$f":"2-COUNT('Draft Roster'!P4:P5)","v":2},{"$f":"4-COUNT('Draft Roster'!P6:P9)","v":2},{"$f":"3-COUNT('Draft Roster'!P10:P12)","v":2},{"$f":"3-COUNT('Draft Roster'!P13:P15)","v":1},{"$f":"3-COUNT('Draft Roster'!P16:P18)","v":0},{"$f":"1-COUNT('Draft Roster'!P19)","v":0}]
["Woap (Mike)",62,88,81,8,{"$f":"2-COUNT('Draft Roster'!T4:T5)","v":1},{"$f":"4-COUNT('Draft Roster'!T6:T9)","v":2},{"$f":"3-COUNT('Draft Roster'!T10:T12)","v":2},{"$f":"3-COUNT('Draft Roster'!T13:T15)","v":1},{"$f":"3-COUNT('Draft Roster'!T16:T18)","v":2},{"$f":"1-COUNT('Draft Roster'!T19)","v":1}]
["Tad Nugents (Nick)",111,39,34,6,{"$f":"2-COUNT('Draft Roster'!X4:X5)","v":1},{"$f":"4-COUNT('Draft Roster'!X6:X9)","v":3},{"$f":"3-COUNT('Draft Roster'!X10:X12)","v":0},{"$f":"3-COUNT('Draft Roster'!X13:X15)","v":0},{"$f":"3-COUNT('Draft Roster'!X16:X18)","v":2},{"$f":"1-COUNT('Draft Roster'!X19)","v":0}]
["Riverdogs (Rhonda)",104,46,42,5,{"$f":"2-COUNT('Draft Roster'!AB4:AB5)","v":0},{"$f":"4-COUNT('Draft Roster'!AB6:AB9)","v":1},{"$f":"3-COUNT('Draft Roster'!AB10:AB12)","v":1},{"$f":"3-COUNT('Draft Roster'!AB13:AB15)","v":2},{"$f":"3-COUNT('Draft Roster'!AB16:AB18)","v":0},{"$f":"1-COUNT('Draft Roster'!AB19)","v":1}]
["Flying Scotsman (Rob)",122,28,25,4,{"$f":"2-COUNT('Draft Roster'!AF4:AF5)","v":1},{"$f":"4-COUNT('Draft Roster'!AF6:AF9)","v":0},{"$f":"3-COUNT('Draft Roster'!AF10:AF12)","v":1},{"$f":"3-COUNT('Draft Roster'!AF13:AF15)","v":0},{"$f":"3-COUNT('Draft Roster'!AF16:AF18)","v":1},{"$f":"1-COUNT('Draft Roster'!AF19)","v":1}]
["Curtis Crazy Canucks (Todd)",101,49,43,7,{"$f":"2-COUNT('Draft Roster'!AJ4:AJ5)","v":2},{"$f":"4-COUNT('Draft Roster'!AJ6:AJ9)","v":0},{"$f":"3-COUNT('Draft Roster'!AJ10:AJ12)","v":2},{"$f":"3-COUNT('Draft Roster'!AJ13:AJ15)","v":2},{"$f":"3-COUNT('Draft Roster'!AJ16:AJ18)","v":0},{"$f":"1-COUNT('Draft Roster'!AJ19)","v":1}]
["Cold Warriors (Tom)",56,94,83,12,{"$f":"2-COUNT('Draft Roster'!AN4:AN5)","v":2},{"$f":"4-COUNT('Draft Roster'!AN6:AN9)","v":2},{"$f":"3-COUNT('Draft Roster'!AN10:AN12)","v":3},{"$f":"3-COUNT('Draft Roster'!AN13:AN15)","v":3},{"$f":"3-COUNT('Draft Roster'!AN16:AN18)","v":1},{"$f":"1-COUNT('Draft Roster'!AN19)","v":1}]
[{"$nulls":4},{"$f":"SUM(E2:E11)","v":68},{"$f":"SUM(F2:F11)","v":12},{"$f":"SUM(G2:G11)","v":15},14,14,8,6]

{"sheet":"Centre","index":3,"n_rows":176,"n_cols":5,"rows_kept":176}
["Player","Team","GP","O-Rank","Points"]
["Sidney Crosby","Pit - C",80,3,85]
["Joe Pavelski","SJ - C,RW",82,9,78]
["Logan Couture","SJ - C",52,24,36]
["Jason Spezza","Dal - C",75,55,63]
["Ryan Johansen","Nsh - C",80,61,60]
["Jonathan Toews","Chi - C",80,66,58]
["Brayden Schenn","Phi - C,LW",80,81,59]
["Ryan Kesler","Anh - C",79,89,53]
["Jeff Carter","LA - C",77,94,62]
["Tyler Toffoli","LA - C,RW",82,95,58]
["Boone Jenner","Cls - C,LW",82,102,49]
["Adam Henrique","NJ - C",80,113,50]
["Tomas Hertl","SJ - C",81,118,46]
["Auston Matthews","Tor - C","-",121,0]
["Vincent Trocheck","Fla - C",76,128,53]
["Henrik Zetterberg","Det - C,LW",82,134,50]
["Bryan Little","Wpg - C",57,136,42]
["Patrick Marleau","SJ - C,LW",82,144,48]
["Robby Fabbri","StL - C,LW",72,156,37]
["Dylan Strome","Ari - C","-",163,0]
["Rickard Rakell","Anh - C",72,164,43]
["Kyle Turris","Ott - C",57,168,30]
["Derek Stepan","NYR - C",72,169,53]
["Mika Zibanejad","NYR - C,RW",81,180,51]
["Sam Reinhart","Buf - C,RW",79,182,42]
["Alex Killorn","TB - C",81,186,40]
["Paul Stastny","StL - C",64,192,49]
["Eric Staal","Min - C",83,202,39]
["Mikko Koivu","Min - C",82,206,56]
["Brandon Dubinsky","Cls - C",75,210,48]
["Mikael Granlund","Min - C",82,217,44]
["Ryan Spooner","Bos - C",80,222,49]
["Frans Nielsen","Det - C",81,225,52]
["Brandon Pirri","NYR - C",61,231,29]
["Ryan Nugent-Hopkins","Edm - C",55,244,34]
["Carl Soderberg","Col - C",82,245,51]
["Artem Anisimov","Chi - C",77,246,42]
["Jori Lehtera","StL - C",79,249,34]
["Tyler Ennis","Buf - C,LW",23,252,11]
["Nazem Kadri","Tor - C",76,263,45]
["Leo Komarov","Tor - C,RW",67,264,36]
["Victor Rask","Car - C",80,265,48]
["Tomas Plekanec","Mon - C",82,269,54]
["Andrew Shaw","Mon - C",78,273,34]
["Tyler Bozak","Tor - C",57,274,35]
["Jordan Staal","Car - C,LW",82,278,48]
["Charlie Coyle","Min - C,RW",82,279,42]
["Cody Eakin","Dal - C",82,281,35]
["Mike Fisher","Nsh - C",70,284,23]
["Sean Couturier","Phi - C",63,285,39]
["Tommy Wingels","SJ - C,RW",68,287,18]
["Elias Lindholm","Car - C,RW",82,298,39]
["Valtteri Filppula","TB - C,LW",76,303,31]
["J.T. Miller","NYR - C,LW",82,304,43]
["Nick Bjugstad","Fla - C",67,317,34]
["Mathieu Perreault","Wpg - C,LW",71,322,41]
["Zack Smith","Ott - C",81,331,36]
["Darren Helm","Det - C",77,339,26]
["Riley Sheahan","Det - C",81,347,25]
["Nick Bonino","Pit - C",63,355,29]
["Travis Zajac","NJ - C",74,356,42]
["Michael Frolik","Cgy - C,RW",64,358,32]
["Pavel Datsyuk","Ari - C,LW",66,359,49]
["Mike Ribeiro","Nsh - C",81,360,50]
["Antoine Vermette","Anh - C",76,363,38]
["Martin Hanzal","Ari - C",64,364,41]
["Mikael Backlund","Cgy - C",82,366,47]
["Brad Richards","Det - C,LW",68,373,28]
["Jean-Gabriel Pageau","Ott - C",82,374,43]
["Vladislav Namestnikov","TB - C",80,385,35]
["Erik Haula","Min - C,LW",76,397,34]
["Joe Colborne","Col - C",73,398,44]
["Alexander Wennberg","Cls - C",69,412,40]
["David Desharnais","Mon - C",65,414,29]
["Matt Cullen","Pit - C",82,415,32]
["Oscar Lindberg","NYR - C",68,418,28]
["Brian Boyle","TB - C",76,419,20]
["Peter Holland","Tor - C",65,420,27]
["Bo Horvat","Van - C",82,422,40]
["Colton Sceviour","Fla - C,RW",71,423,23]
["Calle Jarnkrok","Nsh - C",81,425,30]
["Vernon Fiddler","NJ - C,LW",82,427,22]
["Ryan White","Ari - C",73,428,16]
["Daniel Winnik","Was - C,LW",76,429,19]
["Lars Eller","Was - C",79,432,26]
["Luke Glendening","Det - C",81,436,21]
["Casey Cizikas","NYI - C",80,437,29]
["Brad Boyes","Tor - C,RW",60,439,24]
["Mikhail Grabovski","NYI - C,RW",58,440,25]
["John Mitchell","Col - C",71,442,21]
["Sam Gagner","Cls - C,RW",53,444,16]
["Mattias Janmark","Dal - C",73,450,29]
["Trevor Lewis","LA - C",75,461,16]
["Ryan Garbutt","Anh - C",80,462,14]
["Andrej Nestrasil","Car - C",55,466,23]
["Zemgus Girgensons","Buf - C,LW",71,469,18]
["Vincent Lecavalier","LA - C,LW",49,472,18]
["Torrey Mitchell","Mon - C,RW",71,475,19]
["Melker Karlsson","SJ - C,LW",65,476,19]
["Riley Nash","Bos - C",64,478,22]
["Adam Lowry","Wpg - C,LW",74,480,17]
["Patrik Berglund","StL - C",42,481,15]
["Eric Fehr","Pit - C,RW",55,494,14]
["Shawn Matthias","Wpg - C",71,495,28]
["Gregory Campbell","Cls - C",82,496,11]
["Josh Jooris","NYR - C",59,498,13]
["Mikhail Grigorenko","Col - C",74,499,27]
["Matt Stajan","Cgy - C",80,500,17]
["Derek MacKenzie","Fla - C",64,502,13]
["Mark Letestu","Edm - C",82,503,25]
["Scott Laughton","Phi - C",71,505,21]
["Cedric Paquette","TB - C",56,513,11]
["Jared McCann","Fla - C",69,518,18]
["David Legwand","Buf - C",79,532,14]
["Kyle Brodziak","StL - C",76,539,11]
["Alexander Burmistrov","Wpg - C,LW",81,541,21]
["Chris Tierney","SJ - C",79,544,20]
["Jacob Josefson","NJ - C",58,546,14]
["Brandon Sutter","Van - C",20,548,9]
["Nick Spaling","SJ - C,LW",58,549,13]
["Lance Bouma","Cgy - C,LW",44,552,7]
["Nate Thompson","Anh - C",49,556,6]
["Jonathan Marchessault","Fla - C",45,557,18]
["Brad Malone","Was - C",57,561,6]
["Chris VandeVelde","Phi - C",79,563,14]
["Brooks Laich","Tor - C",81,564,14]
["William Karlsson","Cls - C",81,567,20]
["Radek Faksa","Dal - C",45,568,12]
["R.J. Umberger","Phi - C",39,575,11]
["Nick Shore","LA - C",68,576,10]
["Sergey Kalinin","NJ - C",78,577,15]
["Patrik Elias","NJ - C,LW",16,583,8]
["Colin Greening","Tor - C",31,588,15]
["Jordan Nolan","LA - C,LW",52,590,5]
["Dave Bolland","Ari - C",25,601,5]
["Andrew Copp","Wpg - C",77,606,13]
["Frank Vatrano","Bos - C",39,607,11]
["Marko Dano","Wpg - C,LW",34,610,10]
["Brian Flynn","Mon - C",56,616,10]
["Markus Granlund","Van - C",47,617,10]
["Marcus Kruger","Chi - C",41,621,4]
["Quinton Howden","Wpg - C",58,628,11]
["Jay McClement","Car - C",77,632,11]
["Landon Ferraro","StL - C",68,633,10]
["Steve Ott","Det - C,LW",21,636,2]
["Dennis Rasmussen","Chi - C",44,638,9]
["Nick Cousins","Phi - C",36,639,10]
["Chris Wagner","Anh - C",43,642,6]
["Chris Kelly","Ott - C",11,649,2]
["Max Talbot","Bos - C",38,657,7]
["Anton Lander","Edm - C",61,659,3]
["Zach Hyman","Tor - C",16,663,6]
["Barclay Goodrow","SJ - C,RW",14,664,3]
["Colton Sissons","Nsh - C",34,665,6]
["Boyd Gordon","Phi - C",65,667,4]
["Jordan Schroeder","Min - C",26,669,4]
["Scott Wilson","Pit - C,LW",24,670,6]
["Nic Petan","Wpg - C,LW",26,672,6]
["Byron Froese","Tor - C",56,684,5]
["Rocco Grimaldi","Col - C",20,705,5]
["Patrick Brown","Car - C",7,708,2]
["Kevin Porter","Pit - C",41,709,3]
["Cody Bass","Nsh - C,RW",17,710,0]
["Seth Griffith","Bos - C,RW",4,714,1]
["Derek Ryan","Car - C",6,716,2]
["Hunter Shinkaruk","Cgy - C",8,717,3]
["Stefan Matteau","Mon - C",32,726,2]
["Tyler Gaudet","Ari - C",14,734,3]
["Jordan Weal","Phi - C",14,735,0]
["Zac Dalpe","Min - C,RW",2,737,1]
["Christian Dvorak","Ari - C,LW","-",747,0]
["Ivan Barbashev","StL - C,LW","-",748,0]
["Tyler Graovac","Min - C",2,750,0]
["Dominic Moore","Bos - C",80,"-",15]
["Mitchell Marner","Tor - C ","-",1102,0]

{"sheet":"Left Wing","index":4,"n_rows":150,"n_cols":5,"rows_kept":150}
["Player","Team","GP","O-Rank","Points"]
["Alex Ovechkin","Was - LW",79,2,71]
["Taylor Hall","NJ - LW",82,48,65]
["Gabriel Landeskog","Col - LW",75,68,53]
["Daniel Sedin","Van - LW",82,69,61]
["Alexander Steen","StL - LW",67,74,52]
["Jonathan Huberdeau","Fla - LW",76,80,59]
["Brayden Schenn","Phi - C,LW",80,81,59]
["Patrick Sharp","Dal - LW,RW",76,84,55]
["Jakub Voracek","Phi - LW,RW",73,97,55]
["Rick Nash","NYR - LW",60,101,36]
["Boone Jenner","Cls - C,LW",82,102,49]
["James van Riemsdyk","Tor - LW",40,109,29]
["Jeff Skinner","Car - LW",82,115,51]
["Henrik Zetterberg","Det - C,LW",82,134,50]
["Patrick Marleau","SJ - C,LW",82,144,48]
["Michael Cammalleri","NJ - LW",42,148,38]
["Chris Kunitz","Pit - LW",80,155,40]
["Robby Fabbri","StL - C,LW",72,156,37]
["Andre Burakovsky","Was - LW",79,162,38]
["Anthony Duclair","Ari - LW,RW",81,174,44]
["Gustav Nyquist","Det - LW,RW",82,175,43]
["Scott Hartnell","Cls - LW",79,176,49]
["Mikkel Boedker","SJ - LW",80,178,51]
["Teuvo Teravainen","Car - LW,RW",78,183,35]
["Carl Hagelin","Pit - LW",80,207,39]
["Matt Moulson","Buf - LW",81,212,21]
["Alex Tanguay","Ari - LW,RW",70,226,35]
["Evander Kane","Buf - LW",65,233,35]
["Antoine Roussel","Dal - LW",80,239,29]
["Anders Lee","NYI - LW",80,251,36]
["Tyler Ennis","Buf - C,LW",23,252,11]
["Kyle Connor","Wpg - LW","-",253,0]
["Benoit Pouliot","Edm - LW",55,256,36]
["Justin Abdelkader","Det - LW,RW",82,258,42]
["Matt Martin","Tor - LW",80,267,19]
["David Perron","StL - LW,RW",71,275,36]
["Thomas Vanek","Det - LW,RW",74,277,41]
["Jordan Staal","Car - C,LW",82,278,48]
["Clarke MacArthur","Ott - LW",4,282,0]
["Teddy Purcell","LA - LW",76,286,43]
["Marcus Johansson","Was - LW,RW",74,290,46]
["Milan Michalek","Tor - LW,RW",45,297,16]
["Kris Versteeg","LA - LW,RW",77,302,38]
["Valtteri Filppula","TB - C,LW",76,303,31]
["J.T. Miller","NYR - C,LW",82,304,43]
["Joffrey Lupul","Tor - LW,RW",46,309,14]
["Lee Stempniak","Car - LW,RW",82,314,51]
["Patrick Maroon","Edm - LW",72,316,27]
["Mathieu Perreault","Wpg - C,LW",71,322,41]
["Matt Beleskey","Bos - LW",80,323,37]
["Dustin Brown","LA - LW,RW",82,325,28]
["Steve Downie","Ari - LW,RW",26,328,6]
["Michael Raffl","Phi - LW",82,330,31]
["Brock Nelson","NYI - LW",81,336,40]
["Bryan Bickell","Car - LW",25,348,2]
["Andrew Cogliano","Anh - LW",82,357,32]
["Pavel Datsyuk","Ari - C,LW",66,359,49]
["Blake Comeau","Col - LW",81,372,36]
["Brad Richards","Det - C,LW",68,373,28]
["Jason Chimera","NYI - LW",82,375,40]
["Cody McLeod","Col - LW",82,382,13]
["Tanner Pearson","LA - LW",79,387,36]
["Jamie McGinn","Ari - LW",84,388,39]
["Erik Haula","Min - C,LW",76,397,34]
["Alexandre Burrows","Van - LW,RW",79,403,22]
["Marcus Foligno","Buf - LW",75,405,23]
["Matt Calvert","Cls - LW",73,421,24]
["Colin Wilson","Nsh - LW",64,426,24]
["Vernon Fiddler","NJ - C,LW",82,427,22]
["Daniel Winnik","Was - C,LW",76,429,19]
["Nikolay Kulemin","NYI - LW,RW",81,430,22]
["Jason Zucker","Min - LW",71,431,23]
["Tomas Fleischmann","Chi - LW",76,434,25]
["Matt Hendricks","Edm - LW",68,447,12]
["Chris Thorburn","Wpg - LW,RW",82,452,12]
["Zemgus Girgensons","Buf - C,LW",71,469,18]
["Viktor Stalberg","Car - LW",75,470,20]
["Vincent Lecavalier","LA - C,LW",49,472,18]
["Melker Karlsson","SJ - C,LW",65,476,19]
["Adam Lowry","Wpg - C,LW",74,480,17]
["Kyle Clifford","LA - LW",56,483,9]
["Johan Larsson","Buf - LW",74,488,17]
["Sven Baertschi","Van - LW",69,497,28]
["Brandon Bollig","Cgy - LW",54,504,4]
["Micheal Ferland","Cgy - LW",71,510,18]
["Andy Andreoff","LA - LW",60,514,10]
["Viktor Arvidsson","Nsh - LW",56,515,16]
["Shawn Thornton","Fla - LW,RW",50,523,5]
["Tanner Glass","NYR - LW",57,528,7]
["Joakim Nordstrom","Car - LW",71,530,24]
["Matt Nieto","SJ - LW",67,531,17]
["Pierre-Edouard Bellemare","Phi - LW",74,533,14]
["Jordan Martinook","Ari - LW",81,534,24]
["Andrew Desjardins","Chi - LW",77,535,13]
["Alexander Burmistrov","Wpg - C,LW",81,541,21]
["Nicolas Deslauriers","Buf - LW",70,543,12]
["Nick Spaling","SJ - C,LW",58,549,13]
["Teemu Pulkkinen","Det - LW,RW",36,551,12]
["Lance Bouma","Cgy - C,LW",44,552,7]
["Shane Prince","NYI - LW",62,555,17]
["Dwight King","LA - LW",47,565,13]
["Beau Bennett","NJ - LW,RW",33,581,12]
["Phillip Di Giuseppe","Car - LW,RW",41,582,17]
["Patrik Elias","NJ - C,LW",16,583,8]
["Nathan Gerbe","NYR - LW",47,587,7]
["Jordan Nolan","LA - C,LW",52,590,5]
["Andreas Martinsen","Col - LW",55,593,11]
["Joseph Blandisi","NJ - LW",41,595,17]
["Emerson Etem","Van - LW,RW",58,598,15]
["Reid Boucher","NJ - LW",39,599,19]
["Paul Byron","Mon - LW",62,605,18]
["Richard Panik","Chi - LW",30,609,8]
["Marko Dano","Wpg - C,LW",34,610,10]
["Jiri Tlusty","NJ - LW",30,620,4]
["Austin Watson","Nsh - LW",57,624,10]
["Mason Raymond","Anh - LW",29,631,5]
["Nick Ritchie","Anh - LW",33,634,4]
["Steve Ott","Det - C,LW",21,636,2]
["Chris Higgins","Cgy - LW",33,643,4]
["Phillip Danault","Mon - LW",51,645,10]
["Alexander Semin","Mon - LW,RW",15,648,4]
["Magnus Paajarvi","StL - LW",48,654,9]
["Conor Sheary","Pit - LW",44,655,10]
["Curtis Glencross","Col - LW","-",660,0]
["Daniel Carr","Mon - LW",23,661,9]
["Ryan Dzingel","Ott - LW",30,662,9]
["Scott Wilson","Pit - C,LW",24,670,6]
["Nic Petan","Wpg - C,LW",26,672,6]
["Johan Franzen","Det - LW,RW",2,674,1]
["Josh Leivo","Tor - LW",12,681,5]
["Drew Miller","Det - LW",28,685,2]
["Luke Gazdic","NJ - LW",29,687,1]
["Brandon Mashinter","Chi - LW",41,688,5]
["Matt Puempel","Ott - LW",26,692,3]
["Garrett Wilson","Pit - LW",29,696,0]
["Nick Paul","Ott - LW",24,702,5]
["Curtis McKenzie","Dal - LW",3,722,0]
["Nikolay Goldobin","SJ - LW",9,724,2]
["Michael Bournival","TB - LW","-",727,0]
["Sonny Milano","Cls - LW",3,736,1]
["Brock McGinn","Car - LW",21,738,4]
["Nicklas Jensen","NYR - LW,RW","-",743,0]
["Matthew Tkachuk","Cgy - LW","-",744,0]
["Lawson Crouse","Ari - LW","-",745,0]
["Christian Dvorak","Ari - C,LW","-",747,0]
["Ivan Barbashev","StL - C,LW","-",748,0]
["Pontus Aberg","Nsh - LW","-",749,0]
["Jimmy Vesey","NYR - LW","-","-",0]
["Matthew Tkachuk","Cgy - LW ","-","-",0]

{"sheet":"Right Wing","index":5,"n_rows":138,"n_cols":5,"rows_kept":138}
["Player","Team","GP","O-Rank","Points"]
["Patrick Kane","Chi - RW",82,1,106]
["Joe Pavelski","SJ - C,RW",82,9,78]
["Corey Perry","Anh - RW",82,16,62]
["Patrick Sharp","Dal - LW,RW",76,84,55]
["Tyler Toffoli","LA - C,RW",82,95,58]
["Jakub Voracek","Phi - LW,RW",73,97,55]
["Kyle Okposo","Buf - RW",79,98,64]
["T.J. Oshie","Was - RW",80,99,51]
["Kyle Palmieri","NJ - RW",82,108,57]
["Alexander Radulov","Mon - RW","-",119,0]
["Justin Williams","Was - RW",82,131,52]
["Marian Hossa","Chi - RW",64,133,33]
["Cam Atkinson","Cls - RW",81,140,53]
["Patrik Laine","Wpg - RW","-",145,0]
["Brendan Gallagher","Mon - RW",53,147,40]
["Joonas Donskoi","SJ - RW",76,149,36]
["Mats Zuccarello","NYR - RW",81,152,61]
["Jakob Silfverberg","Anh - RW",82,165,39]
["Jarome Iginla","Col - RW",82,173,47]
["Anthony Duclair","Ari - LW,RW",81,174,44]
["Gustav Nyquist","Det - LW,RW",82,175,43]
["Jesse Puljujarvi","Edm - RW","-",179,0]
["Mika Zibanejad","NYR - C,RW",81,180,51]
["Sam Reinhart","Buf - C,RW",79,182,42]
["Teuvo Teravainen","Car - LW,RW",78,183,35]
["Reilly Smith","Fla - RW",82,194,50]
["David Backes","Bos - RW",79,208,45]
["Marian Gaborik","LA - RW",54,209,22]
["Craig Smith","Nsh - RW",82,211,37]
["Ales Hemsky","Dal - RW",75,218,39]
["Shane Doan","Ari - RW",72,223,47]
["Drew Stafford","Wpg - RW",78,224,38]
["Alex Tanguay","Ari - LW,RW",70,226,35]
["Kevin Hayes","NYR - RW",79,228,36]
["Pierre-Alexandr Parenteau","NYI - RW",77,237,41]
["Jason Pominville","Min - RW",75,248,36]
["Nail Yakupov","Edm - RW",60,255,23]
["Justin Abdelkader","Det - LW,RW",82,258,42]
["Ryan Callahan","TB - RW",73,260,28]
["Leo Komarov","Tor - C,RW",67,264,36]
["David Perron","StL - LW,RW",71,275,36]
["Thomas Vanek","Det - LW,RW",74,277,41]
["Charlie Coyle","Min - C,RW",82,279,42]
["Tommy Wingels","SJ - C,RW",68,287,18]
["Troy Brouwer","Cgy - RW",82,288,39]
["Marcus Johansson","Was - LW,RW",74,290,46]
["Radim Vrbata","Ari - RW",63,293,27]
["Milan Michalek","Tor - LW,RW",45,297,16]
["Elias Lindholm","Car - C,RW",82,298,39]
["Kris Versteeg","LA - LW,RW",77,302,38]
["Brian Gionta","Buf - RW",79,308,33]
["Joffrey Lupul","Tor - LW,RW",46,309,14]
["Lee Stempniak","Car - LW,RW",82,314,51]
["Valeri Nichushkin","Dal - RW",79,315,29]
["Josh Bailey","NYI - RW",81,321,32]
["Dustin Brown","LA - LW,RW",82,325,28]
["Derek Dorsett","Van - RW",71,327,16]
["Steve Downie","Ari - LW,RW",26,328,6]
["Chris Neil","Ott - RW",80,332,13]
["Jannik Hansen","Van - RW",67,334,38]
["Nino Niederreiter","Min - RW",82,335,43]
["Jimmy Hayes","Bos - RW",75,337,29]
["Michael Grabner","NYR - RW",80,354,18]
["Michael Frolik","Cgy - C,RW",64,358,32]
["Tom Wilson","Was - RW",82,361,23]
["Ryan Strome","NYI - RW",71,390,28]
["Dale Weise","Phi - RW",71,393,27]
["Chris Stewart","Min - RW",56,395,20]
["J.T. Brown","TB - RW",78,396,22]
["Brad Richardson","Ari - RW",82,402,31]
["Alexandre Burrows","Van - LW,RW",79,403,22]
["Tobias Rieder","Ari - RW",82,411,37]
["Matt Read","Phi - RW",79,413,26]
["Colton Sceviour","Fla - C,RW",71,423,23]
["Nikolay Kulemin","NYI - LW,RW",81,430,22]
["Brett Connolly","Was - RW",71,438,25]
["Brad Boyes","Tor - C,RW",60,439,24]
["Mikhail Grabovski","NYI - C,RW",58,440,25]
["Alex Chiasson","Cgy - RW",77,441,14]
["Sam Gagner","Cls - C,RW",53,444,16]
["Cal Clutterbuck","NYI - RW",77,448,23]
["Patrick Eaves","Dal - RW",54,451,17]
["Chris Thorburn","Wpg - LW,RW",82,452,12]
["Devante Smith-Pelly","NJ - RW",64,454,25]
["Jesper Fast","NYR - RW",79,455,30]
["Scottie Upshall","StL - RW",70,458,14]
["Zack Kassian","Edm - RW",36,460,8]
["Jordin Tootoo","Chi - RW",66,467,9]
["Torrey Mitchell","Mon - C,RW",71,475,19]
["Dmitrij Jaskin","StL - RW",65,493,13]
["Eric Fehr","Pit - C,RW",55,494,14]
["Justin Fontaine","Min - RW",60,507,16]
["Curtis Lazar","Ott - RW",76,509,20]
["Jay Beagle","Was - RW",57,511,17]
["Shawn Thornton","Fla - LW,RW",50,523,5]
["Erik Condra","TB - RW",54,529,11]
["Ryan Reaves","StL - RW",64,545,4]
["Jake Virtanen","Van - RW",55,547,13]
["Teemu Pulkkinen","Det - LW,RW",36,551,12]
["Sven Andrighetto","Mon - RW",44,574,17]
["Beau Bennett","NJ - LW,RW",33,581,12]
["Phillip Di Giuseppe","Car - LW,RW",41,582,17]
["Tom Kuhnhackl","Pit - RW",42,585,15]
["Steve Bernier","NYI - RW",24,592,6]
["Anthony Peluso","Wpg - RW",35,594,5]
["Emerson Etem","Van - LW,RW",58,598,15]
["Jared Boll","Anh - RW",30,604,3]
["Bryan Rust","Pit - RW",41,611,11]
["Linden Vey","Cgy - RW",41,613,15]
["Miikka Salomaki","Nsh - RW",61,614,10]
["Adam Cracknell","Dal - RW",52,622,10]
["Iiro Pakarinen","Edm - RW",63,626,13]
["Tomas Jurco","Det - RW",44,630,6]
["Joel Armia","Wpg - RW",43,637,10]
["Tyler Randell","Bos - RW",27,640,6]
["David Clarkson","Cls - RW",23,646,4]
["Alexander Semin","Mon - LW,RW",15,648,4]
["Mike Blunden","Ott - RW",20,652,5]
["Logan Shaw","Fla - RW",53,658,7]
["Barclay Goodrow","SJ - C,RW",14,664,3]
["Johan Franzen","Det - LW,RW",2,674,1]
["Stanislav Galiev","Was - RW",24,691,3]
["Michael Ryder","NJ - RW","-",694,0]
["Nikita Soshnikov","Tor - RW",11,695,5]
["Brett Ritchie","Dal - RW",8,699,1]
["Cody Bass","Nsh - C,RW",17,710,0]
["Josh Anderson","Cls - RW",12,711,4]
["Hudson Fasching","Buf - RW",7,712,2]
["Seth Griffith","Bos - C,RW",4,714,1]
["Tomas Kopecky","Chi - RW","-",720,0]
["Kurtis Gabriel","Min - RW",3,723,0]
["Zac Dalpe","Min - C,RW",2,737,1]
["Ryan Hartman","Chi - RW",3,739,1]
["Nicklas Jensen","NYR - LW,RW","-",743,0]
["Ryane Clowe","NJ - LW,RW",null,637,4]
["Micheal Ferland ","Cgy - LW,RW",18,644,5]
["Sebastian Aho","Car - RW","-",1470,0]

{"sheet":"Defence","index":6,"n_rows":211,"n_cols":5,"rows_kept":211}
["Player","Team","GP","O-Rank","Points"]
["Erik Karlsson","Ott - D",82,18,82]
["P.K. Subban","Nsh - D",68,22,51]
["Kris Letang","Pit - D",71,41,67]
["Oliver Ekman-Larsson","Ari - D",75,45,55]
["John Klingberg","Dal - D",76,60,58]
["Tyson Barrie","Col - D",78,92,49]
["Kevin Shattenkirk","StL - D",72,100,44]
["Jake Muzzin","LA - D",82,106,40]
["Brent Seabrook","Chi - D",81,120,49]
["Alec Martinez","LA - D",78,150,31]
["Ryan McDonagh","NYR - D",73,153,34]
["Colton Parayko","StL - D",79,160,33]
["Matt Dumba","Min - D",81,171,26]
["Anton Stralman","TB - D",73,172,34]
["Michael Stone","Ari - D",75,181,36]
["Matt Niskanen","Was - D",82,184,32]
["Cam Fowler","Anh - D",69,187,28]
["Olli Maatta","Pit - D",67,189,19]
["T.J. Brodie","Cgy - D",70,190,45]
["Niklas Kronwall","Det - D",64,197,26]
["Ryan Pulock","NYI - D",15,198,4]
["Johnny Boychuk","NYI - D",70,199,25]
["Kris Russell","Dal - D",62,201,19]
["Zdeno Chara","Bos - D",80,205,37]
["Mattias Ekholm","Nsh - D",82,215,35]
["Zach Bogosian","Buf - D",64,216,24]
["Mike Green","Det - D",74,220,35]
["Andrei Markov","Mon - D",82,221,44]
["Jake Gardiner","Tor - D",79,227,31]
["Dennis Wideman","Cgy - D",51,229,19]
["Trevor Daley","Pit - D",82,230,28]
["Brian Campbell","Chi - D",82,232,31]
["Alex Goligoski","Ari - D",82,235,37]
["Noah Hanifin","Car - D",79,236,22]
["Mark Streit","Phi - D",62,238,23]
["Oscar Klefbom","Edm - D",30,243,12]
["Danny DeKeyser","Det - D",78,250,20]
["Cody Ceci","Ott - D",75,254,26]
["Jared Spurgeon","Min - D",77,257,29]
["Cody Franson","Buf - D",59,261,17]
["Jason Garrison","TB - D",72,266,11]
["Christian Ehrhoff","Chi - D",48,268,12]
["Jack Johnson","Cls - D",60,270,14]
["Erik Johnson","Col - D",73,271,27]
["Jason Demers","Fla - D",62,272,23]
["Jacob Trouba","Wpg - D",81,280,21]
["Jay Bouwmeester","StL - D",72,283,19]
["Tyler Myers","Wpg - D",73,289,27]
["Justin Schultz","Pit - D",63,291,18]
["Ryan Ellis","Nsh - D",79,292,32]
["Dan Girardi","NYR - D",74,301,17]
["Alexander Edler","Van - D",52,305,20]
["Andy Greene","NJ - D",82,306,13]
["Marek Zidlicky","NYI - D",53,310,16]
["Andrej Sekera","Edm - D",81,312,30]
["Brenden Dillon","SJ - D",76,319,11]
["Marc Staal","NYR - D",77,329,15]
["Toby Enstrom","Wpg - D",72,341,16]
["Michael Del Zotto","Phi - D",52,342,13]
["David Schlemko","SJ - D",67,343,19]
["Dan Hamhuis","Dal - D",58,344,13]
["Derrick Pouliot","Pit - D",22,346,7]
["Jakub Kindl","Fla - D",44,349,8]
["James Wisniewski","Car - D",1,350,0]
["Kevin Klein","NYR - D",69,352,26]
["Francois Beauchemin","Col - D",82,384,34]
["Brayden McNabb","LA - D",81,394,14]
["Kevin Bieksa","Anh - D",71,399,15]
["David Savard","Cls - D",65,400,25]
["Radko Gudas","Phi - D",76,401,14]
["Dan Boyle","NYR - D",74,404,24]
["Kevin Connauton","Ari - D",65,406,17]
["Adam Larsson","Edm - D",82,407,18]
["Travis Hamonic","NYI - D",72,408,21]
["Justin Braun","SJ - D",80,409,23]
["Dmitry Kulikov","Buf - D",74,410,17]
["Niklas Hjalmarsson","Chi - D",81,416,24]
["Marco Scandella","Min - D",73,417,21]
["Alex Petrovic","Fla - D",66,424,17]
["Josh Manson","Anh - D",71,433,15]
["Kevan Miller","Bos - D",71,435,18]
["Karl Alzner","Was - D",82,443,21]
["Roman Polak","Tor - D",79,445,16]
["Brendan Smith","Det - D",63,446,15]
["Luke Schenn","Ari - D",72,449,16]
["Ryan Murray","Cls - D",82,453,25]
["Connor Murphy","Ari - D",78,456,17]
["Dmitry Orlov","Was - D",82,457,29]
["Adam McQuaid","Bos - D",64,459,9]
["Braydon Coburn","TB - D",80,463,10]
["Paul Martin","SJ - D",78,464,20]
["Dalton Prout","Cls - D",64,465,9]
["Nathan Beaulieu","Mon - D",64,468,19]
["Jonathan Ericsson","Det - D",71,471,15]
["Ian Cole","Pit - D",70,473,12]
["Damon Severson","NJ - D",72,474,21]
["Nick Holden","NYR - D",82,477,22]
["Marc Methot","Ott - D",69,479,12]
["Mark Borowiecki","Ott - D",63,482,2]
["Johnny Oduya","Dal - D",82,484,21]
["Deryk Engelland","Cgy - D",69,485,12]
["John Moore","NJ - D",73,486,19]
["Erik Gudbranson","Van - D",64,487,9]
["Alexei Emelin","Mon - D",72,489,12]
["Calvin de Haan","NYI - D",72,490,16]
["John-Michael Liles Bos - D","Bos - D",81,491,21]
["Thomas Hickey","NYI - D",62,492,18]
["Ben Lovejoy","NJ - D",66,501,10]
["Andrej Sustr","TB - D",77,506,21]
["Jeff Petry","Mon - D",51,508,16]
["Ron Hainsey","Car - D",81,512,19]
["Nate Schmidt","Was - D",72,516,16]
["Clayton Stoner","Anh - D",50,517,6]
["Jake McCabe","Buf - D",77,519,14]
["Brian Dumoulin","Pit - D",79,520,16]
["Joel Edmundson","StL - D",67,521,9]
["Nick Schultz","Phi - D",81,522,10]
["Colin Miller","Bos - D",42,524,16]
["Chris Wideman","Ott - D",64,525,13]
["Brandon Manning","Phi - D",56,526,7]
["Brooks Orpik","Was - D",41,527,10]
["Michal Rozsival","Chi - D",51,536,13]
["Darnell Nurse","Edm - D",69,537,10]
["Carl Gunnarsson","StL - D",72,538,9]
["Jaccob Slavin","Car - D",63,540,20]
["Matthew Carle","Nsh - D",64,542,9]
["Jordie Benn","Dal - D",64,550,12]
["Robert Bortuzzo","StL - D",40,553,3]
["Nikita Nesterov","TB - D",57,554,9]
["Josh Gorges","Buf - D",77,558,12]
["Ben Hutton","Van - D",75,559,25]
["Trevor van Riemsdyk","Chi - D",82,560,14]
["Mark Stuart","Wpg - D",64,562,3]
["Patrick Wiercioch","Col - D",52,566,5]
["Dylan McIlrath","NYR - D",34,569,4]
["Brett Pesce","Car - D",69,570,16]
["Ben Chiarot","Wpg - D",70,571,10]
["Eric Gelinas","Col - D",40,572,6]
["Brandon Davidson","Edm - D",51,573,11]
["Zbynek Michalek","Ari - D",70,578,7]
["Yannick Weber","Nsh - D",45,579,7]
["Christopher Tanev","Van - D",69,580,18]
["Erik Gustafsson","Chi - D",41,584,14]
["Matt Hunwick","Tor - D",60,586,10]
["Luca Sbisa","Van - D",41,589,8]
["Simon Despres","Anh - D",32,591,4]
["Jonas Brodin","Min - D",68,596,7]
["Andrew MacDonald","Phi - D",28,597,8]
["Rob Scuderi","LA - D",63,600,10]
["Mark Pysyk","Fla - D",55,602,11]
["Jyrki Jokipakka","Cgy - D",58,603,12]
["Brian Strait","Wpg - D",52,608,6]
["Jamie McBain","Ari - D",44,612,9]
["Steven Kampfer","Fla - D",47,615,4]
["Adam Clendening","NYR - D",29,618,7]
["Martin Marincin","Tor - D",65,619,7]
["Ryan Murphy","Car - D",35,623,10]
["Nate Prosser","Min - D",54,625,3]
["Cody Goloubef","Cls - D",43,627,8]
["Klas Dahlbeck","Ari - D",71,629,8]
["Tom Gilbert","LA - D",45,635,2]
["Taylor Chorney","Was - D",55,641,6]
["Greg Pateryn","Mon - D",38,644,7]
["Fedor Tyutin","Col - D",61,647,3]
["Mark Barberio","Mon - D",30,650,10]
["Mark Fayne","Edm - D",69,651,7]
["Dylan DeMelo","SJ - D",45,653,4]
["Patrik Nemeth","Dal - D",38,656,8]
["Alexey Marchenko","Det - D",66,666,11]
["David Rundblad","Chi - D",9,668,2]
["Alex Biega","Van - D",51,671,7]
["Anthony Bitetto","Nsh - D",28,673,6]
["Jon Merrill","NJ - D",47,675,5]
["Matt Tennyson","Car - D",29,676,4]
["Christian Folin","Min - D",26,677,4]
["Joe Morrow","Bos - D",33,678,7]
["Justin Falk","Buf - D",24,679,4]
["Nikita Zadorov","Col - D",22,680,2]
["Frank Corrado","Tor - D",39,682,6]
["Mike Reilly","Min - D",29,683,7]
["Matt Greene","LA - D",3,686,0]
["Korbinian Holzer","Anh - D",29,689,3]
["Jamie Oleksiak","Dal - D",19,690,2]
["Nate Guenin","Anh - D",29,693,0]
["Chris Bigras","Col - D",31,697,3]
["Paul Postma","Wpg - D",26,698,2]
["Connor Carrick","Tor - D",19,700,4]
["Petter Granberg","Nsh - D",27,701,2]
["Derek Forbort","LA - D",14,703,2]
["Michael Kostka","Ott - D",15,704,1]
["Viktor Svedberg","Chi - D",27,706,4]
["Matt Irwin","Nsh - D",2,707,0]
["David Warsofsky","Pit - D",22,713,2]
["Brandon Gormley","NJ - D",26,715,1]
["Andrew Ference","Edm - D",6,718,0]
["Brad Stuart","Col - D",6,719,0]
["Petteri Lindbohm","StL - D",10,721,0]
["Jarred Tinordi","Ari - D",10,725,0]
["Slater Koekkoek","TB - D",9,728,1]
["Luke Witkowski","TB - D",4,729,0]
["Stephen Johns","Dal - D",14,730,3]
["Scott Mayfield","NYI - D",6,731,1]
["Steven Santini","NJ - D",1,732,0]
["Mirco Mueller","SJ - D",11,733,0]
["T.J. Brennan","Phi - D",7,740,1]
["Chris Summers","NYR - D",3,741,0]
["Jeff Schultz","Anh - D",1,742,0]
["Anthony DeAngelo","Ari - D","-",746,0]
["Ladislav Smid","Cgy - D",22,751,0]
["Nikita Zaitsev","Tor - D ","-","-",0]

{"sheet":"Goalies","index":7,"n_rows":69,"n_cols":7,"rows_kept":69}
["Player","Team","GP","O-Rank","Wins","Shutouts","Points"]
["Braden Holtby","Was - G",66,10,48,3,99]
["Jonathan Quick","LA - G",68,19,40,5,85]
["Carey Price","Mon - G",12,20,10,2,22]
["Jake Allen","StL - G",47,42,26,6,58]
["Roberto Luongo","Fla - G",62,64,35,4,74]
["Tuukka Rask","Bos - G",64,65,31,4,66]
["Devan Dubnyk","Min - G",67,67,32,5,69]
["Brian Elliott","Cgy - G",42,71,23,4,50]
["Matt Murray","Pit - G",13,73,9,1,19]
["Petr Mrazek","Det - G",54,85,27,4,58]
["Frederik Andersen","Tor - G",43,87,22,3,47]
["Craig Anderson","Ott - G",60,88,31,4,66]
["Thomas Greiss","NYI - G",41,123,23,1,47]
["Marc-Andre Fleury","Pit - G",58,129,35,5,75]
["Robin Lehner","Buf - G",21,132,5,1,11]
["Jaroslav Halak","NYI - G",36,135,18,3,39]
["Sergei Bobrovsky","Cls - G",37,142,15,1,31]
["Semyon Varlamov","Col - G",57,146,27,2,56]
["James Reimer","Fla - G",40,151,17,3,37]
["Cam Talbot","Edm - G",56,154,21,3,45]
["Antti Niemi","Dal - G",48,158,25,3,53]
["Michal Neuvirth","Phi - G",32,166,18,3,39]
["Mike Smith","Ari - G",32,185,15,3,33]
["Steve Mason","Phi - G",54,195,23,4,50]
["Kari Lehtonen","Dal - G",43,196,25,2,52]
["Cam Ward","Car - G",52,203,23,1,47]
["Andrei Vasilevskiy","TB - G",24,204,11,1,23]
["Connor Hellebuyck","Wpg - G",26,214,13,2,28]
["Chad Johnson","Cgy - G",45,234,22,1,45]
["Jimmy Howard","Det - G",37,240,14,2,30]
["Carter Hutton","StL - G",17,242,7,2,16]
["Eddie Lack","Car - G",34,247,12,2,26]
["Jacob Markstrom","Van - G",33,259,13,0,26]
["Ondrej Pavelec","Wpg - G",33,262,13,1,27]
["Jonathan Bernier","Anh - G",38,276,12,3,27]
["Joonas Korpisalo","Cls - G",31,294,16,0,32]
["Michael Hutchinson","Wpg - G",30,296,9,0,18]
["Jeff Zatkoff","LA - G",14,299,4,0,8]
["Andrew Hammond","Ott - G",24,300,7,1,15]
["Scott Darling","Chi - G",29,307,12,1,25]
["Calvin Pickard","Col - G",20,311,7,1,15]
["Anton Khudobin","Bos - G",9,313,3,1,7]
["Al Montoya","Mon - G",25,324,12,0,24]
["Keith Kinkaid","NJ - G",23,326,9,2,20]
["Darcy Kuemper","Min - G",21,333,6,2,14]
["Antti Raanta","NYR - G",25,338,11,1,23]
["Linus Ullmark","Buf - G",20,340,8,0,16]
["Curtis McElhinney","Cls - G",18,345,2,0,4]
["Malcolm Subban","Bos - G","-",351,"-","-",0]
["Dustin Tokarski","Anh - G",6,353,1,0,2]
["Jhonas Enroth","Tor - G",16,362,7,2,16]
["Reto Berra","Fla - G",14,365,5,2,12]
["Karri Ramo","Cgy - G",37,367,17,1,35]
["Louis Domingue","Ari - G",39,368,15,2,32]
["Jonas Gustavsson","Edm - G",24,369,11,1,23]
["Philipp Grubauer","Was - G",22,370,8,0,16]
["Mike Condon","Mon - G",55,371,21,1,43]
["Jean-Francois Berube","NYI - G",7,376,3,0,6]
["Marek Mazanec","Nsh - G","-",377,"-","-",0]
["Aaron Dell","SJ - G","-",378,"-","-",0]
["Jeremy Smith","Col - G","-",379,"-","-",0]
["Garret Sparks","Tor - G",17,380,6,1,13]
["Alex Stalock","Min - G",13,381,3,0,6]
["Niklas Backstrom","Cgy - G",4,383,2,0,4]
["Jonas Hiller","Cgy - G",26,386,9,1,19]
["Anders Lindback","Ari - G",19,389,5,0,10]
["Ben Scrivens","Mon - G",15,391,5,0,10]
["Anders Nilsson","Buf - G",29,392,10,0,20]

{"sheet":"Data","index":8,"n_rows":45,"n_cols":7,"rows_kept":45}
["Owners","Position"]
["Booya's (Cathy)","goalie 1"]
["Bruins (Bruce)","goalie 2"]
["Killa Chinchillas (Colin)","defence #1"]
["Curtis Crazy Canucks (Todd)","defence #2"]
["Dominant Brandon (Brandon)","defence #3"]
["Cold Warriors (Tom)","defence #4"]
["Robs Chiefs (Rob)","left wing #1"]
["Riverdogs (Rhonda)","left wing #2"]
["Tad Nugents (Nick)","left wing #3"]
["Woap (Mike)","right wing #1"]
[null,"right wing #2"]
[null,"right wing #3"]
[null,"centre #1"]
[null,"centre #2"]
[null,"centre #3"]
[null,"utility"]
[null,"Reserve Roster #1"]
[null,"Reserve Roster #2"]
[null,"Reserve Roster #3"]
[null,"Reserve Roster #4"]
[null,"Reserve Roster #5"]
[null,"Reserve Roster #6"]
[null,"Reserve Roster #7"]
["Make sure every year to select all the players for each position and recreate the bookmark name (delete name first, then recreate name) to ensure all players get listed.",null,"goalie","defence","left wing","right wing","centre"]
["Ensure that all players are listed when clicking on the button."]
[]
["When changing the toolbar, customize/hockey/attach/delete previous hockey/reattach new hockey toolbar."]
["Draft Order"]
["Robs Chiefs (Rob)",1]
["Riverdogs (Rhonda)",2]
["Curtis Crazy Canucks (Todd)",3]
["Tad Nugents (Nick)",4]
["Killa Chinchillas (Colin)",5]
["Woap (Mike)",6]
["Booya's (Cathy)",7]
["Bruins (Bruce)",8]
["Cold Warriors (Tom)",9]
["Dominant Brandon (Brandon)",10]
[]
[]
["Formulas to Retreive Name and Position"]
["=RIGHT(A1,LEN(A1)+ 5-FIND(\"-\",A1))","Position"]
["=LEFT(A1,FIND(\"-\",A1) -5)","Name"]
["=Trim(cell)","Trim the positions for extra space"]