{"text_format":"3","workbook":"xlsx","n_sheets":13,"sheets":["2023 Pre-Draft Rosters","Draft List","Summary","Catchers","1st Base","2nd Base","3rd Base","Short Stop","Outfield","DH","Pitchers","Relief Pitchers","Data"],"not_rendered":{"macros":1,"defined_names":46},"read":"whole","date_system":"1900"}

{"sheet":"2023 Pre-Draft Rosters","index":0,"n_rows":35,"n_cols":45,"rows_kept":35,"merged":[[0,1,0,4],[0,5,0,8],[0,9,0,12],[0,13,0,16],[0,17,0,20],[0,21,0,24],[0,25,0,28],[0,29,0,32],[0,33,0,36],[0,37,0,40],[1,1,1,4],[1,5,1,8],[1,9,1,12],[1,13,1,16],[1,17,1,20],[1,21,1,24],[1,25,1,28],[1,29,1,32],[1,33,1,36],[1,37,1,39],[1,41,1,43],[23,1,23,2],[23,5,23,6],[23,9,23,10],[23,13,23,14],[23,17,23,18],[23,21,23,22],[23,25,23,26],[23,29,23,30],[23,33,23,34],[23,37,23,38],[23,41,23,42],[24,1,24,2],[24,5,24,6],[24,9,24,10],[24,13,24,14],[24,17,24,18],[24,21,24,22],[24,25,24,26],[24,29,24,30],[24,33,24,34],[24,37,24,38],[24,41,24,42],[25,1,25,2],[25,5,25,6],[25,9,25,10],[25,13,25,14],[25,17,25,18],[25,21,25,22],[26,1,26,2],[26,5,26,6],[26,9,26,10],[26,13,26,14],[26,17,26,18],[26,21,26,22],[26,26,26,27],[26,30,26,31],[26,34,26,35],[26,38,26,39],[26,42,26,43]]}
[null,"Bold",{"$nulls":3},"Honorary Usos",{"$nulls":3},"Jericho Appreciation Society",{"$nulls":3},"A's Choice Team",{"$nulls":3},"Woap",{"$nulls":3},"Guzzlers",{"$nulls":3},"Lugnuts",{"$nulls":3},"The Elite"]
[null,{"$f":"Data!A2","v":"Brandon"},{"$nulls":3},{"$f":"Data!A3","v":"Brett/Kyle"},{"$nulls":3},{"$f":"Data!A4","v":"Bruce"},{"$nulls":3},{"$f":"Data!A5","v":"Cathy"},{"$nulls":3},{"$f":"Data!A6","v":"Mike"},{"$nulls":3},{"$f":"Data!A7","v":"Rhonda"},{"$nulls":3},{"$f":"Data!A8","v":"Rob"},{"$nulls":3},{"$f":"Data!A9","v":"Todd"},{"$nulls":3},{"$f":"Data!A10","v":"N/A #1"},{"$nulls":3},{"$f":"Data!A11","v":"N/A #2"},{"$nulls":3},"N/A"]
[null,"Pos.","Player","$","years","Pos.","Player","$","years","Pos.","Player","$","years","Pos.","Player","$","years","Pos.","Player","$","years","Pos.","Player","$","years","Pos.","Player","$","years","Pos.","Player","$","years","Pos.","Player","$","years","Pos.","Player","$","years","Pos.","Player","$","years"]
[{"$f":"10-COUNT(D4,H4,L4,P4,T4,X4,AB4,AF4,AJ4,AN4,AR4)-2","v":0},"C","Danny Jansen\nTOR - C",1,null,"C","Alejandro Kirk\nTOR - C",12,null,"C","MJ Melendez\nKC - C,OF",22,null,"C","Adley Rutschman\nBAL - C",27,null,"C","Logan O'Hoppe\nLAA - C",1,null,"C","Cal Raleigh\nSEA - C",11,null,"C","Yasmani Grandal\nCWS - C",1,null,"C","Salvador Perez\nKC - C",22,null,"C",{"$nulls":3},"C",{"$nulls":3},"C"]
[{"$f":"10-COUNT(D5,H5,L5,P5,T5,X5,AB5,AF5,AJ5,AN5,AR5)-2","v":0},"1B","Ryan Mountcastle\nBAL - 1B",16,null,"1B","Yandy Díaz\nTB - 1B,3B",1,null,"1B","Triston Casas\nBOS - 1B",7,null,"1B","José Abreu\nHOU - 1B",36,null,"1B","Ty France\nSEA - 1B,3B",1,null,"1B","Vladimir Guerrero Jr.\nTOR - 1B",47,null,"1B","Nathaniel Lowe\nTEX - 1B",7,null,"1B","Vinnie Pasquantino\nKC - 1B",15,null,"1B",{"$nulls":3},"1B",{"$nulls":3},"1B"]
[{"$f":"10-COUNT(D6,H6,L6,P6,T6,X6,AB6,AF6,AJ6,AN6,AR6)-2","v":0},"2B","Andrés Giménez\nCLE - 2B,SS",11,null,"2B","Jose Altuve\nHOU - 2B",33,null,"2B","Brandon Lowe\nTB - 2B",7,null,"2B","Marcus Semien\nTEX - 2B,SS",40,null,"2B","Kolten Wong\nSEA - 2B",1,null,"2B","Jorge Polanco\nMIN - 2B",4,null,"2B","Brandon Drury\nLAA - 1B,2B,3B",10,null,"2B","Gleyber Torres\nNYY - 2B",12,null,"2B",{"$nulls":3},"2B",{"$nulls":3},"2B"]
[{"$f":"10-COUNT(D7,H7,L7,P7,T7,X7,AB7,AF7,AJ7,AN7,AR7)-2","v":0},"3B","Alex Bregman\nHOU - 3B",16,null,"3B","Josh Jung\nTEX - 3B",11,null,"3B","Gunnar Henderson\nBAL - 3B,SS",10,null,"3B","Jose Miranda\nMIN - 1B,3B",8,null,"3B","Eugenio Suárez\nSEA - 3B",10,null,"3B","Matt Chapman\nTOR - 3B",5,null,"3B","José Ramírez\nCLE - 3B",44,null,"3B","Rafael Devers\nBOS - 3B",32,null,"3B",{"$nulls":3},"3B",{"$nulls":3},"3B"]
[{"$f":"10-COUNT(D8,H8,L8,P8,T8,X8,AB8,AF8,AJ8,AN8,AR8)-2","v":0},"SS","Corey Seager\nTEX - SS",13,null,"SS","Bo Bichette\nTOR - SS",39,null,"SS","Bobby Witt Jr.\nKC - 3B,SS",52,null,"SS","Wander Franco\nTB - SS",15,null,"SS","Jeremy Peña\nHOU - SS",17,null,"SS","Anthony Volpe",1,null,"SS","Javier Báez\nDET - SS",1,null,"SS","Tim Anderson\nCWS - SS",31,null,"SS",{"$nulls":3},"SS",{"$nulls":3},"SS"]
[{"$f":"10-COUNT(D9,H9,L9,P9,T9,X9,AB9,AF9,AJ9,AN9,AR9)-2","v":0},"OF#1","Giancarlo Stanton\nNYY - OF",9,null,"OF#1","Masataka Yoshida\nBOS - OF",16,null,"OF#1","Riley Greene\nDET - OF",1,null,"OF#1","Whit Merrifield\nTOR - 2B,OF",7,null,"OF#1","Esteury Ruiz\nOAK - OF",1,null,"OF#1","Oswaldo Cabrera\nNYY - OF",6,null,"OF#1","Eloy Jiménez\nCWS - OF",17,null,"OF#1","Steven Kwan\nCLE - OF",7,null,"OF#1",{"$nulls":3},"OF#1",{"$nulls":3},"OF#1"]
[{"$f":"10-COUNT(D10,H10,L10,P10,T10,X10,AB10,AF10,AJ10,AN10,AR10)-2","v":0},"OF#2","Teoscar Hernández\nSEA - OF",12,null,"OF#2","Byron Buxton\nMIN - OF",18,null,"OF#2","Cedric Mullins\nBAL - OF",40,null,"OF#2","Taylor Ward\nLAA - OF",1,null,"OF#2","Kyle Tucker\nHOU - OF",41,null,"OF#2","Randy Arozarena\nTB - OF",31,null,"OF#2","Mike Trout\nLAA - OF",36,null,"OF#2","Alex Verdugo\nBOS - OF",1,null,"OF#2",{"$nulls":3},"OF#2",{"$nulls":3},"OF#2"]
[{"$f":"10-COUNT(D11,H11,L11,P11,T11,X11,AB11,AF11,AJ11,AN11,AR11)-2","v":0},"OF#3","Yordan Alvarez\nHOU - OF",33,null,"OF#3","Adolis García\nTEX - OF",6,null,"OF#3","Luis Robert Jr.\nCWS - OF",25,null,"OF#3","George Springer\nTOR - OF",21,null,"OF#3","Julio Rodríguez\nSEA - OF",45,null,"OF#3","Daulton Varsho\nTOR - C,OF",22,null,"OF#3","Aaron Judge\nNYY - OF",50,null,"OF#3","Andrew Vaughn\nCWS - 1B,OF",15,null,"OF#3",{"$nulls":3},"OF#3",{"$nulls":3},"OF#3"]
[{"$f":"10-COUNT(D12,H12,L12,P12,T12,X12,AB12,AF12,AJ12,AN12,AR12)-2","v":0},"DH","Anthony Santander\nBAL - OF",2,null,"DH","Shohei Ohtani (Batter)\nLAA - Util",38,null,"DH","Carlos Correa\nMIN - SS",7,null,"DH","DJ LeMahieu\nNYY - 1B,2B,3B",1,null,"DH","Spencer Torkelson\nDET - 1B",1,null,"DH","Josh Bell\nCLE - 1B",6,null,"DH","Anthony Rizzo\nNYY - 1B",9,null,"DH","Amed Rosario\nCLE - SS,OF",14,null,"DH",{"$nulls":3},"DH",{"$nulls":3},"DH"]
[{"$f":"10-COUNT(D13,H13,L13,P13,T13,X13,AB13,AF13,AJ13,AN13,AR13)-2","v":0},"SP#1","Carlos Rodón\nNYY - SP",16,null,"SP#1","Jacob deGrom\nTEX - SP",25,null,"SP#1","Luis Castillo\nSEA - SP",17,null,"SP#1","Gerrit Cole\nNYY - SP",50,null,"SP#1","Dylan Cease\nCWS - SP",26,null,"SP#1","Shane McClanahan\nTB - SP",30,null,"SP#1","Luis Garcia\nHOU - SP",3,null,"SP#1","José Berríos\nTOR - SP",5,null,"SP#1",{"$nulls":3},"SP#1",{"$nulls":3},"SP#1"]
[{"$f":"10-COUNT(D14,H14,L14,P14,T14,X14,AB14,AF14,AJ14,AN14,AR14)-2","v":0},"SP#2","Robbie Ray\nSEA - SP",11,null,"SP#2","Chris Sale\nBOS - SP",6,null,"SP#2","Lucas Giolito\nCWS - SP",10,null,"SP#2","Nestor Cortes\nNYY - SP",10,null,"SP#2","Shane Bieber\nCLE - SP",31,null,"SP#2","Shohei Ohtani (Pitcher)\nLAA - SP",20,null,"SP#2","Jon Gray\nTEX - SP",1,null,"SP#2","Jeffrey Springs\nTB - SP,RP",12,null,"SP#2",{"$nulls":3},"SP#2",{"$nulls":3},"SP#2"]
[{"$f":"10-COUNT(D15,H15,L15,P15,T15,X15,AB15,AF15,AJ15,AN15,AR15)-2","v":0},"SP#3","Logan Gilbert\nSEA - SP",12,null,"SP#3","Triston McKenzie\nCLE - SP",15,null,"SP#3","Andrew Heaney\nTEX - SP",1,null,"SP#3","George Kirby\nSEA - SP",8,null,"SP#3","Alek Manoah\nTOR - SP",21,null,"SP#3","Chris Bassitt\nTOR - SP",4,null,"SP#3","Nathan Eovaldi\nTEX - SP",1,null,"SP#3","Brady Singer\nKC - SP",10,null,"SP#3",{"$nulls":3},"SP#3",{"$nulls":3},"SP#3"]
[{"$f":"10-COUNT(D16,H16,L16,P16,T16,X16,AB16,AF16,AJ16,AN16,AR16)-2","v":0},"SP#4","Lance Lynn\nCWS - SP",10,null,"SP#4","Sonny Gray\nMIN - SP",4,null,"SP#4","Frankie Montas\nNYY - SP",1,null,"SP#4","Joe Ryan\nMIN - SP",6,null,"SP#4","Kevin Gausman\nTOR - SP",27,null,"SP#4","Patrick Sandoval\nLAA - SP",6,null,"SP#4","José Urquidy\nHOU - SP",1,null,"SP#4","Drew Rasmussen\nTB - SP",5,null,"SP#4",{"$nulls":3},"SP#4",{"$nulls":3},"SP#4"]
[{"$f":"10-COUNT(D17,H17,L17,P17,T17,X17,AB17,AF17,AJ17,AN17,AR17)-2","v":0},"SP#5","Framber Valdez\nHOU - SP",45,null,"SP#5","kukuchi",4,null,"SP#5","Tyler Glasnow\nTB - SP",14,null,"SP#5","Grayson Rodriguez\nBAL - SP",11,null,"SP#5","Pablo López\nMIN - SP",9,null,"SP#5","Cal Quantrill\nCLE - SP",5,null,"SP#5","Lance McCullers Jr.\nHOU - SP",1,null,"SP#5","Luis Severino\nNYY - SP",7,null,"SP#5",{"$nulls":3},"SP#5",{"$nulls":3},"SP#5"]
[{"$f":"10-COUNT(D18,H18,L18,P18,T18,X18,AB18,AF18,AJ18,AN18,AR18)-2","v":0},"RP#1","Cristian Javier\nHOU - SP,RP",15,null,"RP#1","Erik Swanson\nTOR - RP",8,null,"RP#1","James Karinchak\nCLE - RP",5,null,"RP#1","Michael King\nNYY - RP",2,null,"RP#1","Jordan Romano\nTOR - RP",19,null,"RP#1","Clay Holmes\nNYY - RP",12,null,"RP#1","Félix Bautista\nBAL - RP",10,null,"RP#1","Emmanuel Clase\nCLE - RP",20,null,"RP#1",{"$nulls":3},"RP#1",{"$nulls":3},"RP#1"]
[{"$f":"10-COUNT(D19,H19,L19,P19,T19,X19,AB19,AF19,AJ19,AN19,AR19)-2","v":0},"RP#2","Paul Sewald\nSEA - RP",6,null,"RP#2","Ryan Pressly\nHOU - RP",11,null,"RP#2","Carlos Estévez\nLAA - RP",3,null,"RP#2","Jorge López\nMIN - RP",1,null,"RP#2","Adam Cimber\nTOR - RP",1,null,"RP#2","Liam Hendriks\nCWS - RP",5,null,"RP#2","Pete Fairbanks\nTB - RP",14,null,"RP#2","Kenley Jansen\nBOS - RP",10,null,"RP#2",{"$nulls":3},"RP#2",{"$nulls":3},"RP#2"]
[{"$f":"10-COUNT(D20,H20,L20,P20,T20,X20,AB20,AF20,AJ20,AN20,AR20)-2","v":0},"RP#3","Alex Lange\nDET - RP",5,null,"RP#3","Rafael Montero\nHOU - RP",2,null,"RP#3","Héctor Neris\nHOU - RP",6,null,"RP#3","Zach Eflin\nTB - SP,RP",3,null,"RP#3","Jimmy Herget\nLAA - RP",1,null,"RP#3","Kendall Graveman\nCWS - RP",4,null,"RP#3","Scott Barlow\nKC - RP",9,null,"RP#3","Andrés Muñoz\nSEA - RP",7,null,"RP#3",{"$nulls":3},"RP#3",{"$nulls":3},"RP#3"]
[{"$f":"10-COUNT(D21,H21,L21,P21,T21,X21,AB21,AF21,AJ21,AN21,AR21)-2","v":0},"RP#4","Hunter Brown\nHOU - RP",12,null,"RP#4","Yimi García\nTOR - RP",1,null,"RP#4","Diego Castillo\nSEA - RP",3,null,"RP#4","Garrett Whitlock\nBOS - SP,RP",1,null,"RP#4","Will Smith\nTEX - RP",1,null,"RP#4","José Leclerc\nTEX - RP",11,null,"RP#4","Jhoan Duran\nMIN - RP",12,null,"RP#4","Jason Adam\nTB - RP",12,null,"RP#4",{"$nulls":3},"RP#4",{"$nulls":3},"RP#4"]
[null,null,"Current Used Points",{"$f":"SUM(D4:D21)","v":245},null,null,"Current Used Points",{"$f":"SUM(H4:H21)","v":250},null,null,"Current Used Points",{"$f":"SUM(L4:L21)","v":231},null,null,"Current Used Points",{"$f":"SUM(P4:P21)","v":248},null,null,"Current Used Points",{"$f":"SUM(T4:T21)","v":254},null,null,"Current Used Points",{"$f":"SUM(X4:X21)","v":230},null,null,"Current Used Points",{"$f":"SUM(AB4:AB21)","v":227},null,null,"Current Used Points",{"$f":"SUM(AF4:AF21)","v":237},null,null,"Current Used Points",{"$f":"SUM(AJ4:AJ21)","v":0},null,null,"Current Used Points",{"$f":"SUM(AN4:AN21)","v":0},null,null,"Current Used Points",{"$f":"SUM(AR4:AR21)","v":0}]
[null,null,"Remaining Points",{"$f":"SUM(260-D22)","v":15},null,null,"Remaining Points",{"$f":"SUM(260-H22)","v":10},null,null,"Remaining Points",{"$f":"SUM(260-L22)","v":29},null,null,"Remaining Points",{"$f":"SUM(260-P22)","v":12},null,null,"Remaining Points",{"$f":"SUM(260-T22)","v":6},null,null,"Remaining Points",{"$f":"SUM(260-X22)","v":30},null,null,"Remaining Points",{"$f":"SUM(260-AB22)","v":33},null,null,"Remaining Points",{"$f":"SUM(260-AF22)","v":23},null,null,"Remaining Points",{"$f":"SUM(260-AJ22)","v":260},null,null,"Remaining Points",{"$f":"SUM(260-AN22)","v":260},null,null,"Remaining Points",{"$f":"SUM(260-AR22)","v":260}]
[null,"Maximum Bidding Points",null,{"$f":"(D23-(18-COUNT(D4:D21))+(IF(COUNT(D4:D21)=18,0,1)))","v":15},null,"Maximum Bidding Points",null,{"$f":"(H23-(18-COUNT(H4:H21))+(IF(COUNT(H4:H21)=18,0,1)))","v":10},null,"Maximum Bidding Points",null,{"$f":"(L23-(18-COUNT(L4:L21))+(IF(COUNT(L4:L21)=18,0,1)))","v":29},null,"Maximum Bidding Points",null,{"$f":"(P23-(18-COUNT(P4:P21))+(IF(COUNT(P4:P21)=18,0,1)))","v":12},null,"Maximum Bidding Points",null,{"$f":"(T23-(18-COUNT(T4:T21))+(IF(COUNT(T4:T21)=18,0,1)))","v":6},null,"Maximum Bidding Points",null,{"$f":"(X23-(18-COUNT(X4:X21))+(IF(COUNT(X4:X21)=18,0,1)))","v":30},null,"Maximum Bidding Points",null,{"$f":"(AB23-(18-COUNT(AB4:AB21))+(IF(COUNT(AB4:AB21)=18,0,1)))","v":33},null,"Maximum Bidding Points",null,{"$f":"(AF23-(18-COUNT(AF4:AF21))+(IF(COUNT(AF4:AF21)=18,0,1)))","v":23},null,"Maximum Bidding Points",null,{"$f":"(AJ23-(18-COUNT(AJ4:AJ21))+(IF(COUNT(AJ4:AJ21)=18,0,1)))","v":243},null,"Maximum Bidding Points",null,{"$f":"(AN23-(18-COUNT(AN4:AN21))+(IF(COUNT(AN4:AN21)=18,0,1)))","v":243},null,"Maximum Bidding Points",null,{"$f":"(AR23-(18-COUNT(AR4:AR21))+(IF(COUNT(AR4:AR21)=18,0,1)))","v":243}]
[null,"Remaining # of Players to Draft",null,{"$f":"18-COUNT(D4:D21)","v":0},null,"Remaining # of Players to Draft",null,{"$f":"18-COUNT(H4:H21)","v":0},null,"Remaining # of Players to Draft",null,{"$f":"18-COUNT(L4:L21)","v":0},null,"Remaining # of Players to Draft",null,{"$f":"18-COUNT(P4:P21)","v":0},null,"Remaining # of Players to Draft",null,{"$f":"18-COUNT(T4:T21)","v":0},null,"Remaining # of Players to Draft",null,{"$f":"18-COUNT(X4:X21)","v":0},null,"Remaining # of Players to Draft",null,{"$f":"18-COUNT(AB4:AB21)","v":0},null,"Remaining # of Players to Draft",null,{"$f":"18-COUNT(AF4:AF21)","v":0},null,"Remaining # of Players to Draft",null,{"$f":"18-COUNT(AJ4:AJ21)","v":18},null,"Remaining # of Players to Draft",null,{"$f":"18-COUNT(AN4:AN21)","v":18},null,"Remaining # of Players to Draft",null,{"$f":"18-COUNT(AR4:AR21)","v":18}]
[]
[]
[null,null,"Justin Turner\nBOS - 3B",5,null,null,"Corey Kluber\nBOS - SP",5,null,null,"Hunter Renfroe\nLAA - OF",5,null,null,"Daniel Espino\nCLE - SP",5,null,null,"Ricky Tiedemann\nTOR - SP",5,null,null,"Tyler Anderson\nLAA - SP",5,null,null,"Dylan Moore\nSEA - 2B,SS,OF",5,null,null,"Adam Frazier\nBAL - 2B,OF",5]
[null,null,"Clarke Schmidt\nNYY - SP,RP",5,null,null,"Dillon Tate",5,null,null,"Shea Langeliers\nOAK - C",5,null,null,"Reynaldo López\nCWS - RP",5,null,null,"Jarred Kelenic\nSEA - OF",5,null,null,"Luis Rengifo\nLAA - 2B,3B,SS",5,null,null,"Michael Kopech\nCWS - SP",5,null,null,"Kenta Maeda\nMIN - SP",5]
[null,null,"Harrison Bader\nNYY - OF",5,null,null,"David Hensley",5,null,null,"Kiké Hernández\nBOS - 2B,SS,OF",5,null,null,"Adam Duvall\nBOS - OF",5,null,null,"Oscar Colas\nCWS - OF",5,null,null,"Joey Gallo\nMIN - OF",5,null,null,"Christian Vázquez\nMIN - C,1B",5,null,null,"Oscar Gonzalez\nCLE - OF",5]
[null,null,"Jonah Heim\nTEX - C",5,null,null,"Kevin Kiermaier\nTOR - OF",5,null,null,"Ramón Laureano\nOAK - OF",5,null,null,"Julio Rodríguez\nDET - C",5,null,null,"Anthony Rendon\nLAA - 3B",5,null,null,"Michael Massey\nKC - 2B",5,null,null,"Myles Straw\nCLE - OF",5,null,null,"Aroldis Chapman\nKC - RP",5]
[null,null,"James Paxton\nBOS - SP",5,null,null,"Mitch Garver\nTEX - C",5,null,null,"Reid Detmers\nLAA - SP",5,null,null,"Curtis Mead\nTB - 2B,3B",5,null,null,"Adalberto Mondesi\nBOS - SS",5,null,null,"Tyler Mahle\nMIN - SP",5,null,null,"César Hernández\nDET - 2B,3B,OF",5,null,null,"Eric Haase\nDET - C,OF",5]
[null,null,"Bryan Abreu\nHOU - RP",5,null,null,"Christian Arroyo\nBOS - 1B,2B,3B,SS,OF",5,null,null,"Shinataro Fujinami",5,null,null,"Isiah Kiner-Falefa \nNYY - SS",5,null,null,"Yoán Moncada\nCWS - 3B",5,null,null,"Oswald Peraza\nNYY - SS",5,null,null,"Nate Pearson\nTOR - RP",5,null,null,"Jonathan Schoop\nDET - 2B",5]
[null,null,"Jonathan Loáisiga\nNYY - RP",5,null,null,"Jackson Holliday\nBAL - SS",5,null,null,"Austin Meadows\nDET - OF",5,null,null,"Eduardo Rodriguez\nDET - SP",5,null,null,"Caleb Thielbar\nMIN - RP",5,{"$nulls":6},"Santiago Espinal\nTOR - 2B,3B,SS",5,null,null,"Austin Hays\nBAL - OF",5]
[null,null,{"$f":"\"Draft Order = \"&VLOOKUP(Data!A2,draft_order,2,FALSE)","v":"Draft Order = 2"},{"$nulls":3},{"$f":"\"Draft Order = \"&VLOOKUP(Data!A3,draft_order,2,FALSE)","v":"Draft Order = 4"},{"$nulls":3},{"$f":"\"Draft Order = \"&VLOOKUP(Data!A4,draft_order,2,FALSE)","v":"Draft Order = 5"},{"$nulls":3},{"$f":"\"Draft Order = \"&VLOOKUP(Data!A5,draft_order,2,FALSE)","v":"Draft Order = 3"},{"$nulls":3},{"$f":"\"Draft Order = \"&VLOOKUP(Data!A6,draft_order,2,FALSE)","v":"Draft Order = 1"},{"$nulls":3},{"$f":"\"Draft Order = \"&VLOOKUP(Data!A7,draft_order,2,FALSE)","v":"Draft Order = 6"},{"$nulls":3},{"$f":"\"Draft Order = \"&VLOOKUP(Data!A8,draft_order,2,FALSE)","v":"Draft Order = 7"},{"$nulls":3},{"$f":"\"Draft Order = \"&VLOOKUP(Data!A9,draft_order,2,FALSE)","v":"Draft Order = 8"},{"$nulls":3},{"$f":"\"Draft Order = \"&VLOOKUP(Data!A10,draft_order,2,FALSE)","v":"Draft Order = 9"},{"$nulls":3},{"$f":"\"Draft Order = \"&VLOOKUP(Data!A11,draft_order,2,FALSE)","v":"Draft Order = 10"},{"$nulls":3},{"$f":"\"Draft Order = \"&VLOOKUP(Data!A12,draft_order,2,FALSE)","v":{"$error":"#N/A"}}]

{"sheet":"Draft List","index":1,"n_rows":195,"n_cols":12,"rows_kept":195}
[194,"Owner","Player","Bid","Team/Position","Rank","AB/Innings","R/K","HR/ERA","RBI/WHIP","SB/QS","OBP/Saves + Holds"]
[1,"Rhonda","Vladimir Guerrero Jr.","47","TOR - 1B","10","176/620","101","36","100","6",".373"]
[2,"Cathy","José Abreu","36","HOU - 1B","84","157/567","82","22","92","0",".334"]
[3,"Brett/Kyle","Bo Bichette","39","TOR - SS","13","175/595","94","24","91","17",".314"]
[4,"Rob","José Ramírez","44","CLE - 3B","4","162/583","102","34","118","24",".355"]
[5,"Bruce","Bobby Witt Jr.","52","KC - 3B,SS","19","167/622","91","23","89","32",".319"]
[6,"Rob","Aaron Judge","50","NYY - OF","3","152/514","107","48","108","10",".387"]
[7,"Rhonda","Daulton Varsho","22","TOR - C,OF","61","103/447","66","21","59","12",".331"]
[8,"Mike","Julio Rodríguez","45","SEA - OF","5","165/576","95","32","86","29",".351"]
[9,"Mike","Kyle Tucker","41","HOU - OF","6","145/535","78","29","103","21",".342"]
[10,"Cathy","Gerrit Cole","50","NYY - SP","15","194","252","3.29","1.01","20","0"]
[11,"Cathy","Marcus Semien","40","TEX - 2B,SS","31","161/641","101","31","86","19",".342"]
[12,"Brett/Kyle","Jose Altuve","33","HOU - 2B","34","153/550","105","27","64","12",".339"]
[13,"Todd","Vinnie Pasquantino","15","KC - 1B","101","153/516","52","23","71","3",".351"]
[14,"Todd","Rafael Devers","32","BOS - 3B","18","165/579","90","31","101","3",".346"]
[15,"Brandon","Andrés Giménez","11","CLE - 2B,SS","90","121/433","61","14","54","20",".299"]
[16,"Brett/Kyle","Shohei Ohtani (Batter)","38","LAA - Util","14","160/586","90","34","95","11",".356"]
[17,"Brandon","Yordan Alvarez","33","HOU - OF","7","139/470","89","34","95","1",".369"]
[18,"Brett/Kyle","Jacob deGrom","25","TEX - SP","28","136","191","3.04","0.90","16","0"]
[19,"Brandon","Alex Bregman","16","HOU - 3B","74","137/530","85","21","87","1",".370"]
[20,"Todd","Salvador Perez","22","KC - C","79","135/497","63","32","93","1",".305"]
[21,"Cathy","Adley Rutschman","27","BAL - C","95","121/458","82","16","49","3",".364"]
[22,"Rhonda","Shane McClanahan","30","TB - SP","30","174","202","2.84","1.03","15","0"]
[23,"Todd","Gleyber Torres","12","NYY - 2B","107","128/501","64","17","65","11",".338"]
[24,"Brett/Kyle","Alejandro Kirk","12","TOR - C","136","111/391","50","15","53","0",".349"]
[25,"Bruce","MJ Melendez","22","KC - C,OF","156","112/460","69","22","78","3",".326"]
[26,"Todd","Emmanuel Clase","20","CLE - RP",33,63,66,1.29,0.82,0,37]
[27,"Brandon","Corey Seager","13","TEX - SS","39","138/510","81","29","79","2",".352"]
[28,"Todd","Tim Anderson","31","CWS - SS","72","181/587","104","18","57","20",".346"]
[29,"Rhonda","Jorge Polanco","4","MIN - 2B","130","138/550","79","24","79","8",".325"]
[30,"Rob","Nathaniel Lowe","7","TEX - 1B","102","146/512","67","21","67","4",".365"]
[31,"Mike","Dylan Cease","26","CWS - SP","41","173","209","3.02","1.21","13","0"]
[32,"Rob","Mike Trout","36","LAA - OF","20","134/470","93","41","90","3",".400"]
[33,"Bruce","Luis Robert Jr.","25","CWS - OF","36","143/504","76","20","76","16",".340"]
[34,"Mike","Jordan Romano","19","TOR - RP",50,60,74,1.95,1,0,37]
[35,"Todd","Andrew Vaughn","15","CWS - 1B,OF","129","147/532","76","24","88","1",".326"]
[36,"Brandon","Carlos Rodón","16","NYY - SP","42","171","209","3.37","1.14","14","0"]
[37,"Rhonda","Cal Raleigh","11","SEA - C","208","74/347","38","22","54","2",".000"]
[38,"Cathy","Wander Franco","15","TB - SS","91","159/552","90","16","73","14",".361"]
[39,"Rhonda","Randy Arozarena","31","TB - OF","43","134/498","74","20","72","24",".358"]
[40,"Brandon","Ryan Mountcastle","16","BAL - 1B","147","134/512","62","24","83","3",".312"]
[41,"Todd","José Berríos","5","TOR - SP","230","178","173","4.45","1.27","16","0"]
[42,"Brett/Kyle","Erik Swanson","8","TOR - RP",357,50,61,3.06,1.04,0,13]
[43,"Cathy","George Springer","21","TOR - OF","60","117/441","81","26","69","9",".356"]
[44,"Brandon","Cristian Javier","15","HOU - SP,RP",86,160,191,2.98,1.01,10,0]
[45,"Bruce","Gunnar Henderson","10","BAL - 3B,SS","94","141/510","71","21","82","15",".000"]
[46,"Rhonda","Josh Bell","6","CLE - 1B","174","137/530","74","21","75","0",".346"]
[47,"Brett/Kyle","Ryan Pressly","11","HOU - RP",65,55,73,2.78,1,0,31]
[48,"Mike","Jeremy Peña","17","HOU - SS","111","145/574","79","24","70","14",".341"]
[49,"Todd","Kenley Jansen","10","BOS - RP",108,66,86,3,1.06,0,38]
[50,"Cathy","Michael King","2","NYY - RP",378,59,65,3.81,1.2,0,10]
[51,"Brandon","Teoscar Hernández","12","SEA - OF","66","145/518","81","30","92","10",".335"]
[52,"Bruce","Luis Castillo","17","SEA - SP","58","169","188","3.35","1.17","18","0"]
[53,"Mike","Shane Bieber","31","CLE - SP","45","192","229","2.91","1.09","23","0"]
[54,"Rhonda","Clay Holmes","12","NYY - RP",123,56,59,2.89,1.09,0,24]
[55,"Rob","Félix Bautista","10","BAL - RP",85,66,88,2.18,0.94,0,30]
[56,"Rhonda","Shohei Ohtani (Pitcher)","20","LAA - SP","46","147","188","2.69","1.05","15","0"]
[57,"Rob","Pete Fairbanks","14","TB - RP",158,57,83,2.68,1.19,0,30]
[58,"Rhonda","Chris Bassitt","4","TOR - SP","183","162","161","3.89","1.21","17","0"]
[59,"Mike","Alek Manoah","21","TOR - SP","70","190","185","3.13","1.09","18","0"]
[60,"Mike","Kevin Gausman","27","TOR - SP","59","178","214","3.19","1.15","17","0"]
[61,"Rob","Brandon Drury","10","LAA - 1B,2B,3B","207","120/462","71","23","74","2",".310"]
[62,"Brett/Kyle","Adolis García","6","TEX - OF","68","123/499","70","24","81","18",".281"]
[63,"Todd","Andrés Muñoz","7","SEA - RP",153,50,72,2.52,0.9,0,29]
[64,"Brett/Kyle","Byron Buxton","18","MIN - OF","100","114/461","84","36","72","9",".305"]
[65,"Bruce","Lucas Giolito","10","CWS - SP","139","173","199","3.90","1.21","14","0"]
[66,"Brandon","Robbie Ray","11","SEA - SP","93","182","219","3.76","1.23","17","0"]
[67,"Brandon","Giancarlo Stanton","9","NYY - OF","122","97/403","53","29","76","0",".351"]
[68,"Rob","Eloy Jiménez","17","CWS - OF","73","160/551","69","32","102","0",".316"]
[69,"Rob","Yasmani Grandal","1","CWS - C","264","80/362","44","15","51","1",".357"]
[70,"Cathy","Nestor Cortes","10","NYY - SP","103","160","167","3.09","1.03","11","0"]
[71,"Rob","Scott Barlow","9","KC - RP",217,75,86,2.64,1.09,0,29]
[72,"Rhonda","Matt Chapman","5","TOR - 3B","161","113/509","76","27","73","2",".332"]
[73,"Todd","Jeffrey Springs","12","TB - SP,RP","160","167","173","3.02","1.14","6","10"]
[74,"Rob","Jhoan Duran","12","MIN - RP",121,68,90,1.85,0.97,0,34]
[75,"Brandon","Paul Sewald","6","SEA - RP",176,50,65,3.42,0.96,0,24]
[76,"Cathy","Jorge López","1","MIN - RP",240,94,86,4.79,1.44,3,13]
[77,"Brandon","Logan Gilbert","12","SEA - SP","114","160","156","3.66","1.17","12","0"]
[78,"Cathy","George Kirby","8","SEA - SP","125","143","147","3.46","1.22","13","0"]
[79,"Brandon","Anthony Santander","2","BAL - OF","118","119/491","68","27","76","0",".292"]
[80,"Rhonda","Liam Hendriks","5","CWS - RP",248,24,37,2.62,0.88,0,14]
[81,"Brett/Kyle","Rafael Montero","2","HOU - RP",364,59,59,3.66,1.17,0,26]
[82,"Rhonda","Kendall Graveman","4","CWS - RP",280,60,60,3.15,1.23,0,22]
[83,"Brandon","Danny Jansen","1","TOR - C","238","52/223","36","14","40","1",".297"]
[84,"Cathy","Taylor Ward","1","LAA - OF","115","140/503","77","20","64","6",".341"]
[85,"Brandon","Lance Lynn","10","CWS - SP","138","151","161","3.40","1.09","14","0"]
[86,"Mike","Eugenio Suárez","10","SEA - 3B","144","115/529","75","33","87","1",".308"]
[87,"Brett/Kyle","Chris Sale","6","BOS - SP","165","112","132","3.78","1.36","11","0"]
[88,"Todd","Alex Verdugo","1","BOS - OF","166","163/568","83","13","65","4",".351"]
[89,"Brandon","Framber Valdez","45","HOU - SP","69","195","190","3.05","1.17","22","0"]
[90,"Brandon","Alex Lange","5","DET - RP",244,61,80,3.1,1.16,0,25]
[91,"Brandon","Hunter Brown","12","HOU - RP",259,149,166,3.14,1.22,13,1]
[92,"Cathy","Joe Ryan","6","MIN - SP","141","164","162","3.84","1.13","12","0"]
[93,"Cathy","Jose Miranda","8","MIN - 1B,3B","162","140/511","53","18","76","2",".326"]
[94,"Todd","Brady Singer","10","KC - SP","168","178","175","3.89","1.26","14","0"]
[95,"Rhonda","José Leclerc","11","TEX - RP",202,25,28,2.88,1.12,0,6]
[96,"Todd","Jason Adam","12","TB - RP",334,55,72,2.62,1.02,0,25]
[97,"Bruce","James Karinchak","5","CLE - RP",275,50,81,2.88,1.14,0,18]
[98,"Cathy","Zach Eflin","3","TB - SP,RP","316","140","136","4.05","1.21","10","2"]
[99,"Rob","Luis Garcia","3","HOU - SP","196","156","159","3.58","1.14","9","0"]
[100,"Brett/Kyle","Josh Jung","11","TEX - 3B","229","104/441","45","24","62","5",".263"]
[101,"Bruce","Carlos Estévez","3","LAA - RP",279,60,62,3.6,1.23,0,20]
[102,"Mike","Pablo López","9","MIN - SP","181","150","152","3.60","1.16","12","0"]
[103,"Todd","Steven Kwan","7","CLE - OF","110","170/564","90","6","52","20",".356"]
[104,"Bruce","Héctor Neris","6","HOU - RP",379,67,84,3.76,1.18,0,26]
[105,"Cathy","Grayson Rodriguez","11","BAL - SP","188","124","140","3.34","1.05","11","0"]
[106,"Rhonda","Patrick Sandoval","6","LAA - SP","215","156","159","3.46","1.27","9","0"]
[107,"Brett/Kyle","Triston McKenzie","15","CLE - SP","75","174","183","3.52","1.00","15","0"]
[108,"Mike","Adam Cimber","1","TOR - RP",367,64,48,2.67,1.12,0,15]
[109,"Rhonda","Cal Quantrill","5","CLE - SP","302","157","118","3.15","1.20","13","1"]
[110,"Todd","Drew Rasmussen","5","TB - SP","184","173","158","3.07","1.10","8","0"]
[111,"Bruce","Diego Castillo","3","SEA - RP",377,56,62,3.05,1.09,0,21]
[112,"Brett/Kyle","Masataka Yoshida","16","BOS - OF","191","131/465","61","14","71","3",".000"]
[113,"Brett/Kyle","Sonny Gray","4","MIN - SP","239","130","143","3.60","1.18","10","0"]
[114,"Rob","Anthony Rizzo","9","NYY - 1B","150","114/489","75","28","69","6",".365"]
[115,"Bruce","Cedric Mullins","40","BAL - OF","44","153/568","82","19","57","30",".334"]
[116,"Rhonda","Oswaldo Cabrera","6","NYY - OF","292","104/400","57","16","52","10",".000"]
[117,"Todd","Luis Severino","7","NYY - SP","113","133","148","3.25","1.08","10","0"]
[118,"Bruce","Andrew Heaney","1","TEX - SP","212","154","192","4.50","1.22","7","0"]
[119,"Todd","Amed Rosario","14","CLE - SS,OF","126","158/566","78","11","61","13",".319"]
[120,"Rob","Jon Gray","1","TEX - SP","209","131","129","4.53","1.24","9","0"]
[121,"Brett/Kyle","Yandy Díaz","1","TB - 1B,3B","252","126/443","63","10","55","2",".376"]
[122,"Mike","Jimmy Herget","1","LAA - RP",376,50,46,2.88,1.04,0,9]
[123,"Bruce","Frankie Montas","1","NYY - SP","291","28","30","4.18","1.25","3","0"]
[124,"Cathy","Whit Merrifield","7","TOR - 2B,OF","173","124/468","67","10","54","22",".327"]
[125,"Rob","Nathan Eovaldi","1","TEX - SP","233","158","161","3.82","1.21","12","0"]
[126,"Bruce","Tyler Glasnow","14","TB - SP","88","119","179","3.25","1.08","9","0"]
[127,"Mike","Will Smith","1","TEX - RP",518,59,70,3.81,1.25,0,25]
[128,"Bruce","Triston Casas","7","BOS - 1B","241","96/380","65","26","72","5",".309"]
[129,"Cathy","Garrett Whitlock","1","BOS - SP,RP",306,91,95,3.26,1.09,5,0]
[130,"Brett/Kyle","Yimi García","1","TOR - RP",400,56,58,3.21,1.07,0,20]
[131,"Bruce","Brandon Lowe","7","TB - 2B","134","93/383","64","23","62","4",".335"]
[132,"Rob","José Urquidy","1","HOU - SP","269","164","131","3.73","1.10","15","0"]
[133,"Mike","Logan O'Hoppe","1","LAA - C","2221","80/320","35","12","42","1",".355"]
[134,"Bruce","Riley Greene","1","DET - OF","187","156/583","81","16","71","6",".343"]
[135,"Cathy","DJ LeMahieu","1","NYY - 1B,2B,3B","251","147/520","83","14","54","5",".347"]
[136,"Rob","Javier Báez","1","DET - SS","155","130/545","71","22","73","12",".302"]
[137,"Mike","Kolten Wong","1","SEA - 2B","206","116/445","68","13","47","15",".347"]
[138,"Bruce","Carlos Correa","7","MIN - SS","112","158/563","84","23","78","0",".356"]
[139,"Rob","Lance McCullers Jr.","1","HOU - SP","225","107","117","3.20","1.21","10","0"]
[140,"Mike","Ty France","1","SEA - 1B,3B","164","150/529","69","18","76","0",".358"]
[141,"Mike","Esteury Ruiz","1","OAK - OF","253","95/363","66","7","41","31",".000"]
[142,"Mike","Spencer Torkelson","1","DET - 1B","317","108/450","48","17","35","0",".286"]
[143,"Mike","Ricky Tiedemann","5","TOR - SP","1256","0","0","0.00","0.00","0","0"]
[144,"Brandon","Justin Turner","5","BOS - 3B","226","134/479","71","17","80","3",".370"]
[145,"Cathy","Daniel Espino","5","CLE - SP","916","0","0","0.00","0.00","0","0"]
[146,"Brett/Kyle","Corey Kluber","5","BOS - SP","640","142","126","4.18","1.25","12","0"]
[147,"Bruce","Hunter Renfroe","5","LAA - OF","151","114/466","69","28","78","2",".299"]
[148,"Rhonda","Tyler Anderson","5","LAA - SP","319","172","132","3.51","1.14","14","0"]
[149,"Rob","Dylan Moore","5","SEA - 2B,SS,OF","531","59/275","46","11","34","23",".325"]
[150,"Todd","Adam Frazier","5","BAL - 2B,OF","439","145/557","68","6","46","9",".313"]
[151,"Todd","Kenta Maeda","5","MIN - SP","353","130","148","3.74","1.05","10","0"]
[152,"Rob","Michael Kopech","5","CWS - SP","308","125","131","3.60","1.18","6","0"]
[153,"Rhonda","Luis Rengifo","5","LAA - 2B,3B,SS","271","125/515","53","17","50","8",".331"]
[154,"Bruce","Shea Langeliers","5","OAK - C","2025","102/454","45","19","70","0",".315"]
[155,"Cathy","Reynaldo López","5","CWS - RP",373,64,61,3.66,1.08,0,5]
[156,"Brandon","Clarke Schmidt","5","NYY - SP,RP","462","68","66","3.71","1.32","0","6"]
[157,"Mike","Jarred Kelenic","5","SEA - OF","310","62/310","43","15","47","8",".230"]
[158,"Mike","Oscar Colas","5","CWS - OF","329","0/0","0","0","0","0",".000"]
[159,"Brandon","Harrison Bader","5","NYY - OF","180","105/411","56","13","48","17",".323"]
[160,"Cathy","Adam Duvall","5","BOS - OF","342","89/400","57","26","71","2",".296"]
[161,"Bruce","Kiké Hernández","5","BOS - 2B,SS,OF","1455","120/515","76","15","65","0",".317"]
[162,"Rhonda","Joey Gallo","5","MIN - OF","1378","77/428","64","27","61","4",".345"]
[163,"Rob","Christian Vázquez","5","MIN - C,1B","294","111/409","45","10","50","5",".318"]
[164,"Mike","Eric Haase","5","DET - C,OF","517","70/286","37","14","43","1",".294"]
[165,"Todd","Oscar Gonzalez","5","CLE - OF","170","153/543","57","15","63","3",".000"]
[166,"Rob","Myles Straw","5","CLE - OF","332","117/492","68","1","36","23",".309"]
[167,"Rhonda","Michael Massey","5","KC - 2B","1998","22/87","8","2","9","2",".000"]
[168,"Bruce","Ramón Laureano","5","OAK - OF","186","82/369","51","14","41","10",".328"]
[169,"Brett/Kyle","Kevin Kiermaier","5","TOR - OF","1780","68/281","39","6","33","10",".309"]
[170,"Cathy","Julio Rodríguez","5","DET - C","2581","0/0","0","0","0","0",".000"]
[171,"Brandon","Jonah Heim","5","TEX - C","299","67/308","35","11","37","2",".300"]
[172,"Mike","Anthony Rendon","5","LAA - 3B","216","120/480","58","18","74","2",".379"]
[173,"Mike","Adalberto Mondesi","5","BOS - SS","211","79/338","47","10","35","37",".287"]
[174,"Brandon","James Paxton","5","BOS - SP","704","111","96","4.54","1.21","8","0"]
[175,"Cathy","Curtis Mead","5","TB - 2B,3B","2340","0/0","0","0","0","0",".000"]
[176,"Brett/Kyle","Mitch Garver","5","TEX - C","300","42/195","25","10","26","1",".296"]
[177,"Bruce","Reid Detmers","5","LAA - SP","260","135","127","4.20","1.28","8","0"]
[178,"Rhonda","Tyler Mahle","5","MIN - SP","262","128","144","4.01","1.21","10","0"]
[179,"Rob","César Hernández","5","DET - 2B,3B,OF","493","144/575","76","9","47","5",".324"]
[180,"Todd","Aroldis Chapman","5","KC - RP",417,42,64,3.86,1.31,0,21]
[181,"Todd","Jonathan Schoop","5","DET - 2B","698","126/521","64","16","57","3",".255"]
[182,"Rob","Nate Pearson","5","TOR - RP",1396,13,14,5.54,1.61,0,0]
[183,"Rhonda","Oswald Peraza","5","NYY - SS","286","129/456","58","14","43","11",".000"]
[184,"Brett/Kyle","Christian Arroyo","5","BOS - 1B,2B,3B,SS,OF","1533","84/304","37","9","42","4",".295"]
[185,"Cathy","Isiah Kiner-Falefa ","5","NYY - SS","361","146/548","70","6","46","21",".315"]
[186,"Brandon","Bryan Abreu","5","HOU - RP",387,44,57,3.07,1.29,0,7]
[187,"Mike","Yoán Moncada","5","CWS - 3B","249","108/462","58","13","57","2",".364"]
[188,"Mike","Caleb Thielbar","5","MIN - RP",411,60,76,3.15,1.17,0,15]
[189,"Brandon","Jonathan Loáisiga","5","NYY - RP",483,58,51,3.26,1.17,0,15]
[190,"Cathy","Eduardo Rodriguez","5","DET - SP","354","147","147","4.41","1.37","12","0"]
[191,"Brett/Kyle","Jackson Holliday","5","BAL - SS","2436","0/0","0","0","0","0",".000"]
[192,"Bruce","Austin Meadows","5","DET - OF","232","68/296","39","11","47","2",".325"]
[193,"Rob","Santiago Espinal","5","TOR - 2B,3B,SS","461","90/326","41","4","34","5",".345"]
[194,"Todd","Austin Hays","5","BAL - OF","235","123/485","66","17","58","3",".314"]

{"sheet":"Summary","index":2,"n_rows":13,"n_cols":15,"rows_kept":13}
["Owners","Current Used Points","Remaining Points","Max Bidding Points","Players Left to Draft","C","1B","2B","3B","SS","OF","DH","SP","RP","Reserve"]
[{"$f":"Data!A2","v":"Brandon"},{"$f":"used1","v":245},{"$f":"'2023 Pre-Draft Rosters'!D23","v":15},{"$f":"'2023 Pre-Draft Rosters'!D24","v":15},{"$f":"'2023 Pre-Draft Rosters'!D25","v":0},{"$f":"1-COUNT('2023 Pre-Draft Rosters'!D4)","v":0},{"$f":"1-COUNT('2023 Pre-Draft Rosters'!D5)","v":0},{"$f":"1-COUNT('2023 Pre-Draft Rosters'!D6)","v":0},{"$f":"1-COUNT('2023 Pre-Draft Rosters'!D7)","v":0},{"$f":"1-COUNT('2023 Pre-Draft Rosters'!D8)","v":0},{"$f":"3-COUNT('2023 Pre-Draft Rosters'!D9:D11)","v":0},{"$f":"1-COUNT('2023 Pre-Draft Rosters'!D12)","v":0},{"$f":"5-COUNT('2023 Pre-Draft Rosters'!D13:D17)","v":0},{"$f":"4-COUNT('2023 Pre-Draft Rosters'!D18:D21)","v":0},{"$f":"7-COUNT('2023 Pre-Draft Rosters'!D28:D34)","v":0}]
[{"$f":"Data!A3","v":"Brett/Kyle"},{"$f":"used2","v":250},{"$f":"'2023 Pre-Draft Rosters'!H23","v":10},{"$f":"'2023 Pre-Draft Rosters'!H24","v":10},{"$f":"'2023 Pre-Draft Rosters'!H25","v":0},{"$f":"1-COUNT('2023 Pre-Draft Rosters'!H4)","v":0},{"$f":"1-COUNT('2023 Pre-Draft Rosters'!H5)","v":0},{"$f":"1-COUNT('2023 Pre-Draft Rosters'!H6)","v":0},{"$f":"1-COUNT('2023 Pre-Draft Rosters'!H7)","v":0},{"$f":"1-COUNT('2023 Pre-Draft Rosters'!H8)","v":0},{"$f":"3-COUNT('2023 Pre-Draft Rosters'!H9:H11)","v":0},{"$f":"1-COUNT('2023 Pre-Draft Rosters'!H12)","v":0},{"$f":"5-COUNT('2023 Pre-Draft Rosters'!H13:H17)","v":0},{"$f":"4-COUNT('2023 Pre-Draft Rosters'!H18:H21)","v":0},{"$f":"7-COUNT('2023 Pre-Draft Rosters'!H28:H34)","v":0}]
[{"$f":"Data!A4","v":"Bruce"},{"$f":"used3","v":231},{"$f":"'2023 Pre-Draft Rosters'!L23","v":29},{"$f":"'2023 Pre-Draft Rosters'!L24","v":29},{"$f":"'2023 Pre-Draft Rosters'!L25","v":0},{"$f":"1-COUNT('2023 Pre-Draft Rosters'!L4)","v":0},{"$f":"1-COUNT('2023 Pre-Draft Rosters'!L5)","v":0},{"$f":"1-COUNT('2023 Pre-Draft Rosters'!L6)","v":0},{"$f":"1-COUNT('2023 Pre-Draft Rosters'!L7)","v":0},{"$f":"1-COUNT('2023 Pre-Draft Rosters'!L8)","v":0},{"$f":"3-COUNT('2023 Pre-Draft Rosters'!L9:L11)","v":0},{"$f":"1-COUNT('2023 Pre-Draft Rosters'!L12)","v":0},{"$f":"5-COUNT('2023 Pre-Draft Rosters'!L13:L17)","v":0},{"$f":"4-COUNT('2023 Pre-Draft Rosters'!L18:L21)","v":0},{"$f":"7-COUNT('2023 Pre-Draft Rosters'!L28:L34)","v":0}]
[{"$f":"Data!A5","v":"Cathy"},{"$f":"used4","v":248},{"$f":"'2023 Pre-Draft Rosters'!P23","v":12},{"$f":"'2023 Pre-Draft Rosters'!P24","v":12},{"$f":"'2023 Pre-Draft Rosters'!P25","v":0},{"$f":"1-COUNT('2023 Pre-Draft Rosters'!P4)","v":0},{"$f":"1-COUNT('2023 Pre-Draft Rosters'!P5)","v":0},{"$f":"1-COUNT('2023 Pre-Draft Rosters'!P6)","v":0},{"$f":"1-COUNT('2023 Pre-Draft Rosters'!P7)","v":0},{"$f":"1-COUNT('2023 Pre-Draft Rosters'!P8)","v":0},{"$f":"3-COUNT('2023 Pre-Draft Rosters'!P9:P11)","v":0},{"$f":"1-COUNT('2023 Pre-Draft Rosters'!P12)","v":0},{"$f":"5-COUNT('2023 Pre-Draft Rosters'!P13:P17)","v":0},{"$f":"4-COUNT('2023 Pre-Draft Rosters'!P18:P21)","v":0},{"$f":"7-COUNT('2023 Pre-Draft Rosters'!P28:P34)","v":0}]
[{"$f":"Data!A6","v":"Mike"},{"$f":"used5","v":254},{"$f":"'2023 Pre-Draft Rosters'!T23","v":6},{"$f":"'2023 Pre-Draft Rosters'!T24","v":6},{"$f":"'2023 Pre-Draft Rosters'!T25","v":0},{"$f":"1-COUNT('2023 Pre-Draft Rosters'!T4)","v":0},{"$f":"1-COUNT('2023 Pre-Draft Rosters'!T5)","v":0},{"$f":"1-COUNT('2023 Pre-Draft Rosters'!T6)","v":0},{"$f":"1-COUNT('2023 Pre-Draft Rosters'!T7)","v":0},{"$f":"1-COUNT('2023 Pre-Draft Rosters'!T8)","v":0},{"$f":"3-COUNT('2023 Pre-Draft Rosters'!T9:T11)","v":0},{"$f":"1-COUNT('2023 Pre-Draft Rosters'!T12)","v":0},{"$f":"5-COUNT('2023 Pre-Draft Rosters'!T13:T17)","v":0},{"$f":"4-COUNT('2023 Pre-Draft Rosters'!T18:T21)","v":0},{"$f":"7-COUNT('2023 Pre-Draft Rosters'!T28:T34)","v":0}]
[{"$f":"Data!A7","v":"Rhonda"},{"$f":"used6","v":230},{"$f":"'2023 Pre-Draft Rosters'!X23","v":30},{"$f":"'2023 Pre-Draft Rosters'!X24","v":30},{"$f":"'2023 Pre-Draft Rosters'!X25","v":0},{"$f":"1-COUNT('2023 Pre-Draft Rosters'!X4)","v":0},{"$f":"1-COUNT('2023 Pre-Draft Rosters'!X5)","v":0},{"$f":"1-COUNT('2023 Pre-Draft Rosters'!X6)","v":0},{"$f":"1-COUNT('2023 Pre-Draft Rosters'!X7)","v":0},{"$f":"1-COUNT('2023 Pre-Draft Rosters'!X8)","v":0},{"$f":"3-COUNT('2023 Pre-Draft Rosters'!X9:X11)","v":0},{"$f":"1-COUNT('2023 Pre-Draft Rosters'!X12)","v":0},{"$f":"5-COUNT('2023 Pre-Draft Rosters'!X13:X17)","v":0},{"$f":"4-COUNT('2023 Pre-Draft Rosters'!X18:X21)","v":0},{"$f":"7-COUNT('2023 Pre-Draft Rosters'!X28:X34)","v":1}]
[{"$f":"Data!A8","v":"Rob"},{"$f":"used7","v":227},{"$f":"'2023 Pre-Draft Rosters'!AB23","v":33},{"$f":"'2023 Pre-Draft Rosters'!AB24","v":33},{"$f":"'2023 Pre-Draft Rosters'!AB25","v":0},{"$f":"1-COUNT('2023 Pre-Draft Rosters'!AB4)","v":0},{"$f":"1-COUNT('2023 Pre-Draft Rosters'!AB5)","v":0},{"$f":"1-COUNT('2023 Pre-Draft Rosters'!AB6)","v":0},{"$f":"1-COUNT('2023 Pre-Draft Rosters'!AB7)","v":0},{"$f":"1-COUNT('2023 Pre-Draft Rosters'!AB8)","v":0},{"$f":"3-COUNT('2023 Pre-Draft Rosters'!AB9:AB11)","v":0},{"$f":"1-COUNT('2023 Pre-Draft Rosters'!AB12)","v":0},{"$f":"5-COUNT('2023 Pre-Draft Rosters'!AB13:AB17)","v":0},{"$f":"4-COUNT('2023 Pre-Draft Rosters'!AB18:AB21)","v":0},{"$f":"7-COUNT('2023 Pre-Draft Rosters'!AB28:AB34)","v":0}]
[{"$f":"Data!A9","v":"Todd"},{"$f":"used8","v":237},{"$f":"'2023 Pre-Draft Rosters'!AF23","v":23},{"$f":"'2023 Pre-Draft Rosters'!AF24","v":23},{"$f":"'2023 Pre-Draft Rosters'!AF25","v":0},{"$f":"1-COUNT('2023 Pre-Draft Rosters'!AF4)","v":0},{"$f":"1-COUNT('2023 Pre-Draft Rosters'!AF5)","v":0},{"$f":"1-COUNT('2023 Pre-Draft Rosters'!AF6)","v":0},{"$f":"1-COUNT('2023 Pre-Draft Rosters'!AF7)","v":0},{"$f":"1-COUNT('2023 Pre-Draft Rosters'!AF8)","v":0},{"$f":"3-COUNT('2023 Pre-Draft Rosters'!AF9:AF11)","v":0},{"$f":"1-COUNT('2023 Pre-Draft Rosters'!AF12)","v":0},{"$f":"5-COUNT('2023 Pre-Draft Rosters'!AF13:AF17)","v":0},{"$f":"4-COUNT('2023 Pre-Draft Rosters'!AF18:AF21)","v":0},{"$f":"7-COUNT('2023 Pre-Draft Rosters'!AF28:AF34)","v":0}]
[{"$f":"Data!A10","v":"N/A #1"},{"$f":"used9","v":0},{"$f":"'2023 Pre-Draft Rosters'!AJ23","v":260},{"$f":"'2023 Pre-Draft Rosters'!AJ24","v":243},{"$f":"'2023 Pre-Draft Rosters'!AJ25","v":18},{"$f":"1-COUNT('2023 Pre-Draft Rosters'!AJ4)","v":1},{"$f":"1-COUNT('2023 Pre-Draft Rosters'!AJ5)","v":1},{"$f":"1-COUNT('2023 Pre-Draft Rosters'!AJ6)","v":1},{"$f":"1-COUNT('2023 Pre-Draft Rosters'!AJ7)","v":1},{"$f":"1-COUNT('2023 Pre-Draft Rosters'!AJ8)","v":1},{"$f":"3-COUNT('2023 Pre-Draft Rosters'!AJ9:AJ11)","v":3},{"$f":"1-COUNT('2023 Pre-Draft Rosters'!AJ12)","v":1},{"$f":"5-COUNT('2023 Pre-Draft Rosters'!AJ13:AJ17)","v":5},{"$f":"4-COUNT('2023 Pre-Draft Rosters'!AJ18:AJ21)","v":4},{"$f":"7-COUNT('2023 Pre-Draft Rosters'!AJ28:AJ34)","v":7}]
[{"$f":"Data!A10","v":"N/A #1"},{"$f":"used10","v":0},{"$f":"'2023 Pre-Draft Rosters'!AN23","v":260},{"$f":"'2023 Pre-Draft Rosters'!AN24","v":243},{"$f":"'2023 Pre-Draft Rosters'!AN25","v":18},{"$f":"1-COUNT('2023 Pre-Draft Rosters'!AN4)","v":1},{"$f":"1-COUNT('2023 Pre-Draft Rosters'!AN5)","v":1},{"$f":"1-COUNT('2023 Pre-Draft Rosters'!AN6)","v":1},{"$f":"1-COUNT('2023 Pre-Draft Rosters'!AN7)","v":1},{"$f":"1-COUNT('2023 Pre-Draft Rosters'!AN8)","v":1},{"$f":"3-COUNT('2023 Pre-Draft Rosters'!AN9:AN11)","v":3},{"$f":"1-COUNT('2023 Pre-Draft Rosters'!AN12)","v":1},{"$f":"5-COUNT('2023 Pre-Draft Rosters'!AN13:AN17)","v":5},{"$f":"4-COUNT('2023 Pre-Draft Rosters'!AN18:AN21)","v":4},{"$f":"7-COUNT('2023 Pre-Draft Rosters'!AN28:AN34)","v":7}]
[{"$f":"Data!A11","v":"N/A #2"},{"$f":"used11","v":0},{"$f":"'2023 Pre-Draft Rosters'!AR23","v":260},{"$f":"'2023 Pre-Draft Rosters'!AR24","v":243},{"$f":"'2023 Pre-Draft Rosters'!AR25","v":18},{"$f":"1-COUNT('2023 Pre-Draft Rosters'!AR4)","v":1},{"$f":"1-COUNT('2023 Pre-Draft Rosters'!AR5)","v":1},{"$f":"1-COUNT('2023 Pre-Draft Rosters'!AR6)","v":1},{"$f":"1-COUNT('2023 Pre-Draft Rosters'!AR7)","v":1},{"$f":"1-COUNT('2023 Pre-Draft Rosters'!AR8)","v":1},{"$f":"3-COUNT('2023 Pre-Draft Rosters'!AR9:AR11)","v":3},{"$f":"1-COUNT('2023 Pre-Draft Rosters'!AR12)","v":1},{"$f":"5-COUNT('2023 Pre-Draft Rosters'!AR13:AR17)","v":5},{"$f":"4-COUNT('2023 Pre-Draft Rosters'!AR18:AR21)","v":4},{"$f":"7-COUNT('2023 Pre-Draft Rosters'!AR28:AR34)","v":7}]
[{"$nulls":4},{"$f":"SUM(E2:E12)-54","v":0},{"$f":"SUM(F2:F12)-3","v":0},{"$f":"SUM(G2:G12)-3","v":0},0,0,0,{"$f":"SUM(K2:K12)-9","v":0},{"$f":"SUM(L2:L12)-3","v":0},{"$f":"SUM(M2:M12)-15","v":0},{"$f":"SUM(N2:N12)-12","v":0},{"$f":"SUM(O2:O12)-21","v":1}]

{"sheet":"Catchers","index":3,"n_rows":104,"n_cols":9,"rows_kept":104}
["Player","Team","Rank","H/AB","R","HR","RBI","SB","OBP"]
{"$rows_empty":11}
["Bo Naylor","CLE - C","338","81/346","46","12","43","8",".000"]
[]
["Gary Sánchez","MIN - C","1423","81/402","57","27","65","0",".296"]
["Jose Trevino","NYY - C","1633","73/297","32","8","36","1",".271"]
["Christian Bethancourt","TB - C,1B","1737","41/159","20","6","17","3",".000"]
["Jorge Alfaro","BOS - C","1819","65/268","25","6","37","4",".291"]
["Francisco Mejía","TB - C","1852","57/245","29","5","28","0",".301"]
["Martín Maldonado","HOU - C","1878","66/357","42","14","45","0",".293"]
["Kyle Higashioka","NYY - C","1886","43/200","23","10","30","0",".253"]
["Reese McGuire","BOS - C","1906","52/209","21","2","15","1",".000"]
["Ryan Jeffers","MIN - C","1932","52/242","26","11","31","0",".302"]
["Seby Zavala","CWS - C","1945","30/120","16","3","16","0",".000"]
["Max Stassi","LAA - C","1951","49/226","27","9","27","0",".306"]
["Mike Zunino","CLE - C","1972","38/202","28","15","33","0",".268"]
["James McCann","BAL - C","1979","58/256","28","8","31","2",".313"]
[]
["Tom Murphy","SEA - C","2055","24/109","16","4","12","0",".306"]
["Cooper Hummel","SEA - C,OF","2068","17/88","10","2","9","2",".000"]
["Sam Huff","TEX - C","2072","19/74","7","3","7","1",".000"]
["Robinson Chirinos","BAL - C","2088","61/274","34","10","44","0",".317"]
["Zack Collins","CLE - C,1B","2097","15/79","8","2","9","0",".327"]
["Matt Thaiss","LAA - C,1B","2103","9/46","6","1","4","1",".000"]
["Manny Piña","OAK - C","2127","16/85","11","5","14","0",".000"]
["Connor Wong","BOS - C","2140","6/28","5","1","4","0",".000"]
["René Pinto","TB - C","2144","9/40","3","1","5","0",".000"]
["Jake Rogers","DET - C","2150","9/38","6","2","6","0",".000"]
["Meibrys Viloria","CLE - C","2167","7/41","5","1","3","0",".000"]
["Wilson Ramos","DET - C","2169","0/0","0","0","0","0",".000"]
["Mark Kolozsvary","BAL - C","2190","3/10","2","1","2","0",".000"]
["Cam Gallagher","CLE - C","2195","21/82","8","1","6","0",".000"]
["Yohel Pozo","OAK - C","2196","6/25","3","0","3","0",".000"]
[]
["Jacob Nottingham","SEA - C","2240","6/35","5","3","8","0",".000"]
["Grayson Greiner","MIN - C","2244","9/50","6","2","6","0",".000"]
["Caleb Hamilton","BOS - C","2245","1/9","3","1","1","0",".000"]
["Chad Wallach","LAA - C","2248","11/57","4","1","7","0",".000"]
["Ben Rortvedt","NYY - C","2258","5/30","3","1","2","0",".275"]
["Carlos Pérez","CWS - C","2262","2/9","0","0","1","0",".000"]
["Jakson Reetz","KC - C","2265","0/1","0","0","0","0",".000"]
["Brian O'Keefe","SEA - C","2274","1/2","0","0","0","0",".000"]
["Korey Lee","HOU - C","2280","2/13","1","0","2","0",".000"]
["Ryan Lavarnway","DET - C","2281","4/14","1","0","0","0",".000"]
["Mario Feliciano","DET - C","2285","1/2","0","0","0","0",".000"]
["Josh Breaux","NYY - C","2328","0/0","0","0","0","0",".000"]
["Daniel Susac","OAK - C","2342","0/0","0","0","0","0",".000"]
["Rodolfo Durán","NYY - C","2356","0/0","0","0","0","0",".000"]
["David García","TEX - C","2397","0/0","0","0","0","0",".000"]
["Hayden Dunhurst","KC - C","2421","0/0","0","0","0","0",".000"]
["Heriberto Hernandez","TB - C,OF","2463","0/0","0","0","0","0",".000"]
["Nick Dini","TB - C","2472","0/0","0","0","0","0",".000"]
["Nathan Hickey","BOS - C","2489","0/0","0","0","0","0",".000"]
["Brooks Brannon","BOS - C","2508","0/0","0","0","0","0",".000"]
["Ronnie Freeman","OAK - C","2525","0/0","0","0","0","0",".000"]
["Ronaldo Hernández","BOS - C","2566","0/0","0","0","0","0",".000"]
["Anthony Seigler","NYY - C","2570","0/0","0","0","0","0",".000"]
["Scott Manea","HOU - C","2574","0/0","0","0","0","0",".000"]
[]
["José Briceño","KC - C","2589","0/2","0","0","0","0",".000"]
["Kyle McCann","OAK - C","2599","0/0","0","0","0","0",".000"]
["Jack Kruger","TEX - C","2615","0/0","0","0","0","0",".000"]
["Austin Wells","NYY - C","2633","0/0","0","0","0","0",".000"]
["Beau Taylor","BAL - C","2634","0/0","0","0","0","0",".000"]
["Colton Shaver","HOU - C","2691","0/0","0","0","0","0",".000"]
["Tyler Soderstrom","OAK - C,1B","2694","0/0","0","0","0","0",".000"]
["Luis Meza","TOR - C","2706","0/0","0","0","0","0",".000"]
["Adam Hackenberg","CWS - C","2715","0/0","0","0","0","0",".000"]
["Victor Mesia","TOR - C","2727","0/0","0","0","0","0",".000"]
["Antonio Gomez","NYY - C","2767","0/0","0","0","0","0",".000"]
["Carter Jensen","KC - C","2769","0/0","0","0","0","0",".000"]
["Harry Ford","SEA - C","2770","0/0","0","0","0","0",".000"]
["Edgar Quero","LAA - C","2855","0/0","0","0","0","0",".000"]
["Dominic Keegan","TB - C","2857","0/0","0","0","0","0",".000"]
["Samuel Basallo","BAL - C","2863","0/0","0","0","0","0",".000"]
["Deivy Grullón","TB - C","2888","0/1","0","0","0","0",".000"]
["Chris Rabago","DET - C","2890","0/0","0","0","0","0",".000"]
["Dillon Dingler","DET - C","2956","0/0","0","0","0","0",".000"]
["Luca Tresh","KC - C","2963","0/0","0","0","0","0",".000"]
["Gianpaul Gonzalez","CLE - C","2973","0/0","0","0","0","0",".000"]
["Nick Ciuffo","NYY - C","2990","0/2","0","0","0","0",".000"]
["Joseph Odom","TB - C","2992","0/0","0","0","0","0",".000"]
["Rob Brantly","TOR - C","3017","2/10","0","0","0","0",".000"]
["Donny Sands","DET - C","3032","0/2","0","0","0","0",".000"]
["Sandy León","TEX - C","3034","23/133","10","2","8","0",".000"]
["Chance Sisco","MIN - C","3048","14/69","7","2","6","0",".000"]
["Freddy Fermin","KC - C","3049","0/4","1","0","0","0",".000"]
["Tony Wolters","MIN - C,2B","3054","12/55","6","0","4","0",".000"]
["Andrew Knapp","DET - C","3055","19/100","10","2","12","0",".000"]
["Sebastian Rivero","CWS - C","3056","5/26","1","0","2","0",".000"]
["Bryan Lavastida","CLE - C","3065","1/6","0","0","0","0",".000"]
["José Godoy","LAA - C","3068","2/22","2","0","2","0",".000"]
["Anthony Bemboom","BAL - C","3073","9/57","7","2","3","0",".000"]
["Michael Papierski","DET - C","3074","8/46","4","1","2","0",".000"]

{"sheet":"1st Base","index":4,"n_rows":75,"n_cols":9,"rows_kept":75}
["Player","Team","Rank","H/AB","R","HR","RBI","SB","OBP"]
{"$rows_empty":11}
["Josh Naylor","CLE - 1B,OF","221","88/346","39","13","49","4",".299"]
["Seth Brown","OAK - 1B,OF","227","97/433","53","24","66","9",".287"]
[]
[]
[]
["Jared Walsh","LAA - 1B","282","82/325","39","16","50","2",".338"]
[]
["Alex Kirilloff","MIN - 1B,OF","296","102/417","43","12","64","0",".327"]
["Brandon Belt","TOR - 1B","309","78/302","45","18","45","2",".372"]
[]
["Harold Ramírez","TB - 1B,OF","322","91/319","35","5","43","3",".310"]
["Isaac Paredes","TB - 1B,2B,3B","341","49/235","29","11","27","0",".000"]
["Yuli Gurriel","HOU - 1B","393","158/536","80","20","83","2",".351"]
["Jesús Aguilar","OAK - 1B","499","117/466","50","19","72","1",".303"]
["Hunter Dozier","KC - 1B,3B,OF","627","106/464","57","14","44","5",".315"]
["Bobby Dalbec","BOS - 1B,3B","1420","77/334","43","18","53","2",".366"]
["Gavin Sheets","CWS - 1B,OF","1482","44/182","19","8","29","0",".318"]
[]
["Ben Gamel","TB - 1B,OF","1552","84/350","41","9","36","4",".332"]
["Aledmys Díaz","OAK - 1B,2B,3B,SS,OF","1659","104/416","45","15","56","2",".322"]
["Christian Bethancourt","TB - C,1B","1737","41/159","20","6","17","3",".000"]
["Donovan Solano","MIN - 1B,2B,3B","1834","96/327","33","6","35","1",".350"]
["Franchy Cordero","BAL - 1B,OF","1881","39/180","25","5","21","3",".000"]
["Cavan Biggio","TOR - 1B,2B,OF","1892","70/311","49","9","34","5",".353"]
["Matt Duffy","KC - 1B,2B,3B","1933","57/210","22","3","18","3",".341"]
["Colin Moran","SEA - 1B,3B","1937","58/241","28","10","39","0",".325"]
["Yu Chang","BOS - 1B,2B,SS","1991","37/168","21","5","21","0",".290"]
["Marwin Gonzalez","NYY - 1B,3B,SS,OF","2007","0/0","0","0","0","0",".000"]
["Andy Ibáñez","DET - 1B,3B","2010","37/144","17","3","13","2",".332"]
["Ryan O'Hearn","BAL - 1B,OF","2021","43/197","18","4","26","0",".301"]
["Dermis Garcia","OAK - 1B","2041","13/58","7","3","10","0",".000"]
["Nick Pratto","KC - 1B,OF","2049","16/79","9","4","10","0",".312"]
["Miguel Sanó","MIN - 1B","2051","103/455","75","33","76","1",".315"]
["Tyler Nevin","DET - 1B,3B","2083","17/83","10","1","9","0",".000"]
["Zack Collins","CLE - C,1B","2097","15/79","8","2","9","0",".327"]
["Yoshi Tsutsugo","TOR - 1B","2101","45/232","27","7","31","0",".322"]
["Matt Thaiss","LAA - C,1B","2103","9/46","6","1","4","1",".000"]
["Lewin Díaz","BAL - 1B","2115","24/138","12","5","11","1",".226"]
["Bobby Bradley","CLE - 1B","2117","81/366","53","20","64","0",".303"]
["Mitch Moreland","OAK - 1B","2124","0/0","0","0","0","0",".000"]
["J.J. Matijevic","HOU - 1B","2138","7/34","4","1","3","1",".000"]
["Mike Ford","SEA - 1B","2143","20/119","9","3","12","0",".277"]
["Jonathan Aranda","TB - 1B,2B,3B","2148","8/39","5","1","3","0",".000"]
["Bligh Madris","HOU - 1B,OF","2182","11/57","5","1","4","1",".000"]
["Taylor Jones","LAA - 1B","2189","10/44","5","1","7","0",".000"]
["Travis Shaw","BOS - 1B","2237","0/0","0","0","0","0",".000"]
["Greg Bird","TOR - 1B","2299","0/0","0","0","0","0",".000"]
["Aaron Sabato","MIN - 1B","2329","0/0","0","0","0","0",".000"]
["Brendan McKay (Batter)","TB - 1B","2330","0/0","0","0","0","0",".000"]
["Xavier Isaac","TB - 1B","2367","0/0","0","0","0","0",".000"]
["Kevin Cron","OAK - 1B,3B","2381","0/8","0","0","0","0",".000"]
["Wilfred Veras","CWS - 1B","2524","0/0","0","0","0","0",".000"]
["Ryan Noda","OAK - 1B,OF","2541","0/0","0","0","0","0",".000"]
["Niko Kavadas","BOS - 1B","2578","0/0","0","0","0","0",".000"]
["Eric Thames","OAK - 1B,OF","2596","68/303","37","13","40","0",".324"]
["Spencer Horwitz","TOR - 1B","2622","0/0","0","0","0","0",".000"]
["Robert Perez","SEA - 1B","2677","0/0","0","0","0","0",".000"]
["Tyler Soderstrom","OAK - C,1B","2694","0/0","0","0","0","0",".000"]
["Kyle Manzardo","TB - 1B","2768","0/0","0","0","0","0",".000"]
["Ryon Healy","TB - 1B,3B","2786","0/0","0","0","0","0",".000"]
["Tyler White","MIN - 1B","2827","0/0","0","0","0","0",".000"]
["Evan White","SEA - 1B","3018","19/114","11","4","15","0",".000"]
["Curtis Terry","BAL - 1B","3058","2/15","1","0","0","0",".000"]

{"sheet":"2nd Base","index":5,"n_rows":109,"n_cols":9,"rows_kept":109}
["Player","Team","Rank","H/AB","R","HR","RBI","SB","OBP"]
{"$rows_empty":11}
["Nick Gordon","MIN - 2B,SS,OF","289","106/402","44","9","49","9",".302"]
["Trevor Story","BOS - 2B","304","55/221","35","10","34","10",".310"]
["Isaac Paredes","TB - 1B,2B,3B","341","49/235","29","11","27","0",".000"]
["Tony Kemp","OAK - 2B,OF","351","100/400","55","6","37","10",".344"]
[]
[]
["Ramón Urías","BAL - 2B,3B","481","79/300","37","11","40","1",".348"]
[]
[]
["Nicky Lopez","KC - 2B,3B,SS","649","115/460","58","1","30","14",".307"]
["Willi Castro","MIN - 2B,SS,OF","682","48/189","26","5","20","4",".301"]
[]
[]
[]
["Aledmys Díaz","OAK - 1B,2B,3B,SS,OF","1659","104/416","45","15","56","2",".322"]
["Donovan Solano","MIN - 1B,2B,3B","1834","96/327","33","6","35","1",".350"]
["David Fletcher","LAA - 2B,SS","1868","112/410","49","3","32","6",".330"]
["Leury García","CWS - 2B,3B,SS,OF","1879","54/221","29","4","22","2",".325"]
["Cavan Biggio","TOR - 1B,2B,OF","1892","70/311","49","9","34","5",".353"]
["Taylor Walls","TB - 2B,3B,SS","1899","45/254","32","4","22","6",".322"]
["Mauricio Dubón","HOU - 2B,SS,OF","1922","59/250","32","6","28","3",".000"]
["Ezequiel Duran","TEX - 2B,3B","1928","26/104","13","3","13","2",".000"]
["Tyler Wade","OAK - 2B,3B,SS,OF","1929","34/155","30","2","10","11",".315"]
["Matt Duffy","KC - 1B,2B,3B","1933","57/210","22","3","18","3",".341"]
["Charlie Culberson","TB - 2B,3B,OF","1958","35/143","18","3","14","3",".000"]
["Mark Mathias","TEX - 2B","1968","15/57","7","3","12","2",".000"]
["Nick Maton","DET - 2B,OF","1974","19/75","12","3","13","1",".000"]
["Yu Chang","BOS - 1B,2B,SS","1991","37/168","21","5","21","0",".290"]
[]
["Hanser Alberto","CWS - 2B,3B","2003","69/257","31","3","25","2",".319"]
["Nick Allen","OAK - 2B,SS","2029","32/150","16","2","10","2",".276"]
["Terrin Vavra","BAL - 2B,OF","2062","13/45","7","1","6","0",".000"]
["Jack Mayfield","LAA - 2B,3B,OF","2064","30/143","16","4","17","2",".000"]
["Romy Gonzàlez","CWS - 2B","2065","16/63","9","1","6","0",".000"]
["Vidal Bruján","TB - 2B,OF","2086","14/82","8","2","9","3",".335"]
["Johan Camargo","KC - 2B,3B,SS","2091","28/135","12","3","12","0",".291"]
["Niko Goodrum","BOS - 2B","2107","36/189","21","5","21","8",".305"]
["Jonah Bride","OAK - 2B,3B","2146","17/81","9","1","3","1",".341"]
["Jonathan Aranda","TB - 1B,2B,3B","2148","8/39","5","1","3","0",".000"]
["Ernie Clement","OAK - 2B,3B,OF","2165","24/122","15","1","6","0",".000"]
["Shed Long Jr.","SEA - 2B","2188","0/0","0","0","0","0",".000"]
["Jordan Díaz","OAK - 2B","2209","7/25","2","0","1","0",".000"]
["Jermaine Palacios","DET - 2B,SS","2225","5/35","4","1","3","0",".000"]
["Daniel Robertson","TB - 2B,SS","2259","8/34","5","1","2","0",".000"]
["Iván Castillo","KC - 2B,3B","2277","0/1","0","0","0","0",".000"]
[]
["Juan Brito","CLE - 2B,SS","2354","0/0","0","0","0","0",".000"]
["Loidel Chapelli","CWS - 2B","2361","0/0","0","0","0","0",".000"]
["Nick Tanielu","TEX - 2B,3B","2370","0/0","0","0","0","0",".000"]
["Jace Jung","DET - 2B","2376","0/0","0","0","0","0",".000"]
["Alen Hanson","SEA - 2B,SS","2383","0/0","0","0","0","0",".000"]
["Michael Helman","MIN - 2B","2403","0/0","0","0","0","0",".000"]
["Edouard Julien","MIN - 2B","2426","0/0","0","0","0","0",".000"]
["Tyler McDonough","BOS - 2B,OF","2445","0/0","0","0","0","0",".000"]
["Cade Doughty","TOR - 2B,3B","2503","0/0","0","0","0","0",".000"]
["Eddinson Paulino","BOS - 2B","2532","0/0","0","0","0","0",".000"]
["Justin Foscue","TEX - 2B","2552","0/0","0","0","0","0",".000"]
["Eric Stamets","TOR - 2B,SS","2565","0/0","0","0","0","0",".000"]
["Yadiel Rivera","TEX - 2B,SS","2568","0/2","0","0","0","0",".000"]
["Adrian Placencia","LAA - 2B,SS","2585","0/0","0","0","0","0",".000"]
["Trevor Hauver","TEX - 2B,OF","2590","0/0","0","0","0","0",".000"]
["Jake Fox","CLE - 2B","2606","0/0","0","0","0","0",".000"]
["Ryan Goins","KC - 2B,SS","2610","0/4","2","0","0","0",".000"]
["Euribiel Angeles","OAK - 2B,SS","2612","0/0","0","0","0","0",".000"]
["Marco Hernández","CWS - 2B,3B","2614","0/0","0","0","0","0",".000"]
["Starlin Aguilar","SEA - 2B,3B","2623","0/0","0","0","0","0",".000"]
["Lizandro Rodriguez","KC - 2B","2626","0/0","0","0","0","0",".000"]
["Keithron Moss","TEX - 2B","2632","0/0","0","0","0","0",".000"]
["Connor Norby","BAL - 2B","2639","0/0","0","0","0","0",".000"]
["Thomas Saggese","TEX - 2B","2648","0/0","0","0","0","0",".000"]
["Angel Martinez","CLE - 2B,SS","2656","0/0","0","0","0","0",".000"]
["David Hamilton","BOS - 2B,SS","2669","0/0","0","0","0","0",".000"]
["Taylor Featherston","TB - 2B","2675","0/0","0","0","0","0",".000"]
["Enmanuel Valdez","BOS - 2B","2679","0/0","0","0","0","0",".000"]
["Wenceel Perez","DET - 2B","2708","0/0","0","0","0","0",".000"]
["Luke Gold","DET - 2B","2719","0/0","0","0","0","0",".000"]
["Alerick Soularie","MIN - 2B,OF","2756","0/0","0","0","0","0",".000"]
["Peyton Wilson","KC - 2B","2775","0/0","0","0","0","0",".000"]
["Kaden Polcovich","SEA - 2B","2788","0/0","0","0","0","0",".000"]
["José Tena","CLE - 2B,SS","2836","0/0","0","0","0","0",".000"]
["Tanner Morris","TOR - 2B,SS","2873","0/0","0","0","0","0",".000"]
["Cooper Kinney","TB - 2B","2886","0/0","0","0","0","0",".000"]
["Cooper Bowman","OAK - 2B","2894","0/0","0","0","0","0",".000"]
["Brayan Rocchio","CLE - 2B,SS","2911","0/0","0","0","0","0",".000"]
["Yunior Severino","MIN - 2B","2929","0/0","0","0","0","0",".000"]
["Zack Gelof","OAK - 2B","2949","0/0","0","0","0","0",".000"]
["Nick Yorke","BOS - 2B","2955","0/0","0","0","0","0",".000"]
["Bryan Ramos","CWS - 2B,3B","2962","0/0","0","0","0","0",".000"]
["Samad Taylor","KC - 2B,OF","2966","0/0","0","0","0","0",".000"]
["Derek Dietrich","NYY - 2B,OF","2975","0/0","0","0","0","0",".000"]
["Shay Whitcomb","HOU - 2B,SS","2976","0/0","0","0","0","0",".000"]
["Jack López","DET - 2B","2991","1/4","1","0","0","0",".000"]
["Kean Wong","SEA - 2B","3019","3/20","1","0","2","0",".000"]
["Nate Mondou","CWS - 2B","3021","0/0","0","0","0","0",".000"]
["Michael Stefanic","LAA - 2B","3047","6/31","3","0","0","0",".000"]
["Tony Wolters","MIN - C,2B","3054","12/55","6","0","4","0",".000"]
["Christian Lopes","OAK - 2B,OF","3067","0/5","0","0","0","0",".000"]

{"sheet":"3rd Base","index":6,"n_rows":109,"n_cols":9,"rows_kept":109}
["Player","Team","Rank","H/AB","R","HR","RBI","SB","OBP"]
{"$rows_empty":17}
["Isaac Paredes","TB - 1B,2B,3B","341","49/235","29","11","27","0",".000"]
["Kyle Farmer","MIN - 3B,SS","372","88/340","38","9","47","2",".310"]
["Gio Urshela","LAA - 3B","374","129/458","55","14","62","1",".330"]
["Josh Donaldson","NYY - 3B","425","99/428","60","19","60","1",".364"]
[]
["Ramón Urías","BAL - 2B,3B","481","79/300","37","11","40","1",".348"]
[]
["Jace Peterson","OAK - 3B,OF","589","59/251","37","7","30","10",".322"]
["Hunter Dozier","KC - 1B,3B,OF","627","106/464","57","14","44","5",".315"]
["Nicky Lopez","KC - 2B,3B,SS","649","115/460","58","1","30","14",".307"]
["Bobby Dalbec","BOS - 1B,3B","1420","77/334","43","18","53","2",".366"]
[]
["Aledmys Díaz","OAK - 1B,2B,3B,SS,OF","1659","104/416","45","15","56","2",".322"]
["Matt Vierling","DET - 3B,OF","1741","48/186","24","4","18","4",".292"]
["Donovan Solano","MIN - 1B,2B,3B","1834","96/327","33","6","35","1",".350"]
["Brad Miller","TEX - 3B,OF","1840","62/285","37","13","44","3",".298"]
["Leury García","CWS - 2B,3B,SS,OF","1879","54/221","29","4","22","2",".325"]
["Taylor Walls","TB - 2B,3B,SS","1899","45/254","32","4","22","6",".322"]
["Jake Burger","CWS - 3B","1920","25/97","12","4","14","0",".336"]
["Ezequiel Duran","TEX - 2B,3B","1928","26/104","13","3","13","2",".000"]
["Tyler Wade","OAK - 2B,3B,SS,OF","1929","34/155","30","2","10","11",".315"]
["Matt Duffy","KC - 1B,2B,3B","1933","57/210","22","3","18","3",".341"]
["Colin Moran","SEA - 1B,3B","1937","58/241","28","10","39","0",".325"]
["Nate Eaton","KC - 3B,OF","1938","15/53","8","1","6","6",".333"]
["Charlie Culberson","TB - 2B,3B,OF","1958","35/143","18","3","14","3",".000"]
["Hanser Alberto","CWS - 2B,3B","2003","69/257","31","3","25","2",".319"]
["Marwin Gonzalez","NYY - 1B,3B,SS,OF","2007","0/0","0","0","0","0",".000"]
["Andy Ibáñez","DET - 1B,3B","2010","37/144","17","3","13","2",".332"]
["Josh Smith","TEX - 3B,SS,OF","2058","22/107","12","1","8","2",".360"]
["Jack Mayfield","LAA - 2B,3B,OF","2064","30/143","16","4","17","2",".000"]
["Tyler Nevin","DET - 1B,3B","2083","17/83","10","1","9","0",".000"]
["Johan Camargo","KC - 2B,3B,SS","2091","28/135","12","3","12","0",".291"]
["Kevin Smith","OAK - 3B,SS","2131","14/80","5","1","7","2",".298"]
["Gabriel Arias","CLE - 3B","2135","6/24","5","1","3","1",".000"]
["Tyler Freeman","CLE - 3B,SS","2136","10/39","5","0","2","1",".000"]
["Jonah Bride","OAK - 2B,3B","2146","17/81","9","1","3","1",".341"]
["Jonathan Aranda","TB - 1B,2B,3B","2148","8/39","5","1","3","0",".000"]
["Kelvin Gutiérrez","BAL - 3B","2163","72/300","30","6","32","0",".294"]
["Ernie Clement","OAK - 2B,3B,OF","2165","24/122","15","1","6","0",".000"]
["Ryan Kreidler","DET - 3B,SS","2198","8/37","4","1","3","0",".000"]
["Drew Ellis","SEA - 3B","2273","4/31","4","0","2","0",".000"]
["Iván Castillo","KC - 2B,3B","2277","0/1","0","0","0","0",".000"]
["Cayden Wallace","KC - 3B","2289","0/0","0","0","0","0",".000"]
["Damiano Palmegiani","TOR - 3B","2300","0/0","0","0","0","0",".000"]
["Colt Keith","DET - 3B","2333","0/0","0","0","0","0",".000"]
[]
["Tyler Keenan","SEA - 3B","2346","0/0","0","0","0","0",".000"]
["Zach Green","SEA - 3B","2353","0/0","0","0","0","0",".000"]
["Tucker Toman","TOR - 3B","2368","0/0","0","0","0","0",".000"]
["Nick Tanielu","TEX - 2B,3B","2370","0/0","0","0","0","0",".000"]
["Kevin Cron","OAK - 1B,3B","2381","0/8","0","0","0","0",".000"]
["Addison Barger","TOR - 3B,SS","2417","0/0","0","0","0","0",".000"]
["Willy Vasquez","TB - 3B","2424","0/0","0","0","0","0",".000"]
["Brett Harris","OAK - 3B","2432","0/0","0","0","0","0",".000"]
["Blaze Jordan","BOS - 3B","2462","0/0","0","0","0","0",".000"]
["Rubén Tejada","TOR - 3B,SS","2493","0/0","0","0","0","0",".000"]
["Cade Doughty","TOR - 2B,3B","2503","0/0","0","0","0","0",".000"]
["Gage Workman","DET - 3B,SS","2537","0/0","0","0","0","0",".000"]
["Izaac Pacheco","DET - 3B,SS","2554","0/0","0","0","0","0",".000"]
["Jake Rucker","MIN - 3B","2561","0/0","0","0","0","0",".000"]
["Seth Mejias-Brean","BAL - 3B,SS","2579","0/0","0","0","0","0",".000"]
["Sherten Apostel","TEX - 3B","2586","0/9","0","0","0","0",".000"]
["Alex Binelas","BOS - 3B","2608","0/0","0","0","0","0",".000"]
["Marco Hernández","CWS - 2B,3B","2614","0/0","0","0","0","0",".000"]
["Starlin Aguilar","SEA - 2B,3B","2623","0/0","0","0","0","0",".000"]
["Austin Shenton","TB - 3B","2641","0/0","0","0","0","0",".000"]
["Davis Wendzel","TEX - 3B","2646","0/0","0","0","0","0",".000"]
["Cesar Prieto","BAL - 3B","2704","0/0","0","0","0","0",".000"]
["Kaleb Cowart","NYY - 3B","2723","0/0","0","0","0","0",".000"]
["Jake Gatewood","LAA - 3B","2778","0/0","0","0","0","0",".000"]
["Osleivis Basabe","TB - 3B,SS","2782","0/0","0","0","0","0",".000"]
["Ryon Healy","TB - 1B,3B","2786","0/0","0","0","0","0",".000"]
["Milkar Perez","SEA - 3B","2791","0/0","0","0","0","0",".000"]
["Jonathan Ornelas","TEX - 3B","2803","0/0","0","0","0","0",".000"]
["Andrew Bechtold","MIN - 3B","2821","0/0","0","0","0","0",".000"]
["Wes Keith","CWS - 3B","2852","0/0","0","0","0","0",".000"]
["Jhonkensy Noel","CLE - 3B,OF","2859","0/0","0","0","0","0",".000"]
["Tyler Locklear","SEA - 3B","2887","0/0","0","0","0","0",".000"]
["Miguel Hiraldo","TOR - 3B","2895","0/0","0","0","0","0",".000"]
["Jose Gomez","LAA - 3B","2904","0/0","0","0","0","0",".000"]
["Junior Caminero","TB - 3B","2912","0/0","0","0","0","0",".000"]
["Coby Mayo","BAL - 3B","2924","0/0","0","0","0","0",".000"]
["Andre Lipcius","DET - 3B","2941","0/0","0","0","0","0",".000"]
["Elliot Soto","MIN - 3B,SS","2951","0/3","1","0","0","0",".000"]
["Bryan Ramos","CWS - 2B,3B","2962","0/0","0","0","0","0",".000"]
["Wes Kath","CWS - 3B","2965","0/0","0","0","0","0",".000"]
["Jacob Wilson","HOU - 3B","2988","0/0","0","0","0","0",".000"]
["Joe Perez","HOU - 3B","2998","0/0","0","0","0","0",".000"]
["Ryan Dorow","TEX - 3B,SS","3014","0/2","0","0","0","0",".000"]
["Josh Lester","BAL - 3B","3050","0/3","0","0","0","0",".000"]
["Kevin Padlo","LAA - 3B","3075","3/21","0","0","2","0",".000"]

{"sheet":"Short Stop","index":7,"n_rows":165,"n_cols":9,"rows_kept":165}
["Player","Team","Rank","H/AB","R","HR","RBI","SB","OBP"]
{"$rows_empty":13}
["Jorge Mateo","BAL - SS","268","73/323","40","8","31","21",".299"]
[]
[]
["Nick Gordon","MIN - 2B,SS,OF","289","106/402","44","9","49","9",".302"]
[]
["Elvis Andrus","CWS - SS","363","117/480","58","11","44","14",".299"]
["Kyle Farmer","MIN - 3B,SS","372","88/340","38","9","47","2",".310"]
[]
["J.P. Crawford","SEA - SS","509","142/557","73","7","50","5",".332"]
[]
["Nicky Lopez","KC - 2B,3B,SS","649","115/460","58","1","30","14",".307"]
["Willi Castro","MIN - 2B,SS,OF","682","48/189","26","5","20","4",".301"]
[]
[]
["Aledmys Díaz","OAK - 1B,2B,3B,SS,OF","1659","104/416","45","15","56","2",".322"]
["Andrew Velazquez","LAA - SS","1804","24/117","15","3","9","7",".000"]
["David Fletcher","LAA - 2B,SS","1868","112/410","49","3","32","6",".330"]
["Leury García","CWS - 2B,3B,SS,OF","1879","54/221","29","4","22","2",".325"]
["Taylor Walls","TB - 2B,3B,SS","1899","45/254","32","4","22","6",".322"]
["Mauricio Dubón","HOU - 2B,SS,OF","1922","59/250","32","6","28","3",".000"]
["Tyler Wade","OAK - 2B,3B,SS,OF","1929","34/155","30","2","10","11",".315"]
["Yu Chang","BOS - 1B,2B,SS","1991","37/168","21","5","21","0",".290"]
["Marwin Gonzalez","NYY - 1B,3B,SS,OF","2007","0/0","0","0","0","0",".000"]
["Livan Soto","LAA - SS","2028","13/28","5","1","5","1",".000"]
["Nick Allen","OAK - 2B,SS","2029","32/150","16","2","10","2",".276"]
["Josh Smith","TEX - 3B,SS,OF","2058","22/107","12","1","8","2",".360"]
["Johan Camargo","KC - 2B,3B,SS","2091","28/135","12","3","12","0",".291"]
["Royce Lewis","MIN - SS","2110","6/20","3","1","3","0",".284"]
["Kevin Smith","OAK - 3B,SS","2131","14/80","5","1","7","2",".298"]
["Tyler Freeman","CLE - 3B,SS","2136","10/39","5","0","2","1",".000"]
["Otto Lopez","TOR - SS","2155","3/5","0","0","2","0",".000"]
["Ryan Kreidler","DET - 3B,SS","2198","8/37","4","1","3","0",".000"]
["Maikel Garcia","KC - SS","2199","4/11","1","0","1","0",".000"]
["Jermaine Palacios","DET - 2B,SS","2225","5/35","4","1","3","0",".000"]
["Daniel Robertson","TB - 2B,SS","2259","8/34","5","1","2","0",".000"]
["Angel Genao","CLE - SS","2291","0/0","0","0","0","0",".000"]
["Roderick Arias","NYY - SS","2307","0/0","0","0","0","0",".000"]
["Luis Curbelo","CWS - SS","2310","0/0","0","0","0","0",".000"]
["Laz Rivera","CWS - SS","2317","0/0","0","0","0","0",".000"]
["Jose Salas","MIN - SS","2339","0/0","0","0","0","0",".000"]
["Trey Sweeney","NYY - SS","2344","0/0","0","0","0","0",".000"]
["Alexander Vargas","NYY - SS","2350","0/0","0","0","0","0",".000"]
["Juan Brito","CLE - 2B,SS","2354","0/0","0","0","0","0",".000"]
["Kyren Paris","LAA - SS","2362","0/0","0","0","0","0",".000"]
["Leonardo Rivas","SEA - SS","2363","0/0","0","0","0","0",".000"]
["Max Muncy","OAK - SS","2372","0/0","0","0","0","0",".000"]
["Adam Hall","BAL - SS","2374","0/0","0","0","0","0",".000"]
["Alen Hanson","SEA - 2B,SS","2383","0/0","0","0","0","0",".000"]
["Darell Hernaiz","OAK - SS","2385","0/0","0","0","0","0",".000"]
["Cole Young","SEA - SS","2390","0/0","0","0","0","0",".000"]
["Martin Gonzalez","SEA - SS","2399","0/0","0","0","0","0",".000"]
["Carter Young","BAL - SS","2400","0/0","0","0","0","0",".000"]
["Jordan Westburg","BAL - SS","2406","0/0","0","0","0","0",".000"]
["Maikol Hernandez","BAL - SS","2411","0/0","0","0","0","0",".000"]
["Juan Querecuto","SEA - SS","2412","0/0","0","0","0","0",".000"]
["Addison Barger","TOR - 3B,SS","2417","0/0","0","0","0","0",".000"]
["Cutter Coffey","BOS - SS","2427","0/0","0","0","0","0",".000"]
[]
["Noah Miller","MIN - SS","2443","0/0","0","0","0","0",".000"]
["Maximo Acosta","TEX - SS","2448","0/0","0","0","0","0",".000"]
["Orelvis Martinez","TOR - SS","2450","0/0","0","0","0","0",".000"]
["Carlos Colmenares","TB - SS","2455","0/0","0","0","0","0",".000"]
["Luis García","DET - SS","2457","0/0","0","0","0","0",".000"]
["Rikelbin De Castro","TOR - SS","2468","0/0","0","0","0","0",".000"]
["Josè Rodriguez","CWS - SS","2470","0/0","0","0","0","0",".000"]
["Luis Ravelo","BOS - SS","2477","0/0","0","0","0","0",".000"]
["Shervyen Newton","KC - SS","2483","0/0","0","0","0","0",".000"]
["Abel Bastidas","DET - SS","2485","0/0","0","0","0","0",".000"]
["Frederick Bencosme","BAL - SS","2490","0/0","0","0","0","0",".000"]
["Adrian Pinto","TOR - SS","2492","0/0","0","0","0","0",".000"]
["Rubén Tejada","TOR - 3B,SS","2493","0/0","0","0","0","0",".000"]
["Denzer Guzman","LAA - SS","2504","0/0","0","0","0","0",".000"]
["Alexander Campos","OAK - SS","2505","0/0","0","0","0","0",".000"]
["Danny De Andrade","MIN - SS","2511","0/0","0","0","0","0",".000"]
["Robert Puason","OAK - SS","2513","0/0","0","0","0","0",".000"]
["Josh Hood","SEA - SS","2516","0/0","0","0","0","0",".000"]
["Milan Tolentino","CLE - SS","2530","0/0","0","0","0","0",".000"]
["Marcelo Mayer","BOS - SS","2535","0/0","0","0","0","0",".000"]
["Gage Workman","DET - 3B,SS","2537","0/0","0","0","0","0",".000"]
["Izaac Pacheco","DET - 3B,SS","2554","0/0","0","0","0","0",".000"]
["Chandler Simpson","TB - SS","2563","0/0","0","0","0","0",".000"]
["Eric Stamets","TOR - 2B,SS","2565","0/0","0","0","0","0",".000"]
["Yadiel Rivera","TEX - 2B,SS","2568","0/2","0","0","0","0",".000"]
["Grae Kessinger","HOU - SS","2573","0/0","0","0","0","0",".000"]
["Kevin Maitan","LAA - SS","2575","0/0","0","0","0","0",".000"]
["Seth Mejias-Brean","BAL - 3B,SS","2579","0/0","0","0","0","0",".000"]
["Cristian Gonzalez","HOU - SS","2582","0/0","0","0","0","0",".000"]
["Adrian Placencia","LAA - 2B,SS","2585","0/0","0","0","0","0",".000"]
["Peyton Graham","DET - SS","2602","0/0","0","0","0","0",".000"]
["Austin Charles","KC - SS","2607","0/0","0","0","0","0",".000"]
["Raynel Delgado","CLE - SS","2609","0/0","0","0","0","0",".000"]
["Ryan Goins","KC - 2B,SS","2610","0/4","2","0","0","0",".000"]
["Euribiel Angeles","OAK - 2B,SS","2612","0/0","0","0","0","0",".000"]
["Gleider Figuereo","TEX - SS","2613","0/0","0","0","0","0",".000"]
["Daniel Vazquez","KC - SS","2619","0/0","0","0","0","0",".000"]
["Trei Cruz","DET - SS","2631","0/0","0","0","0","0",".000"]
["Ryan Burrowes","CWS - SS","2635","0/0","0","0","0","0",".000"]
["Christian Koss","BOS - SS","2638","0/0","0","0","0","0",".000"]
["Angel Martinez","CLE - 2B,SS","2656","0/0","0","0","0","0",".000"]
["David Hamilton","BOS - 2B,SS","2669","0/0","0","0","0","0",".000"]
["Estiven Machado","TOR - SS","2671","0/0","0","0","0","0",".000"]
["Brooks Lee","MIN - SS","2682","0/0","0","0","0","0",".000"]
["Colson Montgomery","CWS - SS","2684","0/0","0","0","0","0",".000"]
["Freudis Nova","HOU - SS","2687","0/0","0","0","0","0",".000"]
["Leo Jimenez","TOR - SS","2689","0/0","0","0","0","0",".000"]
["Carson Tucker","CLE - SS","2695","0/0","0","0","0","0",".000"]
["Jordan Sprinkle","CWS - SS","2701","0/0","0","0","0","0",".000"]
["Brainer Bonaci","BOS - SS","2702","0/0","0","0","0","0",".000"]
["Zach Neto","LAA - SS","2731","0/0","0","0","0","0",".000"]
["Jeison Guzmán","KC - SS","2740","0/0","0","0","0","0",".000"]
["Manuel Sequera","DET - SS","2752","0/0","0","0","0","0",".000"]
["Will Holland","MIN - SS","2765","0/0","0","0","0","0",".000"]
["Danyer Cueva","TEX - SS","2773","0/0","0","0","0","0",".000"]
["Javier Osorio","DET - SS","2779","0/0","0","0","0","0",".000"]
["Arol Vera","LAA - SS","2780","0/0","0","0","0","0",".000"]
["Osleivis Basabe","TB - 3B,SS","2782","0/0","0","0","0","0",".000"]
["Josh Kasevich","TOR - SS","2792","0/0","0","0","0","0",".000"]
["Ryan Spikes","TB - SS","2796","0/0","0","0","0","0",".000"]
["Aaron Bracho","CLE - SS","2798","0/0","0","0","0","0",".000"]
["Carson Williams","TB - SS","2809","0/0","0","0","0","0",".000"]
["Jeremiah Jackson","LAA - SS","2818","0/0","0","0","0","0",".000"]
["Mikey Romero","BOS - SS","2824","0/0","0","0","0","0",".000"]
["José Tena","CLE - 2B,SS","2836","0/0","0","0","0","0",".000"]
["Greg Jones","TB - SS","2849","0/0","0","0","0","0",".000"]
["Cam Cauley","TEX - SS","2853","0/0","0","0","0","0",".000"]
["Luisangel Acuna","TEX - SS","2865","0/0","0","0","0","0",".000"]
["Tanner Schobel","MIN - SS","2869","0/0","0","0","0","0",".000"]
["Tanner Morris","TOR - 2B,SS","2873","0/0","0","0","0","0",".000"]
["Werner Blakely","LAA - SS","2874","0/0","0","0","0","0",".000"]
["Brady McConnell","KC - SS","2881","0/0","0","0","0","0",".000"]
["Gabriel Rodriguez","CLE - SS","2883","0/0","0","0","0","0",".000"]
["Yordys Valdes","CLE - SS","2884","0/0","0","0","0","0",".000"]
["Anthony Volpe","NYY - SS","2896","0/0","0","0","0","0",".000"]
["Nick Loftin","KC - SS","2909","0/0","0","0","0","0",".000"]
["Brayan Rocchio","CLE - 2B,SS","2911","0/0","0","0","0","0",".000"]
["Matt Lugo","BOS - SS","2913","0/0","0","0","0","0",".000"]
["Michael Arroyo","SEA - SS","2915","0/0","0","0","0","0",".000"]
["Joey Ortiz","BAL - SS","2923","0/0","0","0","0","0",".000"]
["Logan Davidson","OAK - SS","2928","0/0","0","0","0","0",".000"]
["Jeremy Eierman","OAK - SS","2932","0/0","0","0","0","0",".000"]
["Yolbert Sanchez","CWS - SS","2939","0/0","0","0","0","0",".000"]
["Manuel Beltre","TOR - SS","2948","0/0","0","0","0","0",".000"]
["Cristian Santana","DET - SS","2950","0/0","0","0","0","0",".000"]
["Elliot Soto","MIN - 3B,SS","2951","0/3","1","0","0","0",".000"]
["Alika Williams","TB - SS","2961","0/0","0","0","0","0",".000"]
["Keoni Cavaco","MIN - SS","2968","0/0","0","0","0","0",".000"]
["Shay Whitcomb","HOU - 2B,SS","2976","0/0","0","0","0","0",".000"]
["Cadyn Grenier","BAL - SS","2981","0/0","0","0","0","0",".000"]
["Dixon Machado","HOU - SS","3010","2/8","1","0","0","0",".000"]
["Ryan Dorow","TEX - 3B,SS","3014","0/2","0","0","0","0",".000"]
["Lenyn Sosa","CWS - SS","3061","3/18","2","1","1","0",".000"]

{"sheet":"Outfield","index":8,"n_rows":302,"n_cols":9,"rows_kept":302}
["Player","Team","Rank","H/AB","R","HR","RBI","SB","OBP"]
{"$rows_empty":26}
["Andrew Benintendi","CWS - OF","185","117/412","50","8","50","7",".340"]
[]
[]
[]
["Josh Naylor","CLE - 1B,OF","221","88/346","39","13","49","4",".299"]
["Seth Brown","OAK - 1B,OF","227","97/433","53","24","66","9",".287"]
[]
[]
[]
["Manuel Margot","TB - OF","265","99/374","45","6","47","13",".316"]
["Nick Gordon","MIN - 2B,SS,OF","289","106/402","44","9","49","9",".302"]
[]
["Alex Kirilloff","MIN - 1B,OF","296","102/417","43","12","64","0",".327"]
[]
["Jose Siri","TB - OF","320","37/166","30","5","15","8",".273"]
["Harold Ramírez","TB - 1B,OF","322","91/319","35","5","43","3",".310"]
["Leody Taveras","TEX - OF","327","62/269","33","5","23","12",".311"]
["Michael Brantley","HOU - OF","328","106/354","47","7","39","2",".364"]
[]
["Edward Olivares","KC - OF","330","41/157","21","5","16","2",".000"]
["Bubba Thompson","TEX - OF","331","24/85","9","1","5","9",".285"]
[]
["Max Kepler","MIN - OF","340","92/413","59","15","50","6",".319"]
[]
["Chas McCormick","HOU - OF","349","100/397","57","17","57","4",".318"]
["Tony Kemp","OAK - 2B,OF","351","100/400","55","6","37","10",".344"]
["AJ Pollock","SEA - OF","385","122/461","62","21","66","5",".306"]
["Raimel Tapia","BOS - OF","399","125/451","58","6","50","14",".324"]
[]
["Michael A. Taylor","MIN - OF","477","76/307","37","8","35","5",".290"]
[]
[]
[]
["Franmil Reyes","KC - OF","532","110/453","53","21","67","2",".294"]
["Rafael Ortega","NYY - OF","564","67/257","32","7","29","10",".326"]
["Jace Peterson","OAK - 3B,OF","589","59/251","37","7","30","10",".322"]
["Hunter Dozier","KC - 1B,3B,OF","627","106/464","57","14","44","5",".315"]
["Robbie Grossman","TEX - OF","643","106/466","60","15","55","13",".316"]
["Willi Castro","MIN - 2B,SS,OF","682","48/189","26","5","20","4",".301"]
[]
[]
["Gavin Sheets","CWS - 1B,OF","1482","44/182","19","8","29","0",".318"]
[]
["Ben Gamel","TB - 1B,OF","1552","84/350","41","9","36","4",".332"]
["Aledmys Díaz","OAK - 1B,2B,3B,SS,OF","1659","104/416","45","15","56","2",".322"]
["Aaron Hicks","NYY - OF","1682","66/304","44","8","34","7",".340"]
["Matt Vierling","DET - 3B,OF","1741","48/186","24","4","18","4",".292"]
["Sam Haggerty","SEA - OF","1765","34/139","23","4","16","10",".305"]
[]
["Akil Baddoo","DET - OF","1827","55/238","35","5","23","11",".255"]
["Brad Miller","TEX - 3B,OF","1840","62/285","37","13","44","3",".298"]
["Victor Reyes","CWS - OF","1851","84/318","36","5","31","6",".305"]
["Rob Refsnyder","BOS - OF","1859","51/184","28","5","20","1",".000"]
["Kole Calhoun","SEA - OF","1869","71/335","39","15","48","2",".288"]
["Kyle Isbel","KC - OF","1876","35/153","21","3","16","5",".300"]
["Leury García","CWS - 2B,3B,SS,OF","1879","54/221","29","4","22","2",".325"]
["Franchy Cordero","BAL - 1B,OF","1881","39/180","25","5","21","3",".000"]
["Cavan Biggio","TOR - 1B,2B,OF","1892","70/311","49","9","34","5",".353"]
["Jo Adell","LAA - OF","1898","38/176","16","5","19","2",".300"]
["Mauricio Dubón","HOU - 2B,SS,OF","1922","59/250","32","6","28","3",".000"]
["Kyle Garlick","MIN - OF","1927","27/118","17","6","14","0",".000"]
["Tyler Wade","OAK - 2B,3B,SS,OF","1929","34/155","30","2","10","11",".315"]
["Nate Eaton","KC - 3B,OF","1938","15/53","8","1","6","6",".333"]
["Jarren Duran","BOS - OF","1948","78/359","44","5","31","10",".297"]
["Trevor Larnach","MIN - OF","1952","60/251","32","8","27","0",".330"]
["Gilberto Celestino","MIN - OF","1955","41/175","17","2","13","2",".000"]
["Charlie Culberson","TB - 2B,3B,OF","1958","35/143","18","3","14","3",".000"]
["Brett Phillips","LAA - OF","1960","36/208","32","8","24","11",".272"]
["Nick Maton","DET - 2B,OF","1974","19/75","12","3","13","1",".000"]
["Jackie Bradley Jr.","KC - OF","1975","81/387","42","7","39","6",".311"]
["Nomar Mazara","BAL - OF","1997","46/196","18","2","22","0",".000"]
["Billy Hamilton","CWS - OF","1999","12/67","19","1","5","11",".000"]
["Jake Meyers","HOU - OF","2005","31/124","14","3","17","2",".000"]
["Marwin Gonzalez","NYY - 1B,3B,SS,OF","2007","0/0","0","0","0","0",".000"]
["Ryan McKenna","BAL - OF","2015","29/134","18","2","10","1",".000"]
["Greg Allen","BOS - OF","2018","27/137","21","2","10","12",".256"]
["Drew Waters","KC - OF","2019","46/192","28","9","36","3",".000"]
["Ryan O'Hearn","BAL - 1B,OF","2021","43/197","18","4","26","0",".301"]
["Kerry Carpenter","DET - OF","2026","107/395","61","20","38","0",".000"]
["Josh Lowe","TB - OF","2027","20/91","12","1","7","2",".333"]
["Taylor Trammell","SEA - OF","2039","19/103","15","5","11","2",".000"]
["Jake Marisnick","CWS - OF","2042","27/112","13","4","13","2",".000"]
["Conner Capel","OAK - OF","2046","9/26","4","2","6","1",".328"]
["Nick Pratto","KC - 1B,OF","2049","16/79","9","4","10","0",".312"]
["Will Brennan","CLE - OF","2056","85/314","39","6","43","12",".000"]
["Josh Smith","TEX - 3B,SS,OF","2058","22/107","12","1","8","2",".360"]
["Roman Quinn","CLE - OF","2059","22/105","16","1","7","9",".000"]
["Jonathan Davis","DET - OF","2060","16/79","13","1","6","5",".000"]
["Terrin Vavra","BAL - 2B,OF","2062","13/45","7","1","6","0",".000"]
["Jack Mayfield","LAA - 2B,3B,OF","2064","30/143","16","4","17","2",".000"]
["Kyle Stowers","BAL - OF","2066","104/368","59","15","55","3",".311"]
["Jake Lamb","LAA - OF","2067","28/136","18","5","14","0",".000"]
["Cooper Hummel","SEA - C,OF","2068","17/88","10","2","9","2",".000"]
["Daz Cameron","BAL - OF","2070","19/92","10","2","10","3",".000"]
["Lewis Brinson","HOU - OF","2071","0/0","0","0","0","0",".000"]
["JJ Bleday","OAK - OF","2077","18/102","11","3","8","2",".000"]
["Travis Jankowski","TEX - OF","2079","16/78","15","0","4","4",".000"]
["Wynton Bernard","TOR - OF","2082","7/21","5","0","2","2",".000"]
["Vidal Bruján","TB - 2B,OF","2086","14/82","8","2","9","3",".335"]
["Brett Gardner","NYY - OF","2092","0/0","0","0","0","0",".000"]
["Justin Upton","LAA - OF","2099","57/275","41","15","41","2",".295"]
["Matt Beaty","KC - OF","2106","25/112","18","3","16","1",".316"]
["Matt Wallner","MIN - OF","2111","7/29","2","1","5","1",".000"]
["DJ Peters","DET - OF","2116","14/74","10","4","13","1",".000"]
["Richie Palacios","CLE - OF","2120","13/56","4","0","5","1",".000"]
["Luis Barrera","LAA - OF","2121","11/41","2","1","4","2",".000"]
["Juan Lagares","LAA - OF","2133","0/0","0","0","0","0",".000"]
["Mickey Moniak","LAA - OF","2145","13/70","9","2","5","1",".000"]
["Clint Frazier","TEX - OF","2154","30/138","19","5","17","3",".332"]
["Mark Contreras","MIN - OF","2158","5/29","5","2","3","1",".000"]
["Jarrod Dyson","TOR - OF","2159","0/0","0","0","0","0",".000"]
["Jake Bauers","NYY - OF","2160","19/94","9","1","6","2",".000"]
["Ernie Clement","OAK - 2B,3B,OF","2165","24/122","15","1","6","0",".000"]
["Danny Santana","BOS - OF","2177","10/63","8","2","8","2",".000"]
["Bligh Madris","HOU - 1B,OF","2182","11/57","5","1","4","1",".000"]
["Luke Raley","TB - OF","2183","10/53","5","1","3","0",".000"]
["Dairon Blanco","KC - OF","2194","0/0","0","0","0","0",".000"]
["Adam Haseley","CWS - OF","2202","14/53","6","0","7","0",".000"]
["Billy McKinney","NYY - OF","2217","21/116","13","4","11","1",".000"]
["Estevan Florial","NYY - OF","2222","4/24","3","0","1","1",".000"]
["Brent Rooker","OAK - OF","2223","17/88","11","3","9","0",".000"]
["Brendon Davis","DET - OF","2224","1/5","1","0","0","1",".000"]
["Cristian Pache","OAK - OF","2227","23/143","11","2","10","1",".268"]
["Narciso Crook","BOS - OF","2229","2/4","1","0","1","0",".000"]
["Ryan LaMarre","MIN - OF","2231","2/7","1","1","1","0",".000"]
["Elier Hernandez","TEX - OF","2236","3/17","2","0","2","0",".000"]
["JaCoby Jones","KC - OF","2243","0/0","0","0","0","0",".000"]
["Vinny Capra","TOR - OF","2246","1/3","1","0","0","0",".000"]
["Dexter Fowler","LAA - OF","2247","0/0","0","0","0","0",".000"]
["Cody Thomas","OAK - OF","2252","4/15","1","0","0","0",".000"]
["Jared Oliva","LAA - OF","2255","4/21","1","0","1","1",".000"]
["Marcus Wilson","BOS - OF","2266","1/3","1","0","0","0",".000"]
["Michael Hermosillo","NYY - OF","2269","7/46","5","1","5","1",".000"]
["Derek Fisher","MIN - OF","2272","0/0","0","0","0","0",".000"]
["Michael Lorenzen (Batter)","DET - OF","2286","0/0","0","0","0","0",".000"]
["Gabriel Martinez","TOR - OF","2288","0/0","0","0","0","0",".000"]
["Dylan Beavers","BAL - OF","2290","0/0","0","0","0","0",".000"]
["Alex McKenna","HOU - OF","2296","0/0","0","0","0","0",".000"]
["David Calabrese","LAA - OF","2298","0/0","0","0","0","0",".000"]
["Miguel Bleis","BOS - OF","2306","0/0","0","0","0","0",".000"]
["Aaron Zavala","TEX - OF","2308","0/0","0","0","0","0",".000"]
["Junior Perez","OAK - OF","2309","0/0","0","0","0","0",".000"]
["Yasser Mercedes","MIN - OF","2320","0/0","0","0","0","0",".000"]
["Alejandro Osuna","TEX - OF","2321","0/0","0","0","0","0",".000"]
["Yeison Morrobel","TEX - OF","2326","0/0","0","0","0","0",".000"]
["Ryan Clifford","HOU - OF","2334","0/0","0","0","0","0",".000"]
["Victor Labrada","SEA - OF","2341","0/0","0","0","0","0",".000"]
["Benyamin Bailey","CWS - OF","2373","0/0","0","0","0","0",".000"]
["George Valera","CLE - OF","2377","0/0","0","0","0","0",".000"]
["Jonatan Clase","SEA - OF","2379","0/0","0","0","0","0",".000"]
["Justyn-Henry Malloy","DET - OF","2380","0/0","0","0","0","0",".000"]
["Pedro Gonzalez","TEX - OF","2387","0/0","0","0","0","0",".000"]
["Henry Bolte","OAK - OF","2392","0/0","0","0","0","0",".000"]
["Colin Barber","HOU - OF","2393","0/0","0","0","0","0",".000"]
["Vince Fernandez","OAK - OF","2408","0/0","0","0","0","0",".000"]
["Nelson Rada","LAA - OF","2418","0/0","0","0","0","0",".000"]
["Michael Gettys","BOS - OF","2419","0/0","0","0","0","0",".000"]
["George Feliz","SEA - OF","2423","0/0","0","0","0","0",".000"]
["Hudson Haskin","BAL - OF","2430","0/0","0","0","0","0",".000"]
["Brayan Buelvas","OAK - OF","2433","0/0","0","0","0","0",".000"]
["Jacob Melton","HOU - OF","2435","0/0","0","0","0","0",".000"]
["Jaison Chourio","CLE - OF","2444","0/0","0","0","0","0",".000"]
["Tyler McDonough","BOS - 2B,OF","2445","0/0","0","0","0","0",".000"]
["Elijah Dunham","NYY - OF","2451","0/0","0","0","0","0",".000"]
["Joe Lampe","CLE - OF","2456","0/0","0","0","0","0",".000"]
["Clark Elliott","OAK - OF","2458","0/0","0","0","0","0",".000"]
["Wilyer Abreu","BOS - OF","2459","0/0","0","0","0","0",".000"]
["Spencer Jones","NYY - OF","2461","0/0","0","0","0","0",".000"]
["Heriberto Hernandez","TB - C,OF","2463","0/0","0","0","0","0",".000"]
["Dustin Harris","TEX - OF","2464","0/0","0","0","0","0",".000"]
["Yoelqui Céspedes","CWS - OF","2467","0/0","0","0","0","0",".000"]
["Dasan Brown","TOR - OF","2471","0/0","0","0","0","0",".000"]
["Brock Jones","TB - OF","2481","0/0","0","0","0","0",".000"]
["Alberto Rodriguez","SEA - OF","2484","0/0","0","0","0","0",".000"]
["Justin Dirden","HOU - OF","2486","0/0","0","0","0","0",".000"]
["Nick Decker","BOS - OF","2494","0/0","0","0","0","0",".000"]
["Alexander Ramirez","LAA - OF","2497","0/0","0","0","0","0",".000"]
["Cade Marlowe","SEA - OF","2498","0/0","0","0","0","0",".000"]
["Luis Mieses","CWS - OF","2501","0/0","0","0","0","0",".000"]
["James Beard","CWS - OF","2515","0/0","0","0","0","0",".000"]
["Denzel Clarke","OAK - OF","2526","0/0","0","0","0","0",".000"]
["Quincy Hamilton","HOU - OF","2528","0/0","0","0","0","0",".000"]
["Joe McCarthy","TEX - OF","2529","0/5","0","0","0","0",".000"]
["Erick Pena","KC - OF","2533","0/0","0","0","0","0",".000"]
["Luis Básabe","CWS - OF","2538","1/6","2","0","0","1",".000"]
["Anthony Gutierrez","TEX - OF","2540","0/0","0","0","0","0",".000"]
["Ryan Noda","OAK - 1B,OF","2541","0/0","0","0","0","0",".000"]
["Gavin Cross","KC - OF","2542","0/0","0","0","0","0",".000"]
["Logan Cerny","HOU - OF","2569","0/0","0","0","0","0",".000"]
["Corey Julks","HOU - OF","2584","0/0","0","0","0","0",".000"]
["Trevor Hauver","TEX - 2B,OF","2590","0/0","0","0","0","0",".000"]
["Daniel Cabrera","DET - OF","2591","0/0","0","0","0","0",".000"]
["Eric Thames","OAK - 1B,OF","2596","68/303","37","13","40","0",".324"]
["Chase DeLauter","CLE - OF","2598","0/0","0","0","0","0",".000"]
["Everson Pereira","NYY - OF","2604","0/0","0","0","0","0",".000"]
["Heston Kjerstad","BAL - OF","2620","0/0","0","0","0","0",".000"]
["Jose De La Cruz","DET - OF","2628","0/0","0","0","0","0",".000"]
["Parker Meadows","DET - OF","2629","0/0","0","0","0","0",".000"]
["Ceddanne Rafaela","BOS - OF","2630","0/0","0","0","0","0",".000"]
["John Rhodes","BAL - OF","2636","0/0","0","0","0","0",".000"]
["Randy De Jesus","LAA - OF","2644","0/0","0","0","0","0",".000"]
["Ryder Green","NYY - OF","2645","0/0","0","0","0","0",".000"]
["Roman Anthony","BOS - OF","2650","0/0","0","0","0","0",".000"]
["Misael Urbina","MIN - OF","2658","0/0","0","0","0","0",".000"]
["Justin Boyd","CLE - OF","2662","0/0","0","0","0","0",".000"]
["Lawrence Butler","OAK - OF","2664","0/0","0","0","0","0",".000"]
["Drew Gilbert","HOU - OF","2666","0/0","0","0","0","0",".000"]
["Jose Rodriguez","MIN - OF","2667","0/0","0","0","0","0",".000"]
["Jordyn Adams","LAA - OF","2672","0/0","0","0","0","0",".000"]
["Lazaro Montes","SEA - OF","2674","0/0","0","0","0","0",".000"]
["Tyler Gentry","KC - OF","2681","0/0","0","0","0","0",".000"]
["Josh Stowers","TEX - OF","2683","0/0","0","0","0","0",".000"]
["Petey Halpin","CLE - OF","2692","0/0","0","0","0","0",".000"]
["Freddy Valdez","BOS - OF","2699","0/0","0","0","0","0",".000"]
["Michael Beltre","NYY - OF","2710","0/0","0","0","0","0",".000"]
["Pedro Leon","HOU - OF","2716","0/0","0","0","0","0",".000"]
["Matthew Barefoot","HOU - OF","2724","0/0","0","0","0","0",".000"]
["Brandon Lockridge","NYY - OF","2728","0/0","0","0","0","0",".000"]
["Kameron Misner","TB - OF","2729","0/0","0","0","0","0",".000"]
["Nick Schnell","TB - OF","2730","0/0","0","0","0","0",".000"]
["Dom Thompson-Williams ","SEA - OF","2733","0/0","0","0","0","0",".000"]
["Tyler Whitaker","HOU - OF","2734","0/0","0","0","0","0",".000"]
["Evan Carter","TEX - OF","2735","0/0","0","0","0","0",".000"]
["Daniel Palka","BOS - OF","2744","0/0","0","0","0","0",".000"]
["Alerick Soularie","MIN - 2B,OF","2756","0/0","0","0","0","0",".000"]
["Mason Auer","TB - OF","2757","0/0","0","0","0","0",".000"]
["Anthony Hall","NYY - OF","2763","0/0","0","0","0","0",".000"]
["Roberto Campos","DET - OF","2787","0/0","0","0","0","0",".000"]
["Pedro Pineda","OAK - OF","2790","0/0","0","0","0","0",".000"]
["Austin Martin","MIN - OF","2795","0/0","0","0","0","0",".000"]
["Tristan Peters","TB - OF","2797","0/0","0","0","0","0",".000"]
["Kenni Gomez","HOU - OF","2799","0/0","0","0","0","0",".000"]
["Gilberto Jimenez","BOS - OF","2801","0/0","0","0","0","0",".000"]
["D'Shawn Knowles","LAA - OF","2805","0/0","0","0","0","0",".000"]
["Gabriel Maciel","MIN - OF","2810","0/0","0","0","0","0",".000"]
["Luis Baez","MIN - OF","2820","0/0","0","0","0","0",".000"]
["Zach Daniels","HOU - OF","2822","0/0","0","0","0","0",".000"]
["Jadiel Sanchez","LAA - OF","2837","0/0","0","0","0","0",".000"]
["Alexfri Planez","CLE - OF","2846","0/0","0","0","0","0",".000"]
["Colton Cowser","BAL - OF","2847","0/0","0","0","0","0",".000"]
["Jhonkensy Noel","CLE - 3B,OF","2859","0/0","0","0","0","0",".000"]
["Micker Adolfo","CWS - OF","2861","0/0","0","0","0","0",".000"]
["Gabriel Gonzalez","SEA - OF","2862","0/0","0","0","0","0",".000"]
["Mikie Mahtook","CWS - OF","2870","0/0","0","0","0","0",".000"]
["Ryan Cermak","TB - OF","2877","0/0","0","0","0","0",".000"]
["Jasson Dominguez","NYY - OF","2879","0/0","0","0","0","0",".000"]
["Zach DeLoach","SEA - OF","2897","0/0","0","0","0","0",".000"]
["Emmanuel Rodriguez","MIN - OF","2900","0/0","0","0","0","0",".000"]
["Christin Stewart","BOS - OF","2901","6/41","3","1","4","0",".000"]
["Jeisson Rosario","BOS - OF","2908","0/0","0","0","0","0",".000"]
["César Puello","BOS - OF","2917","1/4","0","0","0","0",".000"]
["Bryant Packard","DET - OF","2922","0/0","0","0","0","0",".000"]
["Erick Hernandez","CWS - OF","2930","0/0","0","0","0","0",".000"]
["Nathan Lukes","TOR - OF","2937","0/0","0","0","0","0",".000"]
["Diego Hernandez","KC - OF","2938","0/0","0","0","0","0",".000"]
["Jordan Brewer","HOU - OF","2952","0/0","0","0","0","0",".000"]
["Jaycob Brugman","CWS - OF","2954","0/0","0","0","0","0",".000"]
["Tucker Bradley","KC - OF","2964","0/0","0","0","0","0",".000"]
["Samad Taylor","KC - 2B,OF","2966","0/0","0","0","0","0",".000"]
["Jud Fabian","BAL - OF","2967","0/0","0","0","0","0",".000"]
["Derek Dietrich","NYY - 2B,OF","2975","0/0","0","0","0","0",".000"]
["Colby Thomas","OAK - OF","2982","0/0","0","0","0","0",".000"]
["Jack Larsen","SEA - OF","2997","0/1","0","0","0","0",".000"]
["Jacob Robson","DET - OF","3009","0/0","0","0","0","0",".000"]
["Steele Walker","DET - OF","3011","1/7","1","1","1","0",".000"]
["Brewer Hicklen","KC - OF","3016","0/0","0","0","0","0",".000"]
["Ryan Aguilar","LAA - OF","3022","2/11","1","0","1","0",".000"]
["Drew Jackson","OAK - OF","3031","0/0","0","0","0","0",".000"]
["Cal Stevenson","OAK - OF","3040","6/30","3","0","1","1",".000"]
["Greg Deichmann","OAK - OF","3041","1/10","0","0","0","0",".000"]
["Mickey McDonald","OAK - OF","3042","0/2","0","0","0","0",".000"]
["Dillon Thomas","LAA - OF","3046","1/9","1","0","1","0",".000"]
["Christian Lopes","OAK - 2B,OF","3067","0/5","0","0","0","0",".000"]
["Aaron Whitefield","LAA - OF","3070","0/6","0","0","0","0",".000"]
["Tim Beckham","MIN - OF","3072","0/0","0","0","0","0",".000"]

{"sheet":"DH","index":9,"n_rows":1,"n_cols":9,"rows_kept":1}
["Player","Team","Rank","H/AB","R","HR","RBI","SB","OBP"]

{"sheet":"Pitchers","index":10,"n_rows":394,"n_cols":9,"rows_kept":394}
["Player","Team","Rank","IP","K","ERA","WHIP","QS","SV + H"]
{"$rows_empty":40}
["Bailey Ober","MIN - SP","277","86","84","3.66","1.13","3","0"]
[]
[]
[]
[]
[]
[]
["Martín Pérez","TEX - SP","336","164","138","3.57","1.33","14","0"]
["Brayan Bello","BOS - SP","348","97","84","4.17","1.35","3","0"]
[]
[]
["Tanner Houck","BOS - SP,RP","401","61","66","2.95","1.11","1","5"]
["Matt Wisler","DET - SP,RP","407","50","54","2.52","1.04","0","8"]
["Tarik Skubal","DET - SP","413","80","85","4.05","1.21","6","0"]
["Jalen Beeks","TB - SP,RP","449","39","47","3.00","1.21","0","4"]
[]
["José Suarez","LAA - SP","473","120","101","3.98","1.20","3","0"]
["Tyler Wells","BAL - SP","485","71","60","4.18","1.07","3","1"]
["John Means","BAL - SP","504","55","50","3.76","1.04","4","0"]
["Joey Wentz","DET - SP","513","16","14","3.38","1.19","1","0"]
["Rony García","DET - SP,RP","538","36","31","5.25","1.19","1","0"]
["Spencer Turnbull","DET - SP","551","134","122","4.30","1.31","10","0"]
["Danny Duffy","TEX - SP","558","46","47","3.91","1.26","2","0"]
["Domingo Germán","NYY - SP","568","69","62","4.04","1.17","5","0"]
["Cole Irvin","BAL - SP","576","152","107","4.20","1.24","13","0"]
["Chris Flexen","SEA - SP,RP","587","45","31","3.80","1.31","4","0"]
["Aaron Civale","CLE - SP","594","148","136","4.50","1.20","11","0"]
["Kyle Funkhouser","DET - SP","598","31","26","4.36","1.52","0","3"]
["Cody Morris","CLE - SP","602","86","86","3.35","1.30","7","7"]
["JP Sears","OAK - SP,RP","607","140","104","3.86","1.31","4","0"]
["Caleb Baragar","CLE - SP","612","18","14","3.00","1.11","0","4"]
["Dean Kremer","BAL - SP","630","134","104","4.23","1.35","8","0"]
[]
["Casey Mize","DET - SP","677","14","11","4.50","1.21","1","0"]
["Chris Rodriguez","LAA - SP","688","10","10","3.60","1.40","0","1"]
["Simeon Woods Richardson","MIN - SP","689","3","2","3.00","1.00","0","0"]
["Michael Lorenzen (Pitcher)","DET - SP,RP","690","148","130","4.38","1.31","8","12"]
[]
["Blaine Knight","BAL - SP","709","0","0","0.00","0.00","0","0"]
["Brenan Hanifee","DET - SP","715","0","0","0.00","0.00","0","0"]
["Trey Supak","OAK - SP","724","0","0","0.00","0.00","0","0"]
["Brant Hurter","DET - SP","731","0","0","0.00","0.00","0","0"]
["Alimber Santa","HOU - SP","732","0","0","0.00","0.00","0","0"]
["Alejandro Hidalgo","LAA - SP","734","0","0","0.00","0.00","0","0"]
["Hayden Juenger","TOR - SP","738","0","0","0.00","0.00","0","0"]
["Shane Drohan","BOS - SP","740","0","0","0.00","0.00","0","0"]
["Tekoah Roby","TEX - SP","741","0","0","0.00","0.00","0","0"]
["Emiliano Teodo","TEX - SP","744","0","0","0.00","0.00","0","0"]
["Cole Winn","TEX - SP","745","0","0","0.00","0.00","0","0"]
["Brock Porter","TEX - SP","747","0","0","0.00","0.00","0","0"]
["Peyton Battenfield","CLE - SP","749","0","0","0.00","0.00","0","0"]
["Yoendrys Gómez","NYY - SP","752","0","0","0.00","0.00","0","0"]
["Cristian Mena","CWS - SP","756","0","0","0.00","0.00","0","0"]
["Juan Carela","NYY - SP","757","0","0","0.00","0.00","0","0"]
["Bryan Woo","SEA - SP","760","0","0","0.00","0.00","0","0"]
["Juan Then","SEA - SP","762","0","0","0.00","0.00","0","0"]
["Austin Hansen","HOU - SP","764","0","0","0.00","0.00","0","0"]
["J.T. Ginn","OAK - SP","773","0","0","0.00","0.00","0","0"]
["Taylor Dollard","SEA - SP","775","0","0","0.00","0.00","0","0"]
["Ben Hernandez","KC - SP","776","0","0","0.00","0.00","0","0"]
["Norge Vera","CWS - SP","782","0","0","0.00","0.00","0","0"]
["Danny Salazar","CLE - SP","783","0","0","0.00","0.00","0","0"]
["Jared Kelley","CWS - SP","790","0","0","0.00","0.00","0","0"]
["Mason Miller","OAK - SP","794","0","0","0.00","0.00","0","0"]
["Dahian Santos","TOR - SP","796","0","0","0.00","0.00","0","0"]
["Andrew Hoffman","KC - SP","797","0","0","0.00","0.00","0","0"]
["Frank Mozzicato","KC - SP","804","0","0","0.00","0.00","0","0"]
["Randy Vasquez","NYY - SP","812","0","0","0.00","0.00","0","0"]
["Marcus Johnson","TB - SP","816","0","0","0.00","0.00","0","0"]
["Nick Bitsko","TB - SP","819","0","0","0.00","0.00","0","0"]
["Dane Acker","TEX - SP","820","0","0","0.00","0.00","0","0"]
["Ty Madden","DET - SP","821","0","0","0.00","0.00","0","0"]
["Andrew Moore","DET - SP,RP","822","0","0","0.00","0.00","0","0"]
["Fernando Romero","LAA - SP","829","0","0","0.00","0.00","0","0"]
["Michael Mercado","TB - SP","832","0","0","0.00","0.00","0","0"]
["Walbert Urena","LAA - SP","837","0","0","0.00","0.00","0","0"]
["Gunnar Hoglund","OAK - SP","838","0","0","0.00","0.00","0","0"]
["Andrew Dalquist","CWS - SP","840","0","0","0.00","0.00","0","0"]
["Matt Canterino","MIN - SP","844","0","0","0.00","0.00","0","0"]
["Chad Dallas","TOR - SP","852","0","0","0.00","0.00","0","0"]
["Joey Murray","TOR - SP","856","0","0","0.00","0.00","0","0"]
["Kohl Simas","CWS - SP","858","0","0","0.00","0.00","0","0"]
["Alejandro Melean","TOR - SP","859","0","0","0.00","0.00","0","0"]
["Tanner Bibee","CLE - SP","864","0","0","0.00","0.00","0","0"]
["Walker Lockett","TOR - SP","865","7","5","5.14","1.57","0","0"]
["Yefri Del Rosario","KC - SP","867","0","0","0.00","0.00","0","0"]
["Marco Raya","MIN - SP","868","0","0","0.00","0.00","0","0"]
["Joey Cantillo","CLE - SP","870","0","0","0.00","0.00","0","0"]
["Sean Mooney","MIN - SP","871","0","0","0.00","0.00","0","0"]
["Jason Bilous","CLE - SP","879","0","0","0.00","0.00","0","0"]
["Andrew Taylor","HOU - SP","880","0","0","0.00","0.00","0","0"]
["Mason Barnett","KC - SP","882","0","0","0.00","0.00","0","0"]
["Drew Thorpe","NYY - SP","886","0","0","0.00","0.00","0","0"]
["Ben Kudrna","KC - SP","888","0","0","0.00","0.00","0","0"]
["John Doxakis","TB - SP","890","0","0","0.00","0.00","0","0"]
["Robinson Pina","LAA - SP","893","0","0","0.00","0.00","0","0"]
["Walter Ford","SEA - SP","894","0","0","0.00","0.00","0","0"]
["Michael Morales","SEA - SP","896","0","0","0.00","0.00","0","0"]
["Gavin Williams","CLE - SP","898","0","0","0.00","0.00","0","0"]
["Stephen Woods Jr.","KC - SP","899","0","0","0.00","0.00","0","0"]
["Josh Stephan","TEX - SP","900","0","0","0.00","0.00","0","0"]
["Antoine Kelly","TEX - SP","902","0","0","0.00","0.00","0","0"]
["Beck Way","KC - SP","906","0","0","0.00","0.00","0","0"]
["Forrest Whitley","HOU - SP","915","0","0","0.00","0.00","0","0"]
[]
["Jasseel De La Cruz","OAK - SP","918","0","0","0.00","0.00","0","0"]
["Reese Olson","DET - SP","919","0","0","0.00","0.00","0","0"]
["Asa Lacy","KC - SP","920","0","0","0.00","0.00","0","0"]
["Logan Shore","DET - SP","922","0","0","0.00","0.00","0","0"]
["Royber Salinas","OAK - SP","930","0","0","0.00","0.00","0","0"]
["Landon Marceaux","LAA - SP","931","0","0","0.00","0.00","0","0"]
["JJ Goss","TB - SP","933","0","0","0.00","0.00","0","0"]
["Jairo Solis","HOU - SP","934","0","0","0.00","0.00","0","0"]
["José Soriano","LAA - SP","941","0","0","0.00","0.00","0","0"]
["Jhony Brito","NYY - SP","943","0","0","0.00","0.00","0","0"]
["J.P. France","HOU - SP,RP","948","0","0","0.00","0.00","0","0"]
["Coleman Crow","LAA - SP","950","0","0","0.00","0.00","0","0"]
["Colton Gordon","HOU - SP","953","0","0","0.00","0.00","0","0"]
["Clayton Beeter","NYY - SP","954","0","0","0.00","0.00","0","0"]
["Jonathan Cannon","CWS - SP","958","0","0","0.00","0.00","0","0"]
["Jonathan Bowlan","KC - SP","964","0","0","0.00","0.00","0","0"]
["Brendan Beck","NYY - SP","965","0","0","0.00","0.00","0","0"]
["Jaime Melendez","HOU - SP","970","0","0","0.00","0.00","0","0"]
["Trevor Martin","TB - SP","974","0","0","0.00","0.00","0","0"]
["Alex Speas","TEX - SP","976","0","0","0.00","0.00","0","0"]
["Chris Murphy","BOS - SP","982","0","0","0.00","0.00","0","0"]
["Jean Munoz","SEA - SP","985","0","0","0.00","0.00","0","0"]
["Brock Stewart","MIN - SP,RP","986","0","0","0.00","0.00","0","0"]
["Blayne Enlow","MIN - SP","987","0","0","0.00","0.00","0","0"]
["Carlos Torres","DET - SP,RP","995","0","0","0.00","0.00","0","0"]
["Seth Johnson","BAL - SP","997","0","0","0.00","0.00","0","0"]
["Owen White","TEX - SP","998","0","0","0.00","0.00","0","0"]
["Avery Weems","TEX - SP","999","0","0","0.00","0.00","0","0"]
["Lincoln Henzman","CWS - SP","1000","0","0","0.00","0.00","0","0"]
["Aaron Hernandez","LAA - SP","1001","0","0","0.00","0.00","0","0"]
["Braden Shipley","SEA - SP","1005","0","0","0.00","0.00","0","0"]
["Tanner McDougal","CWS - SP","1007","0","0","0.00","0.00","0","0"]
["Irv Carter","TOR - SP","1009","0","0","0.00","0.00","0","0"]
["Drew Rom","BAL - SP","1015","0","0","0.00","0.00","0","0"]
["Jack Leiter","TEX - SP","1016","0","0","0.00","0.00","0","0"]
["Kodi Medeiros","CWS - SP","1027","0","0","0.00","0.00","0","0"]
["Taj Bradley","TB - SP","1030","0","0","0.00","0.00","0","0"]
["Tyler Schweitzer","CWS - SP","1031","0","0","0.00","0.00","0","0"]
["Luis Serna","NYY - SP","1032","0","0","0.00","0.00","0","0"]
["David Festa","MIN - SP","1033","0","0","0.00","0.00","0","0"]
["Parker Messick","CLE - SP","1043","0","0","0.00","0.00","0","0"]
["Adam Kloffenstein","TOR - SP","1048","0","0","0.00","0.00","0","0"]
["Franklin Pérez","DET - SP","1056","0","0","0.00","0.00","0","0"]
["Edwar Colina","TEX - SP","1058","0","0","0.00","0.00","0","0"]
["Nixon Encarnacion","LAA - SP","1061","0","0","0.00","0.00","0","0"]
["Trystan Vrieling","NYY - SP","1062","0","0","0.00","0.00","0","0"]
["Hogan Harris","OAK - SP","1063","0","0","0.00","0.00","0","0"]
["Joey Estes","OAK - SP","1064","0","0","0.00","0.00","0","0"]
["Tommy Mace","CLE - SP","1067","0","0","0.00","0.00","0","0"]
["Victor Mederos","LAA - SP","1073","0","0","0.00","0.00","0","0"]
["Sean Hermann","NYY - SP","1079","0","0","0.00","0.00","0","0"]
["Caden Dana","LAA - SP","1083","0","0","0.00","0.00","0","0"]
["Trent Palmer","TOR - SP","1085","0","0","0.00","0.00","0","0"]
["Bryan Mata","BOS - SP","1088","0","0","0.00","0.00","0","0"]
["Erik Rivera","LAA - SP","1089","0","0","0.00","0.00","0","0"]
["Colin Peluse","OAK - SP","1092","0","0","0.00","0.00","0","0"]
["CJ Van Eyk","TOR - SP","1093","0","0","0.00","0.00","0","0"]
["Luis Medina","OAK - SP","1104","0","0","0.00","0.00","0","0"]
["Brandon Barriera","TOR - SP","1106","0","0","0.00","0.00","0","0"]
["Brandon Walter","BOS - SP","1110","0","0","0.00","0.00","0","0"]
["Will Warren","NYY - SP","1115","0","0","0.00","0.00","0","0"]
["Tim Adleman","DET - SP","1120","0","0","0.00","0.00","0","0"]
["Misael Tamarez","HOU - SP","1121","0","0","0.00","0.00","0","0"]
["Daniel Gossett","MIN - SP","1122","0","0","0.00","0.00","0","0"]
["Sterling Sharp","BOS - SP","1125","2","1","13.50","2.50","0","0"]
["Chandler Champlain","KC - SP","1126","0","0","0.00","0.00","0","0"]
["Sem Robberse","TOR - SP","1128","0","0","0.00","0.00","0","0"]
["Ashton Izzi","SEA - SP","1134","0","0","0.00","0.00","0","0"]
["Wilmer Flores","DET - SP","1139","0","0","0.00","0.00","0","0"]
["Michael Knorr","HOU - SP","1140","0","0","0.00","0.00","0","0"]
["Mason Albright","LAA - SP","1141","0","0","0.00","0.00","0","0"]
["Matt Krook","NYY - SP","1142","0","0","0.00","0.00","0","0"]
["Jackson Jobe","DET - SP","1143","0","0","0.00","0.00","0","0"]
["Matt Thompson","CWS - SP","1144","0","0","0.00","0.00","0","0"]
["Mason Englert","DET - SP","1148","0","0","0.00","0.00","0","0"]
["Sam Bachman","LAA - SP","1150","0","0","0.00","0.00","0","0"]
["Isaiah Campbell","SEA - SP","1151","0","0","0.00","0.00","0","0"]
["Noah Murdock","KC - SP","1158","0","0","0.00","0.00","0","0"]
["Jacob Watters","OAK - SP","1160","0","0","0.00","0.00","0","0"]
["Troy Melton","DET - SP","1169","0","0","0.00","0.00","0","0"]
["Jayden Murray","HOU - SP","1172","0","0","0.00","0.00","0","0"]
["Logan Allen","CLE - SP","1174","0","0","0.00","0.00","0","0"]
["Tyler Baum","OAK - SP","1184","0","0","0.00","0.00","0","0"]
["Ian Seymour","TB - SP","1186","0","0","0.00","0.00","0","0"]
["Jordan Balazovic","MIN - SP","1189","0","0","0.00","0.00","0","0"]
["Austin Cox","KC - SP","1190","0","0","0.00","0.00","0","0"]
["Tyler Sikkema","NYY - SP","1192","0","0","0.00","0.00","0","0"]
["Emerson Hancock","SEA - SP","1195","0","0","0.00","0.00","0","0"]
["Justin Campbell","CLE - SP","1196","0","0","0.00","0.00","0","0"]
["Miguel Ullola","HOU - SP","1197","0","0","0.00","0.00","0","0"]
["Steven Wright","BOS - SP,RP","1198","0","0","0.00","0.00","0","0"]
["Dylan Smith","DET - SP","1201","0","0","0.00","0.00","0","0"]
["Chris Vallimont","BAL - SP","1206","0","0","0.00","0.00","0","0"]
["Noah Schultz","CWS - SP","1210","0","0","0.00","0.00","0","0"]
["Sandy Gaston","TB - SP","1218","0","0","0.00","0.00","0","0"]
["Taylor Guerrieri","SEA - SP,RP","1220","0","0","0.00","0.00","0","0"]
["Eric Skoglund","KC - SP","1224","0","0","0.00","0.00","0","0"]
["Shawn Dubin","HOU - SP,RP","1225","0","0","0.00","0.00","0","0"]
["Grant Holman","OAK - SP","1227","0","0","0.00","0.00","0","0"]
["Connor Prielipp","MIN - SP","1230","0","0","0.00","0.00","0","0"]
["Tim Elliott","SEA - SP","1231","0","0","0.00","0.00","0","0"]
["Yosver Zulueta","TOR - SP,RP","1232","0","0","0.00","0.00","0","0"]
["Kevin Smith","BAL - SP","1235","0","0","0.00","0.00","0","0"]
["Sam Carlson","SEA - SP","1237","0","0","0.00","0.00","0","0"]
["Chayce McDermott","HOU - SP","1238","0","0","0.00","0.00","0","0"]
["Wilkelman Gonzalez","BOS - SP","1240","0","0","0.00","0.00","0","0"]
["Elmer Rodriguez-Cruz","BOS - SP","1241","0","0","0.00","0.00","0","0"]
["Zak Kent","TEX - SP","1242","0","0","0.00","0.00","0","0"]
["Ben Joyce","LAA - SP","1245","0","0","0.00","0.00","0","0"]
["Sean Burke","CWS - SP","1246","0","0","0.00","0.00","0","0"]
["Drew Parrish","KC - SP","1247","0","0","0.00","0.00","0","0"]
["Prelander Berroa","SEA - SP","1251","0","0","0.00","0.00","0","0"]
["Ryan Cusick","OAK - SP","1254","0","0","0.00","0.00","0","0"]
["Alec Marsh","KC - SP","1255","0","0","0.00","0.00","0","0"]
[]
["Tyler Mattison","DET - SP","1257","0","0","0.00","0.00","0","0"]
["Jason Bahr","TEX - SP","1258","0","0","0.00","0.00","0","0"]
["Jonathan Stiever","CWS - SP","1260","3","1","12.00","2.00","0","0"]
["Adam Seminaris","LAA - SP","1264","0","0","0.00","0.00","0","0"]
["Mitch Bratt","TEX - SP","1268","0","0","0.00","0.00","0","0"]
["Tanner Burns","CLE - SP","1275","0","0","0.00","0.00","0","0"]
["Brett Conine","HOU - SP","1278","0","0","0.00","0.00","0","0"]
["Matt Sauer","NYY - SP","1281","0","0","0.00","0.00","0","0"]
["Richard Fitts","NYY - SP","1285","0","0","0.00","0.00","0","0"]
["Noah Cameron","KC - SP","1286","0","0","0.00","0.00","0","0"]
["Chris Clarke","SEA - SP","1287","0","0","0.00","0.00","0","0"]
["Eric Pardinho","TOR - SP","1291","0","0","0.00","0.00","0","0"]
["Spencer Arrighetti","HOU - SP","1293","0","0","0.00","0.00","0","0"]
["Austin Bergner","DET - SP","1295","0","0","0.00","0.00","0","0"]
["Juan Pinto","SEA - SP","1296","0","0","0.00","0.00","0","0"]
["Cody Bradford","TEX - SP","1305","0","0","0.00","0.00","0","0"]
["Dario Agrazal","DET - SP","1308","0","0","0.00","0.00","0","0"]
["Mason Erla","LAA - SP","1309","0","0","0.00","0.00","0","0"]
["Bryce Miller","SEA - SP","1310","0","0","0.00","0.00","0","0"]
["Brent Headrick","MIN - SP","1312","0","0","0.00","0.00","0","0"]
["Brandon Finnegan","CWS - SP","1313","0","0","0.00","0.00","0","0"]
["Brock Selvidge","NYY - SP","1315","0","0","0.00","0.00","0","0"]
["Jake Madden","LAA - SP","1321","0","0","0.00","0.00","0","0"]
["Doug Nikhazy","CLE - SP","1322","0","0","0.00","0.00","0","0"]
["Peyton Pallette","CWS - SP","1325","0","0","0.00","0.00","0","0"]
["Ross Carver","CLE - SP","1327","0","0","0.00","0.00","0","0"]
["Jack Kochanowicz","LAA - SP","1336","0","0","0.00","0.00","0","0"]
["Garrett Williams","OAK - SP","1337","0","0","0.00","0.00","0","0"]
["Kumar Rocker","TEX - SP","1338","0","0","0.00","0.00","0","0"]
["Mason Montgomery","TB - SP","1342","0","0","0.00","0.00","0","0"]
["Ricardo Sánchez","CWS - SP","1344","2","2","9.00","2.00","0","0"]
["Ky Bush","LAA - SP","1351","0","0","0.00","0.00","0","0"]
["Jacob Zibin","CLE - SP","1352","0","0","0.00","0.00","0","0"]
["Lenny Torres","CLE - SP","1353","0","0","0.00","0.00","0","0"]
["Ethan Hankins","CLE - SP","1357","0","0","0.00","0.00","0","0"]
["Adam Macko","SEA - SP","1360","0","0","0.00","0.00","0","0"]
["Ian Clarkin","SEA - SP","1361","0","0","0.00","0.00","0","0"]
["Louie Varland","MIN - SP","1365","13","11","4.15","1.23","0","0"]
["Scott Blewett","KC - SP","1366","3","3","3.00","2.00","0","0"]
["Josh James","HOU - SP","1369","0","0","0.00","0.00","0","0"]
["Chris Paddack","MIN - SP","1374","19","17","4.74","1.26","1","0"]
["Jake Latz","TEX - SP","1375","2","1","4.50","1.00","0","0"]
["Mike Clevinger","CWS - SP","1381","76","64","4.03","1.18","5","0"]
["Asher Wojciechowski","SEA - SP","1382","0","0","0.00","0.00","0","0"]
["Cooper Criswell","TB - SP","1383","2","2","9.00","2.00","0","0"]
["Jhonathan Diaz","LAA - SP","1388","12","9","3.75","1.42","0","0"]
["Cody Reed","TB - SP","1391","9","8","4.00","1.56","0","1"]
["Tanner Roark","TOR - SP","1400","0","0","0.00","0.00","0","0"]
["Tyler Ivey","HOU - SP","1406","2","1","4.50","1.00","0","0"]
["Deivi García","NYY - SP","1418","18","17","5.50","1.22","1","0"]
["Shane Baz","TB - SP","1432","18","21","4.50","1.22","1","0"]
["Jesse Hahn","KC - SP","1448","0","0","0.00","0.00","0","0"]
["Kyle Cody","TEX - SP","1463","14","13","3.21","1.36","0","0"]
["Hyun Jin Ryu","TOR - SP","1466","60","53","4.05","1.22","5","0"]
["Ervin Santana","KC - SP","1470","0","0","0.00","0.00","0","0"]
["Ken Waldichuk","OAK - SP","1492","129","119","4.95","1.23","6","0"]
["Bryan Garcia","HOU - SP","1494","33","25","4.64","1.48","1","4"]
["Nick Margevicius","SEA - SP","1499","23","20","5.09","1.30","1","0"]
["Mike Fiers","OAK - SP","1502","0","0","0.00","0.00","0","0"]
["Derek Holland","BOS - SP","1510","0","0","0.00","0.00","0","0"]
["Griffin Canning","LAA - SP","1514","46","46","4.70","1.44","2","0"]
["Luis Gil","NYY - SP","1524","12","15","3.75","1.33","0","0"]
["Andrew Albers","MIN - SP","1546","6","4","7.50","1.83","0","0"]
["Carson Fulmer","SEA - SP","1549","13","13","6.23","1.46","0","0"]
["Matt Manning","DET - SP","1551","120","86","4.50","1.35","8","0"]
["Jake Faria","BOS - SP","1557","11","11","5.73","1.54","0","0"]
["Beau Brieske","DET - SP","1614","41","27","4.17","1.22","3","0"]
["Aaron Slegers","LAA - SP","1617","0","0","0.00","0.00","0","0"]
["Chris Ellis","BAL - SP","1639","52","44","5.19","1.50","0","0"]
["Trevor Richards","TOR - SP,RP","1647","68","79","4.90","1.35","0","6"]
["Garrett Hill","DET - SP,RP","1663","30","20","4.20","1.40","1","1"]
["Matt Brash","SEA - SP,RP","1666","25","31","4.68","1.60","0","5"]
["Mike Foltynewicz","TEX - SP","1676","0","0","0.00","0.00","0","0"]
["Paul Blackburn","OAK - SP","1687","138","108","4.96","1.36","4","0"]
["Kyle Muller","OAK - SP","1691","18","18","5.50","1.44","0","0"]
["Xzavion Curry","CLE - SP","1705","5","2","5.40","2.00","0","0"]
["Josh Winder","MIN - SP","1708","34","24","4.76","1.29","2","0"]
["Shawn Armstrong","TB - SP,RP","1712","50","54","4.50","1.30","0","4"]
["Jake Odorizzi","TEX - SP","1716","71","59","4.44","1.31","2","0"]
["Davis Martin","CWS - SP,RP","1728","112","84","4.82","1.31","4","0"]
["Konnor Pilkington","CLE - SP","1755","29","25","4.03","1.48","0","0"]
["Zack Greinke","KC - SP","1764","156","107","3.92","1.24","12","0"]
["Matt Harvey","BAL - SP","1775","0","0","0.00","0.00","0","0"]
["Michael Pineda","DET - SP","1781","105","91","3.69","1.07","7","0"]
["Daulton Jefferies","OAK - SP","1790","26","17","5.88","1.35","1","0"]
["Mike Baumann","BAL - SP,RP","1798","20","13","5.85","1.65","0","1"]
["James Kaprielian","OAK - SP","1803","135","115","4.27","1.30","8","0"]
["Mike Mayers","KC - SP,RP","1806","64","72","4.22","1.25","0","10"]
["Marco Gonzales","SEA - SP","1818","171","116","3.90","1.21","16","0"]
["Cole Sands","MIN - SP,RP","1820","15","14","6.00","1.67","0","1"]
["Max Castillo","KC - SP,RP","1822","80","76","5.85","1.35","0","0"]
["Cole Ragans","TEX - SP","1828","20","14","4.95","1.50","0","0"]
["Chase Silseth","LAA - SP","1829","14","12","7.07","1.64","1","0"]
["Thomas Hatch","TOR - SP","1831","17","15","5.82","1.59","0","2"]
["Austin Voth","BAL - SP,RP","1833","92","84","5.09","1.45","1","3"]
["Ryan Yarbrough","KC - SP,RP","1837","140","107","4.56","1.27","6","0"]
["Chris Archer","MIN - SP","1855","121","130","4.46","1.35","8","0"]
["Luis Patiño","TB - SP","1857","44","40","5.32","1.50","1","0"]
["Zach Plesac","CLE - SP","1862","138","109","4.04","1.19","11","0"]
["Hunter Gaddis","CLE - SP","1864","4","3","18.00","2.50","0","0"]
["Nick Pivetta","BOS - SP","1873","164","168","4.67","1.35","10","0"]
["Tyler Alexander","DET - SP,RP","1880","102","75","4.32","1.30","3","2"]
["Yusei Kikuchi","TOR - SP,RP","1882","124","137","4.86","1.39","8","1"]
["Kyle Gibson","BAL - SP","1887","175","150","4.63","1.33","16","0"]
["Adrian Martinez","OAK - SP","1891","29","27","6.21","1.55","1","0"]
["Kutter Crawford","BOS - SP,RP","1895","39","39","5.77","1.46","2","0"]
["Glenn Otto","TEX - SP","1896","27","22","5.00","1.37","1","0"]
["Austin Davis","HOU - SP,RP","1902","40","44","6.08","1.55","0","3"]
["Josh Fleming","TB - SP,RP","1903","67","47","4.97","1.42","1","1"]
["Taylor Hearn","TEX - SP,RP","1909","93","90","4.84","1.41","2","2"]
["Kyle Bradish","BAL - SP","1916","168","140","3.86","1.24","8","0"]
["Alex Faedo","DET - SP","1918","27","22","5.67","1.67","1","0"]
["Dylan Bundy","MIN - SP","1919","131","132","4.88","1.29","8","0"]
["Jordan Lyles","KC - SP","1926","175","137","5.09","1.42","11","0"]
["Drew Hutchison","TOR - SP,RP","1939","60","37","4.20","1.48","1","0"]
["Zach Logue","DET - SP","1957","29","21","6.83","1.52","1","0"]
["Josh Winckowski","BOS - SP","1961","35","22","5.91","1.63","2","0"]
["Aaron Sanchez","MIN - SP,RP","1966","42","29","5.57","1.50","0","0"]
["Spencer Howard","TEX - SP","1988","23","22","7.04","1.70","0","0"]
["Spenser Watkins","BAL - SP","1994","57","34","5.53","1.47","2","0"]
["Tucker Davidson","LAA - SP","2000","86","51","4.39","1.28","2","0"]
["Dane Dunning","TEX - SP","2011","66","61","4.36","1.39","4","0"]
["Bruce Zimmermann","BAL - SP","2023","31","23","5.81","1.45","1","1"]
["Jonathan Heasley","KC - SP","2031","34","22","5.29","1.47","2","0"]
["Mitch White","TOR - SP,RP","2035","66","56","4.91","1.39","1","0"]
["Elvin Rodriguez","TB - SP","2040","15","13","10.80","1.93","0","0"]
["Zach Thompson","TOR - SP,RP","2074","13","10","4.85","1.46","0","0"]
["Adam Oller","OAK - SP,RP","2095","37","23","6.32","1.65","2","1"]
["Carlos Hernández","KC - SP,RP","2151","63","48","5.43","1.59","2","1"]
["Daniel Lynch","KC - SP","3057","62","55","5.23","1.58","2","0"]
["Brad Keller","KC - SP,RP","3071","139","107","4.73","1.47","11","2"]
["Kris Bubic","KC - SP","3079","130","115","4.99","1.56","7","0"]
["Dallas Keuchel","CWS - SP","3080","123","78","4.61","1.43","7","0"]

{"sheet":"Relief Pitchers","index":11,"n_rows":429,"n_cols":9,"rows_kept":429}
["Player","Team","Rank","IP","K","ERA","WHIP","QS","SV + H"]
{"$rows_empty":26}
["Brock Burke","TEX - RP",365,41,45,1.98,1.07,0,5]
[]
["John Schreiber","BOS - RP",369,41,45,2.85,1.07,0,15]
["Anthony Bass","TOR - RP",370,67,65,2.55,1.09,0,22]
[]
[]
[]
[]
[]
["Andrew Kittredge","TB - RP",382,37,34,2.19,0.97,0,9]
["Tim Mayza","TOR - RP",383,42,41,3.21,1.05,0,15]
["Cionel Pérez","BAL - RP",384,40,39,2.48,1.32,0,14]
[]
["Trevor Stephan","CLE - RP",390,53,66,3.4,1.26,0,13]
["Penn Murfee","SEA - RP",391,35,38,3.09,0.94,0,4]
["Ryne Stanek","HOU - RP",392,55,64,2.62,1.25,0,17]
["Chris Martin","BOS - RP",394,51,57,3,1,0,14]
["Eli Morgan","CLE - RP",396,63,63,4.29,1.06,2,5]
["Ryan Tepera","LAA - RP",397,58,62,3.41,1.07,0,20]
[]
["Tanner Houck","BOS - SP,RP",401,61,66,2.95,1.11,1,5]
["Dillon Tate","BAL - RP",402,67,53,3.49,1.06,0,15]
["Matt Moore","LAA - RP",404,61,63,3.69,1.36,0,10]
["Wandy Peralta","NYY - RP",406,57,49,3,1.18,0,11]
["Matt Wisler","DET - SP,RP",407,50,54,2.52,1.04,0,8]
["Joe Barlow","TEX - RP",408,27,23,3,1.07,0,11]
["Domingo Acevedo","OAK - RP",409,37,32,3.41,1.03,0,13]
[]
["Scott Effross","NYY - RP",412,0,0,0,0,0,0]
["Nick Sandlin","CLE - RP",415,33,37,2.46,1.18,0,5]
[]
["Griffin Jax","MIN - RP",418,64,61,4.64,1.17,1,10]
["Chad Green","TOR - RP",420,21,25,3.43,0.91,0,6]
["Mychal Givens","BAL - RP",422,58,65,3.41,1.31,0,14]
["Enyel De Los Santos","CLE - RP",433,38,47,4.03,1.29,0,3]
["Ron Marinaccio","NYY - RP",434,22,28,2.04,1.04,0,3]
["Sam Hentges","CLE - RP",435,54,59,4.17,1.31,0,5]
["Dany Jiménez","OAK - RP",437,18,17,3.5,1.22,0,8]
["Dylan Coleman","KC - RP",438,36,38,2.75,1.22,0,8]
["Jaime Barría","LAA - RP",441,73,51,3.33,1.19,2,3]
["Jalen Beeks","TB - SP,RP",449,39,47,3,1.21,0,4]
["Colin Poche","TB - RP",457,29,32,4.03,1.17,0,16]
[]
["Ryan Thompson","TB - RP",468,45,42,3.6,1.18,0,12]
["Jovani Moran","MIN - RP",469,23,30,2.74,1.17,0,2]
["Seth Martinez","HOU - RP",470,20,20,2.7,1.15,0,1]
["Zach Jackson","OAK - RP",474,24,34,3,1.29,0,16]
["Matthew Boyd","DET - RP",482,120,112,4.95,1.33,6,2]
[]
["Aaron Bummer","CWS - RP",488,36,46,2.75,1.33,0,15]
["Bryan Baker","BAL - RP",489,35,38,3.6,1.23,0,6]
["José Cisnero","DET - RP",491,46,47,2.74,1.28,0,12]
["Zach Pop","TOR - RP",494,38,30,3.32,1.29,0,2]
["Tanner Banks","CWS - RP",497,27,25,3,1.11,0,1]
["Andrew Wantz","LAA - RP",507,34,39,3.71,1.18,0,4]
["Trevor Gott","SEA - RP",511,28,26,5.14,1.18,0,9]
["Emilio Pagán","MIN - RP",512,63,75,4.57,1.24,0,18]
["Garrett Cleavinger","TB - RP",516,18,23,3.5,1.28,0,0]
[]
["Tommy Kahnle","NYY - RP",521,7,8,2.57,0.71,0,2]
["Casey Sadler","SEA - RP",523,22,22,2.46,1,0,7]
["Luke Bard","TOR - RP",525,10,7,2.7,1.1,0,0]
["Jharel Cotton","MIN - RP",528,0,0,0,0,0,0]
["Sam Moll","OAK - RP",535,25,26,2.88,1.28,0,8]
["Nick Vespi","BAL - RP",536,13,14,4.15,1.46,0,2]
["Matt Festa","SEA - RP",537,27,32,4.33,1.15,0,4]
["Rony García","DET - SP,RP",538,36,31,5.25,1.19,1,0]
["Yusmeiro Petit","OAK - RP",540,0,0,0,0,0,0]
["Matt Gage","HOU - RP",542,7,6,1.29,0.86,0,0]
["Cody Stashak","MIN - RP",544,20,24,4.5,1.15,0,3]
["Eduard Bazardo","BAL - RP",548,9,7,3,1,0,0]
["Joey Krehbiel","BAL - RP",553,32,25,3.94,1.22,0,7]
["Greg Weissert","NYY - RP",559,6,6,6,1,0,1]
["Jonathan Hernández","TEX - RP",560,29,27,3.1,1.24,0,6]
["Aaron Loup","LAA - RP",561,59,55,2.75,1.1,0,17]
["Kyle Tyler","SEA - RP",563,6,3,1.5,1.17,0,0]
["Keegan Akin","BAL - RP",565,76,74,4.74,1.32,1,3]
["Jorge Alcala","MIN - RP",566,32,33,3.38,1.06,0,4]
["Lou Trivino","NYY - RP",571,62,68,3.92,1.4,0,22]
["Miguel Diaz","DET - RP",578,16,17,3.38,1.12,0,0]
["David Phelps","TOR - RP",580,0,0,0,0,0,0]
["José Quijada","LAA - RP",581,31,41,4.36,1.23,0,10]
["Danny Coulombe","MIN - RP",582,19,17,2.84,1.26,0,1]
["Gabe Speier","SEA - RP",584,15,11,3,1.27,0,1]
["Chris Flexen","SEA - SP,RP",587,45,31,3.8,1.31,4,0]
["Trevor May","OAK - RP",588,44,60,4.09,1.29,0,15]
["Taylor Clarke","KC - RP",590,58,55,4.34,1.31,0,9]
["Garrett Crochet","CWS - RP",592,21,25,2.57,1.14,0,4]
["Ryan Weber","NYY - RP",593,28,16,4.5,1.29,0,3]
["Ronny Henriquez","MIN - RP",595,6,5,3,1,0,0]
["Dominic Leone","TEX - RP",596,47,50,3.45,1.45,0,14]
["Anthony Gose","CLE - RP",597,13,17,4.15,1.23,0,0]
["Drew Steckenrider","OAK - RP",599,30,24,3,1.2,0,8]
["Deolis Guerra","OAK - RP",601,25,24,4.68,1.2,0,1]
["Angel De Jesus","DET - RP",605,6,4,3,1.17,0,0]
["Ian Kennedy","TEX - RP",606,50,49,5.04,1.44,0,20]
["JP Sears","OAK - SP,RP",607,140,104,3.86,1.31,4,0]
["Zack Weiss","LAA - RP",610,7,9,3.86,1.14,0,1]
["Spencer Patton","TEX - RP",611,47,48,3.64,1.21,0,0]
["Jay Jackson","TOR - RP",613,8,10,3.38,1.25,0,1]
["Ken Giles","SEA - RP",616,43,59,3.35,1.23,0,6]
["Richard Lovelady","KC - RP",619,7,8,3.86,1.14,0,1]
["Phoenix Sanders","BAL - RP",623,7,6,3.86,1.14,0,0]
["Kyle Dowdy","BAL - RP",625,3,2,0,1.67,0,0]
["Kyle Crick","TB - RP",626,18,20,4,1.5,0,4]
["Reyes Moronta","TEX - RP",637,20,20,4.05,1.2,0,4]
["Nate Fisher","CWS - RP",644,2,1,0,1,0,0]
["Jacob Webb","LAA - RP",648,16,16,2.81,1.44,0,0]
["Michael Kelly","CLE - RP",652,2,2,4.5,1.5,0,0]
["Adam Morgan","HOU - RP",655,0,0,0,0,0,0]
["Joe Biagini","TOR - RP",656,0,0,0,0,0,0]
["Marcos Diplán","BAL - RP",660,0,0,0,0,0,0]
["DJ Johnson","TB - RP",661,0,0,0,0,0,0]
["Easton McGee","SEA - RP",663,2,1,0,1,0,0]
["Ryan Castellani","OAK - RP",664,0,0,0,0,0,0]
["Kyle Barraclough","LAA - RP",665,9,11,4,1.44,0,1]
["Tyler Holton","DET - RP",667,5,3,3.6,1,0,0]
["Yerry Rodriguez","TEX - RP",669,1,1,0,1,0,1]
["Parker Mushinski","HOU - RP",672,4,4,4.5,1.25,0,1]
["Nick Tropeano","TEX - RP",673,0,0,0,0,0,0]
["Josh Taylor","KC - RP",679,19,23,4.74,1.47,0,5]
["Hunter Wood","TEX - RP",681,2,2,4.5,1,0,0]
["Logan Gillaspie","BAL - RP",686,9,5,3,1.33,0,0]
["Michael Lorenzen (Pitcher)","DET - SP,RP",690,148,130,4.38,1.31,8,12]
["Nick Allgeyer","TOR - RP",691,0,0,0,0,0,0]
["Bowden Francis","TOR - RP",693,0,1,0,0,0,0]
["Freddy Tarnok","OAK - RP",694,0,1,0,0,0,0]
["Ryan Burr","TB - RP",701,17,15,3.18,1.29,0,2]
["Zac Rosscup","HOU - RP",702,0,0,0,0,0,0]
["Dan Altavilla","BOS - RP",705,10,11,5.4,1.3,0,1]
["Justin Anderson","TEX - RP",706,0,0,0,0,0,0]
["Carlos Espinal","NYY - RP",710,0,0,0,0,0,0]
["Robinson Leyer","MIN - RP",713,0,0,0,0,0,0]
["Andrew Politi","BAL - RP",719,0,0,0,0,0,0]
["Jonathan Holder","LAA - RP",721,10,6,4.5,1.6,0,0]
["JC Ramírez","LAA - RP",722,0,0,0,0,0,0]
["Adrian De Horta","TB - RP",728,0,0,0,0,0,0]
["Trevor Rosenthal","DET - RP",742,11,17,1.64,0.82,0,5]
["Cam Hill","CLE - RP",743,0,0,0,0,0,0]
["Matt Bowman","NYY - RP",751,32,23,4.5,1.31,0,1]
["Tyler Lyons","NYY - RP",761,1,0,18,1,0,0]
["Joe Palumbo","TEX - RP",774,1,2,9,2,0,0]
["Elvis Alvarado","DET - RP",778,0,0,0,0,0,0]
["Carlos Sanabria","HOU - RP",784,1,1,9,2,0,0]
["Joey Gerber","SEA - RP",789,7,3,3.86,1.14,0,2]
["Jose Alberto Rivera","LAA - RP",799,0,0,0,0,0,0]
["Brandon Maurer","KC - RP",802,0,0,0,0,0,0]
["Brendan White","DET - RP",814,0,0,0,0,0,0]
["Andrew Moore","DET - SP,RP",822,0,0,0,0,0,0]
["Travis Kuhn","SEA - RP",824,0,0,0,0,0,0]
["Yoán Aybar","CWS - RP",825,0,0,0,0,0,0]
["Mike Hauschild","TOR - RP",834,0,0,0,0,0,0]
["Mike Shawaryn","BOS - RP",849,0,0,0,0,0,0]
["Elvis Luciano","TOR - RP",853,0,0,0,0,0,0]
["D.J. Snelten","NYY - RP",855,0,0,0,0,0,0]
["Nick Avila","CWS - RP",860,0,0,0,0,0,0]
["Miguel Almonte","LAA - RP",862,0,0,0,0,0,0]
["Kolton Ingram","LAA - RP",863,0,0,0,0,0,0]
["Jorge Juan","OAK - RP",875,0,0,0,0,0,0]
["Emilio Vargas","CWS - RP",891,0,0,0,0,0,0]
["Drew Rucinski","OAK - RP",901,179,161,4.12,1.31,8,0]
["Zack Hess","DET - RP",912,0,0,0,0,0,0]
["Edgar Barclay","NYY - RP",928,0,0,0,0,0,0]
["Carson Smith","BOS - RP",944,0,0,0,0,0,0]
["Oliver Drake","TB - RP",946,0,0,0,0,0,0]
["J.P. France","HOU - SP,RP",948,0,0,0,0,0,0]
["Shintaro Fujinami","OAK - RP",951,119,120,4.54,1.57,7,0]
["Brayan Perez","SEA - RP",959,0,0,0,0,0,0]
["Carson Coleman","NYY - RP",966,0,0,0,0,0,0]
["Nolan Blackwood","MIN - RP",967,0,0,0,0,0,0]
["Brian Flynn","TEX - RP",969,0,0,0,0,0,0]
["Jimmy Cordero","NYY - RP",977,12,10,6,1.58,0,4]
["Noah Denoyer","BAL - RP",983,0,0,0,0,0,0]
["Brock Stewart","MIN - SP,RP",986,0,0,0,0,0,0]
["Ben Heller","TB - RP",989,3,3,3,1,0,0]
["Hagen Danner","TOR - RP",990,0,0,0,0,0,0]
["Carlos Torres","DET - SP,RP",995,0,0,0,0,0,0]
["Sam Freeman","KC - RP",1003,0,0,0,0,0,0]
["Sean Gilmartin","TB - RP",1012,0,0,0,0,0,0]
["Sam Tuivailala","SEA - RP",1014,0,0,0,0,0,0]
["Ryan Costeiu","LAA - RP",1028,0,0,0,0,0,0]
["Ricky Vanasco","TEX - RP",1042,0,0,0,0,0,0]
["Ty Buttrey","HOU - RP",1049,12,8,6,1.42,0,3]
["Caleb Simpson","CLE - RP",1053,0,0,0,0,0,0]
["Jonathan Aro","LAA - RP",1059,0,0,0,0,0,0]
["Luis Perales","BOS - RP",1074,0,0,0,0,0,0]
["Matt Blackham","OAK - RP",1076,0,0,0,0,0,0]
["Garrett Stallings","LAA - RP",1080,0,0,0,0,0,0]
["Trey Wingenter","DET - RP",1087,0,0,0,0,0,0]
["Colby White","TB - RP",1091,0,0,0,0,0,0]
["Alex Santos","HOU - RP",1116,0,0,0,0,0,0]
["Kevin Kelly","TB - RP",1123,0,0,0,0,0,0]
["Marc Church","TEX - RP",1130,0,0,0,0,0,0]
["José Mujica","NYY - RP",1138,2,0,13.5,3,0,0]
["Cody Carroll","BAL - RP",1155,0,0,0,0,0,0]
["Parker Bugg","MIN - RP",1163,0,0,0,0,0,0]
["Kyle Bird","SEA - RP",1175,0,0,0,0,0,0]
["Ben Taylor","DET - RP",1178,0,0,0,0,0,0]
["Tzu-Chen Sha","OAK - RP",1179,0,0,0,0,0,0]
["Tyler Johnson","CWS - RP",1187,0,0,0,0,0,0]
["Ryan Weiss","KC - RP",1191,0,0,0,0,0,0]
["Steven Wright","BOS - SP,RP",1198,0,0,0,0,0,0]
["Eric Torres","LAA - RP",1208,0,0,0,0,0,0]
["Luke Murphy","LAA - RP",1216,0,0,0,0,0,0]
["Neil Ramírez","LAA - RP",1219,0,0,0,0,0,0]
["Taylor Guerrieri","SEA - SP,RP",1220,0,0,0,0,0,0]
["Jhan Marinez","CWS - RP",1222,0,0,0,0,0,0]
["Shawn Dubin","HOU - SP,RP",1225,0,0,0,0,0,0]
["Chance Adams","KC - RP",1228,0,0,0,0,0,0]
["Yosver Zulueta","TOR - SP,RP",1232,0,0,0,0,0,0]
["Marcus Walden","BOS - RP",1236,6,5,9,2.33,0,1]
["Brooks Pounders","TB - RP",1248,0,0,0,0,0,0]
["Tim Herrin","CLE - RP",1252,0,0,0,0,0,0]
["Miguel Romero","OAK - RP",1262,0,0,0,0,0,0]
["Reggie McClain","NYY - RP",1270,0,0,0,0,0,0]
["Durbin Feltman","BOS - RP",1280,0,0,0,0,0,0]
["Blair Henley","HOU - RP",1282,0,0,0,0,0,0]
["Wandisson Charles","BAL - RP",1300,0,0,0,0,0,0]
["Hector Perez","TB - RP",1301,1,0,9,2,0,0]
["Adam Warren","NYY - RP",1314,0,0,0,0,0,0]
["Stiward Aquino","LAA - RP",1316,0,0,0,0,0,0]
["Davis Daniel","LAA - RP",1331,0,0,0,0,0,0]
["Jaime Schultz","TB - RP",1348,0,0,0,0,0,0]
["Jojanse Torres","HOU - RP",1355,0,0,0,0,0,0]
["Josè Rodríguez","SEA - RP",1359,1,0,0,1,0,0]
["Brody Koerner","NYY - RP",1367,0,0,0,0,0,0]
["Zack Kelly","BOS - RP",1371,7,6,3.86,1.29,0,1]
["Archie Bradley","LAA - RP",1372,54,51,3.83,1.31,0,9]
["Parker Markel","CWS - RP",1379,2,2,0,2,0,0]
["Austin Pruitt","OAK - RP",1380,30,21,4.2,1.03,0,2]
["Patrick Weigel","SEA - RP",1387,0,0,0,0,0,0]
["Austin Warren","LAA - RP",1389,15,11,3.6,1.27,0,1]
["Miguel Del Pozo","DET - RP",1395,3,2,12,3.33,0,0]
[]
["Cristofer Ogando","TB - RP",1397,0,0,0,0,0,0]
["Chaz Roe","TB - RP",1398,0,0,0,0,0,0]
["Brandon Bielak","HOU - RP",1399,37,33,5.35,1.51,0,1]
["Andre Scrubb","HOU - RP",1405,0,0,0,0,0,0]
["Brady Lail","SEA - RP",1409,0,0,0,0,0,0]
["Richard Bleier","BOS - RP",1410,52,36,3.12,1.23,0,14]
["Nash Walters","LAA - RP",1416,0,0,0,0,0,0]
["Riley O'Brien","SEA - RP",1417,1,1,9,3,0,0]
["Ramón Rosso","DET - RP",1419,7,7,6.43,1.71,0,0]
["Justin Garza","LAA - RP",1424,10,10,4.5,1.5,0,0]
["Jay Flaa","BAL - RP",1428,0,0,0,0,0,0]
["Ryan Sherriff","BOS - RP",1435,9,6,3,1.22,0,2]
["Taylor Williams","SEA - RP",1437,10,12,6.3,1.6,0,4]
["Albert Abreu","NYY - RP",1439,32,32,4.22,1.44,0,2]
["Jake Fishman","OAK - RP",1443,6,3,4.5,1.17,0,1]
["Zack Burdi","TB - RP",1446,7,7,7.71,1.71,0,0]
["Darren McCaughan","SEA - RP",1447,3,1,9,1.33,0,0]
["Nick Ramirez","NYY - RP",1449,12,10,5.25,1.25,0,0]
["Blake Taylor","HOU - RP",1453,32,26,3.09,1.38,0,6]
["Dereck Rodríguez","MIN - RP",1454,6,3,6,1.83,0,0]
["Nicholas Padilla","CWS - RP",1459,1,1,9,2,0,0]
["Michael Feliz","MIN - RP",1460,9,10,9,1.67,0,0]
["Colten Brewer","TB - RP",1462,12,12,6.75,1.83,0,0]
["Zack Littell","TEX - RP",1465,46,42,4.3,1.33,0,5]
["Demarcus Evans","NYY - RP",1468,11,13,4.09,1.27,0,1]
["Brennan Bernardino","SEA - RP",1469,1,0,9,3,0,0]
["Evan Marshall","CWS - RP",1473,0,0,0,0,0,0]
["James Hoyt","LAA - RP",1480,0,0,0,0,0,0]
["Ian Hamilton","NYY - RP",1481,3,2,6,2,0,0]
["Rafael Dolis","TOR - RP",1486,0,0,0,0,0,0]
["Julian Fernández","TOR - RP",1490,2,1,13.5,2,0,0]
["Brad Peacock","KC - RP",1491,3,2,12,1.33,0,0]
["J.B. Bukauskas","SEA - RP",1503,6,5,7.5,1.67,0,0]
["Greg Holland","TEX - RP",1504,53,54,4.42,1.38,0,15]
["Phil Maton","HOU - RP",1505,65,79,4.29,1.32,0,11]
["Locke St. John","MIN - RP",1506,1,2,18,2,0,0]
["Keynan Middleton","CWS - RP",1508,24,20,5.25,1.42,0,3]
["Jhon Romero","MIN - RP",1509,4,4,4.5,1.75,0,0]
["Cody Poteet","KC - RP",1512,24,21,4.5,1.29,0,1]
["Jimmy Lambert","CWS - RP",1513,29,27,3.72,1.38,0,5]
["Jake Petricka","LAA - RP",1519,0,0,0,0,0,0]
["Jace Fry","DET - RP",1520,11,12,4.91,1.64,0,0]
["Ryan Buchter","SEA - RP",1521,0,0,0,0,0,0]
["Rico Garcia","OAK - RP",1526,9,4,5,1.44,0,1]
["Gerardo Reyes","LAA - RP",1528,1,0,9,4,0,0]
["Jose Cuas","KC - RP",1531,19,17,3.79,1.68,0,7]
["Dan Winkler","TEX - RP",1534,21,21,4.29,1.48,0,2]
["Anthony Swarzak","KC - RP",1536,0,0,0,0,0,0]
["Connor Sadzeck","MIN - RP",1540,2,1,9,1.5,0,0]
["Touki Toussaint","CLE - RP",1542,40,43,5.85,1.45,1,0]
["José De León","MIN - RP",1553,9,16,11,2.11,0,0]
["Anderson Severino","CWS - RP",1559,4,5,6.75,1.5,0,0]
["Brooks Kriske","KC - RP",1565,5,7,16.2,2.4,0,0]
["Brett Martin","TEX - RP",1568,52,38,3.46,1.33,0,10]
["Daniel Ponce de Leon","LAA - RP",1570,26,28,5.54,1.42,1,1]
["Gregory Santos","CWS - RP",1571,2,2,13.5,2.5,0,0]
["Enoli Paredes","HOU - RP",1575,14,15,3.86,1.71,0,3]
["Oliver Ortega","MIN - RP",1576,20,18,4.05,1.5,0,4]
["César Valdez","LAA - RP",1588,22,20,4.5,1.41,0,11]
["Nick Snyder","TEX - RP",1590,2,0,9,2.5,0,0]
["Sam Selman","OAK - RP",1591,0,0,0,0,0,0]
["DL Hall","BAL - RP",1598,43,62,3.98,1.3,4,0]
["Brandon Workman","TEX - RP",1601,0,0,0,0,0,0]
["Ralph Garza Jr.","MIN - RP",1609,28,18,3.54,1.43,0,1]
["Tommy Milone","SEA - RP",1610,31,26,6.1,1.45,1,0]
["Konner Wade","BAL - RP",1615,0,0,0,0,0,0]
["Edgar García","MIN - RP",1618,0,0,0,0,0,0]
["Pedro Báez","HOU - RP",1621,0,0,0,0,0,0]
["Arodys Vizcaíno","KC - RP",1622,3,2,6,2,0,1]
["David Hess","TB - RP",1626,10,6,9,2,0,1]
["Hirokazu Sawamura","BOS - RP",1627,0,0,0,0,0,0]
["Tyler Danish","NYY - RP",1628,20,16,5.4,1.3,0,2]
["Ronel Blanco","HOU - RP",1632,3,4,9,2,0,0]
["Will Vest","DET - RP",1634,65,62,3.88,1.28,0,24]
["David McKay","OAK - RP",1638,0,0,0,0,0,0]
["Sean Guenther","DET - RP",1641,7,5,9,1.86,0,0]
["Justin Grimm","OAK - RP",1643,0,0,0,0,0,0]
["Junior Fernández","TOR - RP",1646,18,13,5,1.78,0,2]
["Trevor Richards","TOR - SP,RP",1647,68,79,4.9,1.35,0,6]
["Alex Wells","BAL - RP",1648,98,61,5.6,1.39,4,0]
["Cody Sedlock","BAL - RP",1652,0,0,0,0,0,0]
["Jacob Barnes","TEX - RP",1653,29,28,5.9,1.38,0,3]
["Dusten Knight","CLE - RP",1655,8,8,7.88,1.62,0,0]
["Jeff Hoffman","MIN - RP",1658,56,58,5.14,1.59,0,1]
["Calvin Faucher","TB - RP",1660,11,11,5.73,1.64,0,2]
["Tanner Tully","NYY - RP",1662,3,1,6,2.33,0,0]
["Garrett Hill","DET - SP,RP",1663,30,20,4.2,1.4,1,1]
["Matt Brash","SEA - SP,RP",1666,25,31,4.68,1.6,0,5]
["Joely Rodríguez","BOS - RP",1667,46,52,4.3,1.37,0,10]
["Zack Britton","NYY - RP",1669,0,0,0,0,0,0]
["Tayler Saucedo","SEA - RP",1670,10,6,5.4,1.4,0,0]
["Luis Oviedo","CLE - RP",1671,10,10,9,2,0,0]
["Foster Griffin","KC - RP",1672,23,14,4.7,1.52,0,0]
["Bryan Shaw","CWS - RP",1675,58,51,5.12,1.48,0,11]
["Trent Thornton","TOR - RP",1686,42,39,4.71,1.43,0,2]
["Amir Garrett","KC - RP",1688,47,57,4.79,1.34,0,13]
["Randy Dobnak","MIN - RP",1692,38,21,5.68,1.45,1,0]
["Jake Diekman","CWS - RP",1693,59,81,3.81,1.41,0,22]
["John King","TEX - RP",1695,46,32,4.11,1.37,0,5]
["Matt Foster","CWS - RP",1696,48,48,4.31,1.25,0,5]
["Edwin Uceta","DET - RP",1699,15,15,6.6,1.4,0,0]
["Justin Topa","SEA - RP",1700,8,8,7.88,1.75,0,1]
["Chasen Shreve","DET - RP",1701,43,45,4.39,1.28,0,6]
["Phillip Diehl","CLE - RP",1702,6,3,10.5,1.5,0,0]
["Ronald Bolaños","KC - RP",1704,13,10,4.85,1.77,0,0]
["Paul Fry","TOR - RP",1707,32,40,5.06,1.5,0,7]
["Shawn Armstrong","TB - SP,RP",1712,50,54,4.5,1.3,0,4]
["Trevor Kelley","TB - RP",1713,13,14,6.92,1.61,0,1]
["Josh Sborz","TEX - RP",1714,33,40,4.64,1.46,0,4]
["Chris Devenski","LAA - RP",1715,11,10,9.82,1.82,0,0]
["Joe Smith","MIN - RP",1719,0,0,0,0,0,0]
["Chris Mazza","TB - RP",1720,77,70,3.86,1.27,0,0]
["Josh Staumont","KC - RP",1726,52,62,4.15,1.4,0,14]
["Davis Martin","CWS - SP,RP",1728,112,84,4.82,1.31,4,0]
["Jason Foley","DET - RP",1731,34,24,3.71,1.35,0,3]
["Zac Lowther","BAL - RP",1732,13,11,6.92,1.61,0,0]
["Patrick Murphy","MIN - RP",1734,15,14,4.8,1.67,0,2]
["Joe Kelly","CWS - RP",1736,38,47,4.26,1.34,0,13]
["José Ruiz","CWS - RP",1738,54,57,3.83,1.28,0,7]
["Reed Garrett","BAL - RP",1742,5,3,7.2,2.2,0,0]
["Wyatt Mills","BOS - RP",1743,19,17,5.68,1.47,0,2]
["Trevor Megill","MIN - RP",1745,30,35,5.7,1.6,0,2]
["Art Warren","NYY - RP",1746,25,31,5.04,1.44,0,4]
["Justus Sheffield","SEA - RP",1747,58,46,5.12,1.53,4,0]
["Matt Peacock","TOR - RP",1749,34,20,5.03,1.56,0,0]
["A.J. Alexy","CWS - RP",1750,64,44,5.06,1.27,2,0]
["Frank German","CWS - RP",1751,2,2,18,3,0,0]
["Jacob Lemoine","OAK - RP",1768,0,0,0,0,0,0]
["Cam Vieaux","LAA - RP",1769,4,8,11.25,2.75,0,1]
["Dennis Santana","MIN - RP",1770,55,50,4.91,1.38,0,13]
["Ashton Goudeau","DET - RP",1777,25,16,5.76,1.56,0,1]
["Kervin Castro","DET - RP",1778,11,10,5.73,1.54,0,0]
["Casey Lawrence","TOR - RP",1785,9,6,8,1.56,0,0]
["José Marte","LAA - RP",1788,7,9,7.71,2.14,0,0]
["Chad Smith","OAK - RP",1796,0,0,0,0,0,0]
["Heath Hembree","TB - RP",1797,39,45,6.92,1.54,0,8]
["Mike Baumann","BAL - SP,RP",1798,20,13,5.85,1.65,0,1]
["Mike Mayers","KC - SP,RP",1806,64,72,4.22,1.25,0,10]
["Nick Wittgren","KC - RP",1808,46,41,4.89,1.28,0,11]
["Travis Lakins Sr.","BAL - RP",1809,0,0,0,0,0,0]
["James Norwood","NYY - RP",1810,11,12,7.36,2,0,1]
["Collin Snider","KC - RP",1816,17,11,6.88,1.65,0,4]
["Cole Sands","MIN - SP,RP",1820,15,14,6,1.67,0,1]
["Max Castillo","KC - SP,RP",1822,80,76,5.85,1.35,0,0]
["Austin Voth","BAL - SP,RP",1833,92,84,5.09,1.45,1,3]
["Ryan Yarbrough","KC - SP,RP",1837,140,107,4.56,1.27,6,0]
["Kaleb Ort","BOS - RP",1841,14,14,6.43,1.86,0,2]
["Norge Ruiz","OAK - RP",1843,10,9,7.2,1.9,0,1]
["Jake Brentz","KC - RP",1847,0,0,0,0,0,0]
["Ryan Brasier","BOS - RP",1854,46,49,5.09,1.35,0,13]
["Garrett Richards","TEX - RP",1858,65,58,4.57,1.45,0,5]
["Tyler Alexander","DET - SP,RP",1880,102,75,4.32,1.3,3,2]
["Yusei Kikuchi","TOR - SP,RP",1882,124,137,4.86,1.39,8,1]
["Darwinzon Hernandez","BAL - RP",1885,20,28,6.3,1.85,0,5]
["Kutter Crawford","BOS - SP,RP",1895,39,39,5.77,1.46,2,0]
["Austin Davis","HOU - SP,RP",1902,40,44,6.08,1.55,0,3]
["Josh Fleming","TB - SP,RP",1903,67,47,4.97,1.42,1,1]
["Taylor Hearn","TEX - SP,RP",1909,93,90,4.84,1.41,2,2]
["Kirby Snead","OAK - RP",1910,25,20,5.4,1.68,0,4]
["Yennier Cano","BAL - RP",1923,9,11,12,2.33,0,0]
["Drew Hutchison","TOR - SP,RP",1939,60,37,4.2,1.48,1,0]
["Aaron Sanchez","MIN - SP,RP",1966,42,29,5.57,1.5,0,0]
["Jackson Kowar","KC - RP",1981,18,18,10.5,2.22,0,1]
["Mitch White","TOR - SP,RP",2035,66,56,4.91,1.39,1,0]
["Zach Thompson","TOR - SP,RP",2074,13,10,4.85,1.46,0,0]
["Adam Oller","OAK - SP,RP",2095,37,23,6.32,1.65,2,1]
["Carlos Hernández","KC - SP,RP",2151,63,48,5.43,1.59,2,1]
["Brad Keller","KC - SP,RP",3071,139,107,4.73,1.47,11,2]

{"sheet":"Data","index":12,"n_rows":50,"n_cols":11,"rows_kept":50}
["Owners","Position"]
["Brandon","Catcher"]
["Brett/Kyle","1st Base"]
["Bruce","2nd Base"]
["Cathy","3rd Base"]
["Mike","Short Stop"]
["Rhonda","Outfield #1"]
["Rob","Outfield #2"]
["Todd","Outfield #3"]
["N/A #1","DH"]
["N/A #2","Starting Pitcher #1"]
[null,"Starting Pitcher #2"]
["when adding owners, must change name here and in first tab and in all the macros (twice - once for owners and once for theowner)\n*also, if changing order, must change reference on first page to each owners name which is referenced under the owner's name on the player line -  change for all applicable owners","Starting Pitcher #3"]
[null,"Starting Pitcher #4"]
[null,"Starting Pitcher #5"]
[null,"Relief Pitcher #1"]
[null,"Relief Pitcher #2"]
[null,"Relief Pitcher #3"]
[null,"Relief Pitcher #4"]
[null,"Reserve Roster #1"]
[null,"Reserve Roster #2"]
[null,"Reserve Roster #3"]
[null,"Reserve Roster #4"]
[null,"Reserve Roster #5"]
[null,"Reserve Roster #6"]
[null,"Reserve Roster #7"]
[]
["Make sure every year to select all the players for each position and recreate the bookmark name (delete name first, then recreate name) to ensure all players get listed.",null,"catchers","first","second","third","ss","outfield","dh","pitchers","relief"]
["Ensure that all players are listed when clicking on the button."]
[]
[null,"Change Draft Order Yearly"]
[]
["Mike",1]
["Brandon",2]
["Cathy",3]
["Brett/Kyle",4]
["Bruce",5]
["Rhonda",6]
["Rob",7]
["Todd",8]
["N/A #1",9]
["N/A #2",10]
[]
[]
[]
[]
["Formulas to Retreive Name and Position"]
["=RIGHT(A1,LEN(A1)+ 5-FIND(\"-\",A1))","Position"]
["=LEFT(A1,FIND(\"-\",A1) -5)","Name"]
["=Trim(cell)","Trim the positions for extra space"]