{"text_format":"3","workbook":"xlsx","n_sheets":13,"sheets":["2018 Pre-Draft Rosters","Draft List","Summary","Catchers","1st Base","2nd Base","3rd Base","Short Stop","Outfield","DH","Pitchers","Relief Pitchers","Data"],"not_rendered":{"macros":1,"defined_names":49},"read":"whole","date_system":"1900"}

{"sheet":"2018 Pre-Draft Rosters","index":0,"n_rows":34,"n_cols":45,"rows_kept":34,"merged":[[0,1,0,4],[0,5,0,8],[0,9,0,12],[0,13,0,16],[0,17,0,20],[0,21,0,24],[0,25,0,28],[0,29,0,32],[0,33,0,36],[0,37,0,39],[0,41,0,43],[22,1,22,2],[22,5,22,6],[22,9,22,10],[22,13,22,14],[22,17,22,18],[22,21,22,22],[22,25,22,26],[22,29,22,30],[22,33,22,34],[22,37,22,38],[22,41,22,42],[23,1,23,2],[23,5,23,6],[23,9,23,10],[23,13,23,14],[23,17,23,18],[23,21,23,22],[23,25,23,26],[23,29,23,30],[23,33,23,34],[23,37,23,38],[23,41,23,42],[24,1,24,2],[24,5,24,6],[24,9,24,10],[24,13,24,14],[24,17,24,18],[24,21,24,22],[25,1,25,2],[25,5,25,6],[25,9,25,10],[25,13,25,14],[25,17,25,18],[25,21,25,22],[25,26,25,27],[25,30,25,31],[25,34,25,35],[25,38,25,39],[25,42,25,43]]}
[null,"Lightning (Mike Goodman)",{"$nulls":3},"Evolution (Bruce)",{"$nulls":3},"The Mad Batters (Colin)",{"$nulls":3},"Woap (Mike)",{"$nulls":3},"The Dominant Brand (Brandon)",{"$nulls":3},"Guzzlers (Rhonda)",{"$nulls":3},"Moneyballers (Rob)",{"$nulls":3}," Booya's (Cathy)",{"$nulls":3},"Freebirds (Todd)",{"$nulls":3},"Numbats (Tom)",{"$nulls":3},"Josh Gone-aldson (Dave)"]
[null,"Pos.","Player","$","years","Pos.","Player","$","years","Pos.","Player","$","years","Pos.","Player","$","years","Pos.","Player","$","years","Pos.","Player","$","years","Pos.","Player","$","years","Pos.","Player","$","years","Pos.","Player","$","years","Pos.","Player","$","years","Pos.","Player","$","years"]
[{"$f":"10-COUNT(D3,H3,L3,P3,T3,X3,AB3,AF3,AJ3,AN3,AR3)","v":0},"C","Gary Sánchez\nNYY - C",15,1,"C","Mike Zunino\nTB - C",6,1,"C","John Hicks\nDet - C,1B",5,1,"C","Salvador Perez\nKC - C",5,null,"C","Welington Castillo\nCWS - C",10,null,"C","Isiah Kiner-Falefa\nTex - C,2B,3B",1,null,"C","Omar Narváez\nSea - C",5,1,"C","Robinson Chirinos\nHou - C",12,null,"C",{"$nulls":3},"C","Willians Astudillo\nMin - C,3B",1,null,"C","Jonathan Lucroy\nOak - C ",3,1]
[0,"1B","Matt Olson\nOak - 1B",15,3,"1B","Joey Gallo\nTex - 1B,OF",10,1,"1B","Yuli Gurriel\nHou - 1B,2B,3B",10,1,"1B","Justin Smoak\nTor - 1B",3,null,"1B","Miguel Cabrera\nDet - 1B",26,1,"1B","C.J. Cron\nMin - 1B",5,1,"1B","Ryan O'Hearn\nKC - 1B",5,1,"1B","Luke Voit\nNYY - 1B",10,2,"1B",{"$nulls":3},"1B","Tyler White\nHou - 1B",5,1,"1B","José Abreu\nCWS - 1B",26]
[0,"2B","Jonathan Villar\nBal - 2B,SS",5,1,"2B","Yoán Moncada\nCWS - 2B",11,1,"2B","Willy Adames\nTB - 2B,SS",11,null,"2B","Joey Wendle\nTB - 2B,3B,SS,OF",5,1,"2B","Rougned Odor\nTex - 2B",16,null,"2B","Whit Merrifield\nKC - 1B,2B,OF",10,1,"2B","Niko Goodrum\nDet - 1B,2B,3B,SS,OF",10,2,"2B","José Ramírez\nCle - 2B,3B",15,1,"2B",{"$nulls":3},"2B","Jose Altuve\nHou - 2B",48,null,"2B","Dee Gordon\nSea - 2B, SS",41,1]
[0,"3B","Jurickson Profar\nOak - 1B,2B,3B,SS",5,1,"3B","Jeimer Candelario\nDet - 3B",3,null,"3B","Rafael Devers\nBos - 3B",15,3,"3B","Tim Beckham\nSea - 3B,SS",1,null,"3B","Carlos Santana\nCle - 1B,3B",25,null,"3B","Aledmys Díaz\nHou - 3B,SS",1,null,"3B","Asdrúbal Cabrera\nTex - 2B,3B,SS",10,null,"3B","Matt Chapman\nOak - 3B",37,null,"3B",{"$nulls":3},"3B","Miguel Sanó\nMin - 1B,3B",2,null,"3B","Miguel Andújar\nNYY - 3B",11,3]
[0,"SS","Jonathan Schoop\nMin - 2B,SS",11,null,"SS","Adalberto Mondesi\nKC - 2B,SS",10,2,"SS","Alex Bregman\nHou - 3B,SS",15,2,"SS","Gleyber Torres\nNYY - 2B,SS",15,3,"SS","Marcus Semien\nOak - SS",3,null,"SS","Tim Anderson\nCWS - SS",35,null,"SS","Andrelton Simmons\nLAA - SS",7,2,"SS","Didi Gregorius\nNYY - SS",6,1,"SS",{"$nulls":3},"SS","Carlos Correa\nHou - SS",45,null,"SS","Lourdes Gurriel Jr.\nTor - 2B,SS",1]
[0,"OF#1","J.D. Martinez\nBos - OF",55,1,"OF#1","Mookie Betts\nBos - OF",71,null,"OF#1","Mike Trout\nLAA - OF",66,null,"OF#1","Andrew Benintendi\nBos - OF",10,1,"OF#1","Michael Brantley\nHou - OF",8,2,"OF#1","Eddie Rosario\nMin - OF",30,null,"OF#1","Shin-soo Choo\nTex - OF",17,1,"OF#1","Mitch Haniger\nSea - OF",7,1,"OF#1",{"$nulls":3},"OF#1","Khris Davis\nOak - OF",35,1,"OF#1","Aaron Judge\nNYY - OF",15,2]
[0,"OF#2","Stephen Piscotty\nOak - OF",6,2,"OF#2","Daniel Palka\nCWS - OF",1,null,"OF#2","Brett Gardner\nNYY - OF",1,null,"OF#2","Domingo Santana\nSea - OF",25,null,"OF#2","Nicholas Castellanos\nDet - OF",35,null,"OF#2","Nomar Mazara\nTex - OF",28,null,"OF#2","Giancarlo Stanton\nNYY - OF",56,1,"OF#2","Aaron Hicks\nNYY - OF",5,1,"OF#2",{"$nulls":3},"OF#2","Ramón Laureano\nOak - OF",5,1,"OF#2","Jake Bauers\nCle - 1B,OF",5]
[0,"OF#3","George Springer\nHou - OF",57,null,"OF#3","Avisaíl García\nTB - OF",1,null,"OF#3","Kyle Tucker\nHou - OF",10,2,"OF#3","Max Kepler\nMin - OF",1,null,"OF#3","Byron Buxton\nMin - OF",11,null,"OF#3","Jackie Bradley Jr.\nBos - OF",1,null,"OF#3","Randal Grichuk\nTor - OF",6,null,"OF#3","Mallex Smith\nSea - OF",37,null,"OF#3",{"$nulls":3},"OF#3","Justin Upton\nLAA - OF",15,null,"OF#3","Billy Hamilton\nKC - OF",3]
[0,"DH","Elvis Andrus\nTex - SS",15,null,"DH","Francisco Lindor\nCle - SS",51,null,"DH","Xander Bogaerts\nBos - SS",45,null,"DH","Jorge Soler\nKC - OF",1,null,"DH","Shohei Ohtani (Batter) \nLAA - Util",15,3,"DH","Albert Pujols\nLAA - 1B",1,null,"DH","Neslon Cruz\nMin - Util",35,null,"DH","Jason Kipnis\nCle - 2B,OF",1,null,"DH",{"$nulls":3},"DH","Marwin González\nHou - 1B,2B,SS,OF",8,null,"DH","Edwin Encarnacion\nSea - 1B",27]
[0,"SP#1","Eduardo Rodriguez\nBos - SP",15,2,"SP#1","José Berríos\nMin - SP",15,2,"SP#1","Blake Snell\nTB - SP",10,1,"SP#1","Michael Fulmer\nDet - SP",15,1,"SP#1","Carlos Carrasco\nCle - SP",37,1,"SP#1","Gerrit Cole\nHou - SP",30,1,"SP#1","Lance Lynn\nTex - SP",19,1,"SP#1","David Price\nBos - SP",30,1,"SP#1",{"$nulls":3},"SP#1","CC Sabathia\nNYY - SP",9,null,"SP#1","Chris Sale\nBos - SP",52,1]
[0,"SP#2","Jake Odorizzi\nMin - SP",7,null,"SP#2","Shane Bieber\nCle - SP",10,2,"SP#2","Matthew Boyd\nDet - SP",5,1,"SP#2","Corey Kluber\nCle - SP",47,1,"SP#2","J.A. Happ\nNYY - SP",26,null,"SP#2","Jakob Junis\nKC - SP",1,1,"SP#2","Nathan Eovaldi\nBos - SP",10,null,"SP#2","Tyler Skaggs\nLAA - SP",12,2,"SP#2",{"$nulls":3},"SP#2","Wade Miley\nHou - SP",8,null,"SP#2","Andrew Heaney\nLAA - SP",1,1]
[0,"SP#3","Michael Pineda\nMin - SP",7,null,"SP#3","Reynaldo López\nCWS - SP",6,2,"SP#3","Lucas Giolito\nCWS - SP",1,null,"SP#3","Kyle Gibson\nMin - SP",5,1,"SP#3","Dallas Keuchel\nHou - SP",10,null,"SP#3","Justin Verlander\nHou - SP",60,null,"SP#3","Mike Fiers\nOak - SP",7,null,"SP#3","Luis Severino\nNYY - SP",26,null,"SP#3",{"$nulls":3},"SP#3","Chris Bassitt\nOak - SP",2,null,"SP#3","Marco Gonzales\nSea - SP",5,1]
[0,"SP#4","Dylan Bundy\nBal - SP",5,null,"SP#4","Yusei Kikuchi\nSea - SP",26,null,"SP#4","James Paxton\nNYY - SP",40,null,"SP#4","Trevor Bauer\nCle - SP",45,null,"SP#4","Marcus Stroman\nTor - SP",7,null,"SP#4","Mike Clevinger\nCle - SP",38,null,"SP#4","Rick Porcello\nBos - SP",19,null,"SP#4","Gio Gonzalez \nNYY - SP",1,null,"SP#4",{"$nulls":3},"SP#4","Mike Minor\nTex - SP",2,null,"SP#4","Masahiro Tanaka\nNYY - SP",30]
[{"$f":"10-COUNT(D16,H16,L16,P16,T16,X16,AB16,AF16,AJ12,AN16,AR16)","v":0},"SP#5","Matt Harvey\nLAA - SP",1,null,"SP#5","Matt Shoemaker\nTor - SP",1,null,"SP#5","Carlos Rodón\nCWS - SP",8,null,"SP#5","Charlie Morton\nTB - SP",28,null,"SP#5","Wade LeBlanc\nSea - SP,RP",6,null,"SP#5","Frankie Montas\nOak - SP",1,null,"SP#5","Aaron Sanchez\nTor - SP",12,null,"SP#5","Clay Buchholz \nTor - SP",1,null,"SP#5",{"$nulls":3},"SP#5","Trevor Cahill\nLAA - SP",2,null,"SP#5","Shohei Ohtani\nLAA - SP",8]
[{"$f":"10-COUNT(D17,H17,L17,P17,T17,X17,AB17,AF17,AJ17,AN17,AR17)","v":0},"RP#1","Blake Treinen\nOak - RP",35,null,"RP#1","Brad Peacock\nHou - RP",10,1,"RP#1","Wily Peralta\nKC - RP",5,1,"RP#1","Roberto Osuna\nHou - RP",42,1,"RP#1","Joakim Soria\nOak - RP",5,1,"RP#1","José Leclerc\nTex - RP",15,3,"RP#1","Ryan Buchter\nOak - RP",1,1,"RP#1","Shane Greene\nDet - RP",5,null,"RP#1",{"$nulls":3},"RP#1","Trevor May\nMin - RP",5,1,"RP#1","Mychal Givens\nBal - RP",3,1]
[{"$f":"10-COUNT(D18,H18,L18,P18,T18,X18,AB18,AF18,AJ18,AN18,AR18)","v":0},"RP#2","Diego Castillo\nTB - SP,RP",4,null,"RP#2","Ryan Yarbrough\nTB - SP,RP",1,1,"RP#2","Cory Gearrin\nSea - RP",2,null,"RP#2","Matt Festa\nSea - RP",1,null,"RP#2","Craig Kimbrel\nBos - RP",8,null,"RP#2","Taylor Rogers\nMin - RP",1,null,"RP#2","Dellin Betances\nNYY - RP",17,null,"RP#2","Fernando Rodney\nOak - RP",1,null,"RP#2",{"$nulls":3},"RP#2","Ken Giles\nTor - RP",19,null,"RP#2","Matt Barnes\nBos - RP",21]
[{"$f":"10-COUNT(D19,H19,L19,P19,T19,X19,AB19,AF19,AJ19,AN19,AR19)","v":0},"RP#3","Shawn Armstrong\nSea - RP",1,null,"RP#3","José Alvarado\nTB - RP",10,2,"RP#3","Brad Boxberger\nKC - RP",6,null,"RP#3","Brad Keller\nKC - SP,RP",5,null,"RP#3","Kelvin Herrera\nCWS - RP",6,null,"RP#3","Jesse Chávez\nTex - RP",1,null,"RP#3","Adam Ottavino\nNYY - RP",8,null,"RP#3","Blake Parker\nMin - RP",1,null,"RP#3",{"$nulls":3},"RP#3","Cody Allen\nLAA - RP",25,null,"RP#3","Hunter Strickland\nSea - RP",4]
[{"$f":"10-COUNT(D20,H20,L20,P20,T20,X20,AB20,AF20,AJ20,AN20,AR20)","v":0},"RP#4","Jonathan Loaisiga\nNYY - SP,RP",1,null,"RP#4","Lou Trivino\nOak - RP",1,null,"RP#4","Yonny Chirinos\nTB - SP,RP",5,1,"RP#4","Ryan Pressly\nHou - RP",6,null,"RP#4","Chad Green\nNYY - RP",6,null,"RP#4","Ryan Brasier\nBos - RP",1,null,"RP#4","Collin McHugh\nHou - RP",12,null,"RP#4","Aroldis Chapman\nNYY - RP",53,1,"RP#4",{"$nulls":3},"RP#4","Alex Colomé\nCWS - RP",19,null,"RP#4","Ryne Stanek\nTB - SP,RP",1]
[null,null,"Current Used Points",{"$f":"SUM(D3:D20)","v":260},null,null,"Current Used Points",{"$f":"SUM(H3:H20)","v":244},null,null,"Current Used Points",{"$f":"SUM(L3:L20)","v":260},null,null,"Current Used Points",{"$f":"SUM(P3:P20)","v":260},null,null,"Current Used Points",{"$f":"SUM(T3:T20)","v":260},null,null,"Current Used Points",{"$f":"SUM(X3:X20)","v":260},null,null,"Current Used Points",{"$f":"SUM(AB3:AB20)","v":256},null,null,"Current Used Points",{"$f":"SUM(AF3:AF20)","v":260},null,null,"Current Used Points",{"$f":"SUM(AJ3:AJ20)","v":0},null,null,"Current Used Points",{"$f":"SUM(AN3:AN20)","v":255},null,null,"Current Used Points",{"$f":"SUM(AR3:AR20)","v":257}]
[null,null,"Remaining Points",{"$f":"SUM(260-D21)","v":0},null,null,"Remaining Points",{"$f":"SUM(260-H21)","v":16},null,null,"Remaining Points",{"$f":"SUM(260-L21)","v":0},null,null,"Remaining Points",{"$f":"SUM(260-P21)","v":0},null,null,"Remaining Points",{"$f":"SUM(260-T21)","v":0},null,null,"Remaining Points",{"$f":"SUM(260-X21)","v":0},null,null,"Remaining Points",{"$f":"SUM(260-AB21)","v":4},null,null,"Remaining Points",{"$f":"SUM(260-AF21)","v":0},null,null,"Remaining Points",{"$f":"SUM(260-AJ21)","v":260},null,null,"Remaining Points",{"$f":"SUM(260-AN21)","v":5},null,null,"Remaining Points",{"$f":"SUM(260-AR21)","v":3}]
[null,"Maximum Bidding Points",null,{"$f":"(D22-(18-COUNT(D3:D20))+(IF(COUNT(D3:D20)=18,0,1)))","v":0},null,"Maximum Bidding Points",null,{"$f":"(H22-(18-COUNT(H3:H20))+(IF(COUNT(H3:H20)=18,0,1)))","v":16},null,"Maximum Bidding Points",null,{"$f":"(L22-(18-COUNT(L3:L20))+(IF(COUNT(L3:L20)=18,0,1)))","v":0},null,"Maximum Bidding Points",null,{"$f":"(P22-(18-COUNT(P3:P20))+(IF(COUNT(P3:P20)=18,0,1)))","v":0},null,"Maximum Bidding Points",null,{"$f":"(T22-(18-COUNT(T3:T20))+(IF(COUNT(T3:T20)=18,0,1)))","v":0},null,"Maximum Bidding Points",null,{"$f":"(X22-(18-COUNT(X3:X20))+(IF(COUNT(X3:X20)=18,0,1)))","v":0},null,"Maximum Bidding Points",null,{"$f":"(AB22-(18-COUNT(AB3:AB20))+(IF(COUNT(AB3:AB20)=18,0,1)))","v":4},null,"Maximum Bidding Points",null,{"$f":"(AF22-(18-COUNT(AF3:AF20))+(IF(COUNT(AF3:AF20)=18,0,1)))","v":0},null,"Maximum Bidding Points",null,{"$f":"(AJ22-(18-COUNT(AJ3:AJ20))+(IF(COUNT(AJ3:AJ20)=18,0,1)))","v":243},null,"Maximum Bidding Points",null,{"$f":"(AN22-(18-COUNT(AN3:AN20))+(IF(COUNT(AN3:AN20)=18,0,1)))","v":5},null,"Maximum Bidding Points",null,{"$f":"(AR22-(18-COUNT(AR3:AR20))+(IF(COUNT(AR3:AR20)=18,0,1)))","v":3}]
[null,"Remaining # of Players to Draft",null,{"$f":"18-COUNT(D3:D20)","v":0},null,"Remaining # of Players to Draft",null,{"$f":"18-COUNT(H3:H20)","v":0},null,"Remaining # of Players to Draft",null,{"$f":"18-COUNT(L3:L20)","v":0},null,"Remaining # of Players to Draft",null,{"$f":"18-COUNT(P3:P20)","v":0},null,"Remaining # of Players to Draft",null,{"$f":"18-COUNT(T3:T20)","v":0},null,"Remaining # of Players to Draft",null,{"$f":"18-COUNT(X3:X20)","v":0},null,"Remaining # of Players to Draft",null,{"$f":"18-COUNT(AB3:AB20)","v":0},null,"Remaining # of Players to Draft",null,{"$f":"18-COUNT(AF3:AF20)","v":0},null,"Remaining # of Players to Draft",null,{"$f":"18-COUNT(AJ3:AJ20)","v":18},null,"Remaining # of Players to Draft",null,{"$f":"18-COUNT(AN3:AN20)","v":0},null,"Remaining # of Players to Draft",null,{"$f":"18-COUNT(AR3:AR20)","v":0}]
[]
[]
[null,null,"Danny Jansen\nTor - C",5,"r2019",null,"Eloy Jiménez\nCWS - OF",9,"r2019",null,"Forrest Whitley\nHou - SP",5,"r2019",null,"Ryon Healy\nSea - 1B",5,null,null,"Yonder Alonso\nCWS - 1B",5,null,null,"David Fletcher\nLAA - 2B,3B",5,"r2019",null,"Bo Bichette\nTor - SS",1,null,null,"Steve Pearce\nBos - 1B,OF",5,{"$nulls":6},"Austin Meadows\nTB - OF",5,"r2019",null,"Tommy Pham\nTB - OF",5,"r2019"]
[null,null,"Jo Adell\nLAA - OF",5,"r2019",null,"Jorge Polanco\nMin - SS",5,"r2019",null,"Tyler Glasnow\nTB - SP,RP",5,"r2019",null,"Ronald Guzmán\nTex - 1B",5,null,null,"Marco Estrada\nOak - SP",5,null,null,"Yandy Díaz\nTB - 1B,3B",5,null,null,"Vladimir Guerrero Jr.\nTor - 3B",5,null,null,"Ivan Nova\nCWS - SP",5,{"$nulls":6},"Jesus Luzardo\nOak - SP",5,"r2019",null,"DJ LeMahieu\nNYY - 2B",5]
[null,null,"Christin Stewart\nDet - OF",5,"r2019",null,"Brad Hand\nCle - RP",5,"r2019",null,"Josh James\nHou - SP",5,"r2019",null,"Kole Calhoun\nLAA - OF",5,null,null,"Josh Reddick\nHou - OF",5,null,null,"Kevin Pillar\nTor - OF",5,null,null,"Sean Reid-Foley\nTor - SP",5,null,null,"Jon Jay\nCWS - OF",5,{"$nulls":6},"Dylan Cease\nCWS - SP",5,"r2019",null,"Delino DeShields\nTex - OF",5]
[null,null,"Ryan Borucki\nTor - SP",5,null,null,"Kyle Seager\nSea - 3B",5,null,null,"Lance McCullers Jr.\nHou - SP",5,null,null,"Hanley Ramirez\nBos - 1B",5,null,null,"Jordan Zimmermann\nDet - SP",5,null,null,"Felix Peña\nLAA - SP",5,null,null,"James Shields\nCWS - SP",5,null,null,"Tyson Ross\nDet - SP,RP",5,{"$nulls":6},"Brandon Lowe\nTB - 2B,OF",5,null,null,"Domingo Germán\nNYY - SP,RP",5]
[null,null,"Framber Valdez\nHou - SP",5,null,null,"Teoscar Hernández\nTor - OF",5,null,null,"Trey Mancini\nBal - 1B,OF",5,null,null,"Spencer Turnbull\nDet - SP",5,null,null,"Robbie Grossman\nMin - OF",5,null,null,"Danny Salazar\nCle - SP",5,null,null,"Mark Trumbo\nBal - OF",5,null,null,"Matt Davidson\nTex - 1B,3B",5,{"$nulls":6},"Justus Sheffield\nSea - RP",5,null,null,"Michael Kopech\nCWS - SP",5]
[null,null,"carlos gonzalez",5,null,null,"Jay Bruce\nSea - 1B,OF",5,null,null,"Brent Honeywell\nTB - SP",5,null,null,"Brett Anderson\nOak - SP",5,null,null,"Yusmeiro Petit\nOak - RP",5,null,null,"Zack Britton\nNYY - RP",5,null,null,"Joe Biagini\nTor - SP,RP",5,null,null,"Mike Leake\nSea - SP",5,{"$nulls":6},"Greg Bird\nNYY - 1B",5,null,null,"Blake Swihart\nBos - C,1B,OF",5]
[null,null,"Sean Manaea\nOak - SP",5,null,null,"Willie Calhoun\nTex - OF",5,null,null,"Eduardo Núñez\nBos - 2B,3B",5,null,null,"Christian Vázquez\nBos - C",5,null,null,"Freddy Galvis\nTor - 2B,SS",5,null,null,"Troy Tulowitzki\nNYY - SS",5,null,null,"Rowdy Tellez\nTor - 1B",5,null,null,"Mitch Garver\nMin - C",5,{"$nulls":6},"Chad Pinder\nOak - 2B,3B,OF",5,null,null,"Jaime Barria\nLAA - SP",5]
[null,null,{"$f":"\"Draft Order = \"&VLOOKUP(\"Lightning (Mike Goodman)\",draft_order,2,FALSE)","v":"Draft Order = 11"},{"$nulls":3},{"$f":"\"Draft Order = \"&VLOOKUP(\"Evolution (Bruce)\",draft_order,2,FALSE)","v":"Draft Order = 5"},{"$nulls":3},{"$f":"\"Draft Order = \"&VLOOKUP(\"The Mad Batters (Colin)\",draft_order,2,FALSE)","v":"Draft Order = 4"},{"$nulls":3},{"$f":"\"Draft Order = \"&VLOOKUP(\"Woap (Mike)\",draft_order,2,FALSE)","v":"Draft Order = 7"},{"$nulls":3},{"$f":"\"Draft Order = \"&VLOOKUP(\"The Dominant Brand (Brandon)\",draft_order,2,FALSE)","v":"Draft Order = 1"},{"$nulls":3},{"$f":"\"Draft Order = \"&VLOOKUP(\"Guzzlers (Rhonda)\",draft_order,2,FALSE)","v":"Draft Order = 10"},{"$nulls":3},{"$f":"\"Draft Order = \"&VLOOKUP(\"Moneyballers (Rob)\",draft_order,2,FALSE)","v":"Draft Order = 2"},{"$nulls":3},{"$f":"\"Draft Order = \"&VLOOKUP(\"Booya's (Cathy)\",draft_order,2,FALSE)","v":"Draft Order = 8"},{"$nulls":3},{"$f":"\"Draft Order = \"&VLOOKUP(\"Freebirds (Todd)\",draft_order,2,FALSE)","v":"Draft Order = 3"},{"$nulls":3},{"$f":"\"Draft Order = \"&VLOOKUP(\"Numbats (Tom)\",draft_order,2,FALSE)","v":"Draft Order = 9"},{"$nulls":3},{"$f":"\"Draft Order = \"&VLOOKUP(\"Josh Gone-aldson (Dave)\",draft_order,2,FALSE)","v":"Draft Order = 6"}]

{"sheet":"Draft List","index":1,"n_rows":251,"n_cols":12,"rows_kept":251}
[250,"Owner","Player","Bid","Team/Position","Rank","AB/Innings","R/Wins","HR/Saves","RBI/SO","SB/ERA","Avg./WHIP"]
[]
[2,"Lightning (Mike Goodman)","Gary Sánchez","15","NYY - C",69,"60/323",51,18,53,1,0.186]
[3,"Lightning (Mike Goodman)","Matt Olson","15","Oak - 1B",86,"143/580",85,29,84,2,0.247]
[4,"Lightning (Mike Goodman)","Jonathan Villar","5","Bal - 2B,SS",87,"121/466",54,14,46,35,0.26]
[5,"Lightning (Mike Goodman)","Jurickson Profar","5","Oak - 1B,2B,3B,SS",143,"133/524",82,20,77,10,0.254]
[6,"Lightning (Mike Goodman)","J.D. Martinez","55","Bos - OF",5,"188/569",111,43,130,6,0.33]
[7,"Lightning (Mike Goodman)","Stephen Piscotty","6","Oak - OF",130,"146/546",78,27,88,2,0.267]
[8,"Lightning (Mike Goodman)","Eduardo Rodriguez","15","Bos - SP","153","129.2","13","0","146","3.82","1.26"]
[9,"Lightning (Mike Goodman)","Danny Jansen","5","Tor - C",280,"20/81",12,3,8,0,0.247]
[10,"Lightning (Mike Goodman)","Jo Adell","5","LAA - OF",2086,"-/-","-","-","-","-","-"]
[11,"Lightning (Mike Goodman)","Christin Stewart","5","Det - OF",1688,"15/60",7,2,10,0,0.25]
[12,"The Mad Batters (Colin)","John Hicks","5","Det - C,1B",1488,"75/288",35,9,32,0,0.26]
[13,"The Mad Batters (Colin)","Yuli Gurriel","10","Hou - 1B,2B,3B",177,"156/537",70,13,85,5,0.291]
[14,"The Mad Batters (Colin)","Rafael Devers","15","Bos - 3B",109,"108/450",59,21,66,5,0.24]
[15,"The Mad Batters (Colin)","Alex Bregman","15","Hou - 3B,SS",17,"170/594",105,31,103,10,0.286]
[16,"The Mad Batters (Colin)","Kyle Tucker","10","Hou - OF",239,"9/64",10,0,4,1,0.141]
[17,"The Mad Batters (Colin)","Blake Snell","10","TB - SP","30","180.2","21","0","221","1.89","0.97"]
[18,"The Mad Batters (Colin)","Matthew Boyd","5","Det - SP","314","170.1","9","0","159","4.39","1.16"]
[19,"The Mad Batters (Colin)","Yonny Chirinos","5","TB - SP,RP","443","89.2","5","0","75","3.51","1.22"]
[20,"The Mad Batters (Colin)","Wily Peralta","5","KC - RP","598","34.1","1","14","35","3.67","1.49"]
[21,"The Mad Batters (Colin)","Forrest Whitley","5","Hou - SP","280","-","-","-","-","-","-"]
[22,"The Mad Batters (Colin)","Tyler Glasnow","5","TB - SP,RP","186","111.2","2","0","136","4.27","1.27"]
[23,"The Mad Batters (Colin)","Josh James","5","Hou - SP","208","23.0","2","0","29","2.35","0.96"]
[24,"Woap (Mike)","Joey Wendle","5","TB - 2B,3B,SS,OF",249,"146/487",62,7,61,16,0.3]
[25,"Woap (Mike)","Gleyber Torres","15","NYY - 2B,SS",61,"117/431",54,24,77,6,0.271]
[26,"Woap (Mike)","Andrew Benintendi","10","Bos - OF",22,"168/579",103,16,87,21,0.29]
[27,"Woap (Mike)","Michael Fulmer","15","Det - SP","250","132.1","3","0","110","4.69","1.31"]
[28,"Woap (Mike)","Corey Kluber","47","Cle - SP","24","215.0","20","0","222","2.89","0.99"]
[29,"Woap (Mike)","Kyle Gibson","5","Min - SP","287","196.2","10","0","179","3.62","1.30"]
[30,"Woap (Mike)","Roberto Osuna","42","Hou - RP","89","38.0","2","21","32","2.37","0.97"]
[31,"The Dominant Brand (Brandon)","Miguel Cabrera","26","Det - 1B",141,"40/134",17,3,22,0,0.299]
[32,"The Dominant Brand (Brandon)","Michael Brantley","8","Hou - OF",106,"176/570",89,17,76,12,0.309]
[33,"The Dominant Brand (Brandon)","Shohei Ohtani (Batter) ","15","LAA - Util","365","93/326","59","22","61","10",".285"]
[34,"The Dominant Brand (Brandon)","Carlos Carrasco","37","Cle - SP","49","192.0","17","0","231","3.38","1.13"]
[35,"The Dominant Brand (Brandon)","Joakim Soria","5","Oak - RP","354","60.2","3","16","75","3.12","1.14"]
[36,"Guzzlers (Rhonda)","C.J. Cron","5","Min - 1B",245,"127/501",68,30,74,1,0.253]
[37,"Guzzlers (Rhonda)","Whit Merrifield","10","KC - 1B,2B,OF",42,"192/632",88,12,60,45,0.304]
[38,"Guzzlers (Rhonda)","Gerrit Cole","30","Hou - SP","31","200.1","15","0","276","2.88","1.03"]
[39,"Guzzlers (Rhonda)","Jakob Junis","1","KC - SP","326","177.0","9","0","164","4.37","1.27"]
[40,"Guzzlers (Rhonda)","José Leclerc","15","Tex - RP","149","57.2","2","12","85","1.56","0.85"]
[41,"Guzzlers (Rhonda)","David Fletcher","5","LAA - 2B,3B",1541,"78/284",35,1,25,3,0.275]
[42,"Moneyballers (Rob)","Omar Narváez","5","Sea - C",1499,"77/280",30,9,30,0,0.275]
[43,"Moneyballers (Rob)","Ryan O'Hearn","5","KC - 1B",1533,"39/149",23,12,30,0,0.262]
[44,"Moneyballers (Rob)","Niko Goodrum","10","Det - 1B,2B,3B,SS,OF",606,"109/444",55,16,53,12,0.245]
[45,"Moneyballers (Rob)","Andrelton Simmons","7","LAA - SS",173,"162/554",68,11,75,10,0.292]
[46,"Moneyballers (Rob)","Shin-soo Choo","17","Tex - OF",197,"148/560",83,21,62,6,0.264]
[47,"Moneyballers (Rob)","Giancarlo Stanton","56","NYY - OF",16,"164/617",102,38,100,5,0.266]
[48,"Moneyballers (Rob)","Lance Lynn","19","Tex - SP","1353","156.2","10","0","161","4.77","1.53"]
[49,"Moneyballers (Rob)","Ryan Buchter","1","Oak - RP","380","39.1","6","0","41","2.75","1.19"]
[50,"Moneyballers (Rob)","Bo Bichette","1","Tor - SS",1989,"-/-","-","-","-","-","-"]
[51,"Moneyballers (Rob)","Vladimir Guerrero Jr.","5","Tor - 3B",49,"-/-","-","-","-","-","-"]
[52,"Numbats (Tom)","Tyler White","5","Hou - 1B",230,"58/210",27,12,42,0,0.276]
[53,"Numbats (Tom)","Khris Davis","35","Oak - OF",37,"142/576",98,48,123,0,0.247]
[54,"Numbats (Tom)","Ramón Laureano","5","Oak - OF",205,"45/156",27,5,19,7,0.288]
[55,"Numbats (Tom)","Trevor May","5","Min - RP","290","25.1","4","3","36","3.20","1.03"]
[56,"Numbats (Tom)","Austin Meadows","5","TB - OF",174,"51/178",19,6,17,5,0.287]
[57,"Numbats (Tom)","Jesus Luzardo","5","Oak - SP","272","-","-","-","-","-","-"]
[58,"Numbats (Tom)","Dylan Cease","5","CWS - SP","960","-","-","-","-","-","-"]
[59,"Josh Gone-aldson (Dave)","Jonathan Lucroy","3","LAA - C",1469,"100/415",41,4,51,0,0.241]
[60,"Josh Gone-aldson (Dave)","Dee Gordon","41","Sea - 2B,SS,OF",129,"149/556",62,4,36,30,0.268]
[61,"Josh Gone-aldson (Dave)","Miguel Andújar","11","NYY - 3B",76,"170/573",83,27,92,2,0.297]
[62,"Josh Gone-aldson (Dave)","Aaron Judge","15","NYY - OF",13,"115/413",77,27,67,6,0.278]
[63,"Josh Gone-aldson (Dave)","Chris Sale","52","Bos - SP","10","158.0","12","0","237","2.11","0.86"]
[64,"Josh Gone-aldson (Dave)","Marco Gonzales","5","Sea - SP","308","166.2","13","0","145","4.00","1.22"]
[65,"Josh Gone-aldson (Dave)","Andrew Heaney","1","LAA - SP","187","180.0","9","0","180","4.15","1.20"]
[66,"Josh Gone-aldson (Dave)","Mychal Givens","3","Bal - RP","249","76.2","0","9","79","3.99","1.19"]
[67,"Josh Gone-aldson (Dave)","Tommy Pham","5","TB - OF",80,"136/494",102,21,63,15,0.275]
[68,"Evolution (Bruce)","Mike Zunino","6","TB - C",268,"75/373",37,20,44,0,0.201]
[69,"Evolution (Bruce)","Joey Gallo","10","Tex - 1B,OF",103,"103/500",82,40,92,3,0.206]
[70,"Evolution (Bruce)","Yoán Moncada","11","CWS - 2B",139,"136/578",73,17,61,12,0.235]
[71,"Evolution (Bruce)","Adalberto Mondesi","10","KC - 2B,SS",82,"76/275",47,14,37,32,0.276]
[72,"Evolution (Bruce)","José Berríos","15","Min - SP","71","192.1","12","0","202","3.84","1.14"]
[73,"Evolution (Bruce)","Shane Bieber","10","Cle - SP","164","114.2","11","0","118","4.55","1.33"]
[74,"Evolution (Bruce)","Reynaldo López","6","CWS - SP","506","188.2","7","0","151","3.91","1.27"]
[75,"Evolution (Bruce)","Brad Peacock","10","Hou - RP","356","65.0","3","3","96","3.46","1.17"]
[76,"Evolution (Bruce)","Ryan Yarbrough","1","TB - SP,RP","377","147.1","16","0","128","3.91","1.29"]
[77,"Evolution (Bruce)","José Alvarado","10","TB - RP","258","64.0","1","8","80","2.39","1.11"]
[78,"Evolution (Bruce)","Eloy Jiménez","9","CWS - OF",102,"-/-","-","-","-","-","-"]
[79,"Evolution (Bruce)","Jorge Polanco","5","Min - SS",252,"87/302",38,6,42,7,0.288]
[80,"Evolution (Bruce)","Brad Hand","5","Cle - RP","107","72.0","2","32","106","2.75","1.11"]
[81,"Booya's (Cathy)","Luke Voit","10","NYY - 1B",204,"46/143",30,15,36,0,0.322]
[82,"Booya's (Cathy)","José Ramírez","15","Cle - 2B,3B",6,"156/578",110,39,105,34,0.27]
[83,"Booya's (Cathy)","Didi Gregorius","6","NYY - SS",276,"135/504",89,27,86,10,0.268]
[84,"Booya's (Cathy)","Mitch Haniger","7","Sea - OF",67,"170/596",90,26,93,8,0.285]
[85,"Booya's (Cathy)","David Price","30","Bos - SP","97","176.0","16","0","177","3.58","1.14"]
[86,"Booya's (Cathy)","Tyler Skaggs","12","LAA - SP","221","125.1","8","0","129","4.02","1.33"]
[87,"Booya's (Cathy)","Aroldis Chapman","53","NYY - RP","77","51.1","3","32","93","2.45","1.05"]
[88,"Booya's (Cathy)","Aaron Hicks","5","NYY - OF",97,"119/480",90,27,79,11,0.248]
[89,"Booya's (Cathy)","Matt Chapman","37","Oak - 3B",89,"152/547",100,24,68,1,0.278]
[90,"Woap (Mike)","Salvador Perez","5","KC - C",146,"120/510",52,27,80,1,0.235]
[91,"Numbats (Tom)","Jose Altuve","48","Hou - 2B",12,"169/534",84,13,61,17,0.316]
[92,"The Mad Batters (Colin)","Mike Trout","66","LAA - OF",1,"147/471",101,39,79,24,0.312]
[93,"Evolution (Bruce)","Mookie Betts","71","Bos - OF",2,"180/520",129,32,80,30,0.346]
[94,"Josh Gone-aldson (Dave)","José Abreu","26","CWS - 1B",50,"132/499",68,22,78,2,0.265]
[95,"Josh Gone-aldson (Dave)","Edwin Encarnacion","27","Sea - 1B",85,"123/500",74,32,107,3,0.246]
[96,"The Dominant Brand (Brandon)","Welington Castillo","10","CWS - C",291,"44/170",17,6,15,1,0.259]
[97,"Moneyballers (Rob)","Neslon Cruz","35","Min - Util",63,"133/519",70,37,97,1,0.256]
[98,"Lightning (Mike Goodman)","George Springer","57","Hou - OF",41,"144/544",102,22,71,6,0.265]
[99,"Numbats (Tom)","Justin Upton","15","LAA - OF",57,"137/533",80,30,85,8,0.257]
[100,"Guzzlers (Rhonda)","Eddie Rosario","30","Min - OF",60,"161/559",87,24,77,8,0.288]
[101,"Guzzlers (Rhonda)","Justin Verlander","60","Hou - SP","25","214.0","16","0","290","2.52","0.90"]
[102,"Booya's (Cathy)","Luis Severino","26","NYY - SP","33","191.1","19","0","220","3.39","1.14"]
[103,"The Dominant Brand (Brandon)","Nicholas Castellanos","35","Det - OF",70,"185/620",88,23,89,2,0.298]
[104,"Evolution (Bruce)","Francisco Lindor","51","Cle - SS",3,"183/661",129,38,92,25,0.277]
[105,"Booya's (Cathy)","Mallex Smith","37","Sea - OF",125,"142/480",65,2,40,40,0.296]
[106,"Booya's (Cathy)","Robinson Chirinos","12","Hou - C",553,"80/360",48,18,65,2,0.222]
[107,"Numbats (Tom)","Carlos Correa","45","Hou - SS",31,"96/402",60,15,65,3,0.239]
[108,"The Dominant Brand (Brandon)","Carlos Santana","25","Cle - 1B,3B",147,"128/560",82,24,86,2,0.229]
[109,"Lightning (Mike Goodman)","Blake Treinen","35","Oak - RP","70","80.1","9","38","100","0.78","0.83"]
[110,"The Dominant Brand (Brandon)","Craig Kimbrel","8","Bos - RP","91","62.1","5","42","96","2.74","0.99"]
[111,"Numbats (Tom)","Ken Giles","19","Tor - RP","151","50.1","0","26","53","4.65","1.21"]
[112,"Numbats (Tom)","Cody Allen","25","LAA - RP","201","67.0","4","27","80","4.70","1.36"]
[113,"The Mad Batters (Colin)","Xander Bogaerts","45","Bos - SS",48,"148/513",72,23,103,8,0.288]
[114,"Guzzlers (Rhonda)","Nomar Mazara","28","Tex - OF",127,"126/489",61,20,77,1,0.258]
[115,"Woap (Mike)","Trevor Bauer","45","Cle - SP","53","175.1","12","1","221","2.21","1.09"]
[116,"The Mad Batters (Colin)","James Paxton","40","NYY - SP","55","160.1","11","0","208","3.76","1.10"]
[117,"Numbats (Tom)","Alex Colomé","19","CWS - RP","228","68.0","7","12","72","3.04","1.18"]
[118,"Guzzlers (Rhonda)","Tim Anderson","35","CWS - SS",120,"136/567",77,20,64,26,0.24]
[119,"Moneyballers (Rob)","Dellin Betances","17","NYY - RP","237","66.2","4","4","115","2.70","1.05"]
[120,"The Dominant Brand (Brandon)","Rougned Odor","16","Tex - 2B",123,"120/474",76,18,63,12,0.253]
[121,"Guzzlers (Rhonda)","Mike Clevinger","38","Cle - SP","74","200.0","13","0","207","3.02","1.16"]
[122,"The Dominant Brand (Brandon)","Byron Buxton","11","Min - OF",170,"14/90",8,0,4,5,0.156]
[123,"Josh Gone-aldson (Dave)","Masahiro Tanaka","30","NYY - SP","100","156.0","12","0","159","3.75","1.13"]
[124,"Woap (Mike)","Charlie Morton","28","TB - SP","121","167.0","15","0","201","3.13","1.16"]
[125,"The Dominant Brand (Brandon)","J.A. Happ","26","NYY - SP","156","177.2","17","0","193","3.65","1.13"]
[126,"The Dominant Brand (Brandon)","Dallas Keuchel","10","Hou - SP","159","204.2","12","0","153","3.74","1.31"]
[127,"The Dominant Brand (Brandon)","Kelvin Herrera","6","CWS - RP","240","44.1","2","17","38","2.44","1.20"]
[128,"The Dominant Brand (Brandon)","Marcus Stroman","7","Tor - SP","312","102.1","4","0","77","5.54","1.48"]
[129,"Josh Gone-aldson (Dave)","Matt Barnes","21","Bos - RP","383","61.2","6","0","96","3.65","1.26"]
[130,"Lightning (Mike Goodman)","Jake Odorizzi","7","Min - SP","325","164.1","7","0","162","4.49","1.34"]
[131,"Evolution (Bruce)","Yusei Kikuchi","26","Sea - SP","191","-","-","-","-","-","-"]
[132,"Moneyballers (Rob)","Adam Ottavino","8","NYY - RP","293","77.2","6","6","112","2.43","0.99"]
[133,"Woap (Mike)","Domingo Santana","25","Sea - OF",223,"56/211",21,5,20,1,0.265]
[134,"Moneyballers (Rob)","Nathan Eovaldi","10","Bos - SP","182","111.0","6","0","101","3.81","1.13"]
[135,"Moneyballers (Rob)","Mike Fiers","7","Oak - SP","334","172.0","12","0","139","3.56","1.18"]
[136,"Numbats (Tom)","Miguel Sanó","2","Min - 1B,3B",229,"53/266",32,13,41,0,0.199]
[137,"The Mad Batters (Colin)","Cory Gearrin","2","Sea - RP","486","57.1","2","1","53","3.77","1.34"]
[138,"Lightning (Mike Goodman)","Elvis Andrus","15","Tex - SS",124,"101/395",53,6,33,5,0.256]
[139,"Numbats (Tom)","Marwin González","8","Hou - 1B,2B,SS,OF",274,"121/489",61,16,68,2,0.247]
[140,"The Dominant Brand (Brandon)","Wade LeBlanc","6","Sea - SP,RP","372","162.0","9","0","130","3.72","1.18"]
[141,"Lightning (Mike Goodman)","Michael Pineda","7","Min - SP","329","-","-","-","-","-","-"]
[142,"Josh Gone-aldson (Dave)","Jake Bauers","5","Cle - 1B,OF",206,"65/323",48,11,48,6,0.201]
[143,"The Mad Batters (Colin)","Brett Gardner","1","NYY - OF",243,"125/530",95,12,45,16,0.236]
[144,"Moneyballers (Rob)","Rick Porcello","19","Bos - SP","179","191.1","17","0","190","4.28","1.18"]
[145,"Lightning (Mike Goodman)","Dylan Bundy","5","Bal - SP","307","171.2","8","0","184","5.45","1.41"]
[146,"Numbats (Tom)","CC Sabathia","9","NYY - SP","390","153.0","9","0","140","3.65","1.31"]
[147,"Woap (Mike)","Matt Festa","1","Sea - RP","1128","8.1","0","0","4","2.16","1.80"]
[148,"The Dominant Brand (Brandon)","Marcus Semien","3","Oak - SS",186,"161/632",89,15,70,14,0.255]
[149,"Josh Gone-aldson (Dave)","Hunter Strickland","4","Sea - RP","434","45.1","3","14","37","3.97","1.41"]
[150,"The Mad Batters (Colin)","Carlos Rodón","8","CWS - SP","257","120.2","6","0","90","4.18","1.26"]
[151,"Numbats (Tom)","Wade Miley","8","Hou - SP","512","80.2","5","0","50","2.57","1.21"]
[152,"Josh Gone-aldson (Dave)","Billy Hamilton","3","KC - OF",187,"119/504",74,4,29,34,0.236]
[153,"The Mad Batters (Colin)","Willy Adames","11","TB - 2B,SS",201,"80/288",43,10,34,6,0.278]
[154,"Moneyballers (Rob)","Collin McHugh","12","Hou - RP","278","72.1","6","0","94","1.99","0.91"]
[155,"The Dominant Brand (Brandon)","Chad Green","6","NYY - RP","310","75.2","8","0","94","2.50","1.04"]
[156,"Moneyballers (Rob)","Randal Grichuk","6","Tor - OF",283,"104/424",60,25,61,3,0.245]
[157,"Woap (Mike)","Justin Smoak","3","Tor - 1B",162,"122/505",67,25,77,0,0.242]
[158,"Booya's (Cathy)","Shane Greene","5","Det - RP","368","63.1","4","32","65","5.12","1.37"]
[159,"Lightning (Mike Goodman)","Jonathan Schoop","11","Min - 2B,SS",178,"110/473",61,21,61,1,0.233]
[160,"Moneyballers (Rob)","Aaron Sanchez","12","Tor - SP","1516","105.0","4","0","86","4.89","1.56"]
[161,"Lightning (Mike Goodman)","Diego Castillo","4","TB - SP,RP","385","56.2","4","0","65","3.18","0.95"]
[162,"The Mad Batters (Colin)","Lucas Giolito","1","CWS - SP","1600","173.1","10","0","125","6.13","1.48"]
[163,"Moneyballers (Rob)","Asdrúbal Cabrera","10","Tex - 2B,3B,SS",336,"143/546",68,23,75,0,0.262]
[164,"Booya's (Cathy)","Gio Gonzalez ","1","NYY - SP","467","171.0","10","0","148","4.21","1.44"]
[165,"Woap (Mike)","Brad Keller","5","KC - SP,RP","406","140.1","9","0","96","3.08","1.30"]
[166,"The Mad Batters (Colin)","Brad Boxberger","6","KC - RP","302","53.1","3","32","71","4.39","1.43"]
[167,"Evolution (Bruce)","Jeimer Candelario","3","Det - 3B",312,"121/539",78,19,54,3,0.224]
[168,"Lightning (Mike Goodman)","Shawn Armstrong","1","Sea - RP","479","14.2","0","1","15","1.23","0.82"]
[169,"Numbats (Tom)","Willians Astudillo","1","Min - C,3B",1583,"33/93",9,3,21,0,0.355]
[170,"Josh Gone-aldson (Dave)","Ryne Stanek","1","TB - SP,RP","419","66.1","2","0","81","2.98","1.09"]
[171,"Booya's (Cathy)","Fernando Rodney","1","Oak - RP","349","64.1","4","25","70","3.36","1.46"]
[172,"Numbats (Tom)","Chris Bassitt","2","Oak - SP","492","47.2","2","0","41","3.02","1.24"]
[173,"Woap (Mike)","Max Kepler","1","Min - OF",260,"119/532",80,20,58,4,0.224]
[174,"Woap (Mike)","Ryan Pressly","6","Hou - RP","367","71.0","2","2","101","2.54","1.11"]
[175,"Numbats (Tom)","Mike Minor","2","Tex - SP","323","157.0","12","0","132","4.18","1.12"]
[176,"Josh Gone-aldson (Dave)","Shohei Ohtani","8","LAA - SP","190","51.2","4","0","63","3.31","1.16"]
[177,"Josh Gone-aldson (Dave)","Lourdes Gurriel Jr.","1","Tor - 2B,SS",224,"70/249",30,11,35,1,0.281]
[178,"Numbats (Tom)","Trevor Cahill","2","LAA - SP","428","110.0","7","0","100","3.76","1.19"]
[179,"Guzzlers (Rhonda)","Jackie Bradley Jr.","1","Bos - OF",253,"111/474",76,13,59,17,0.234]
[180,"Woap (Mike)","Tim Beckham","1","Sea - 3B,SS",1300,"85/369",45,12,35,1,0.23]
[181,"Evolution (Bruce)","Daniel Palka","1","CWS - OF",481,"100/417",56,27,67,2,0.24]
[182,"Lightning (Mike Goodman)","Matt Harvey","1","LAA - SP","1477","155.0","7","0","131","4.94","1.30"]
[183,"Booya's (Cathy)","Clay Buchholz ","1","Tor - SP","319","98.1","7","0","81","2.01","1.04"]
[184,"Guzzlers (Rhonda)","Aledmys Díaz","1","Hou - 3B,SS",463,"111/422",55,18,55,3,0.263]
[185,"Woap (Mike)","Jorge Soler","1","KC - OF",1531,"59/223",27,9,28,3,0.265]
[186,"Evolution (Bruce)","Avisaíl García","1","TB - OF",292,"84/356",47,19,49,3,0.236]
[187,"Lightning (Mike Goodman)","Jonathan Loaisiga","1","NYY - SP,RP","1148","24.2","2","0","33","5.11","1.54"]
[188,"Booya's (Cathy)","Blake Parker","1","Min - RP","360","66.1","2","14","70","3.26","1.24"]
[189,"Guzzlers (Rhonda)","Taylor Rogers","1","Min - RP","361","68.1","1","2","75","2.63","0.95"]
[190,"Evolution (Bruce)","Lou Trivino","1","Oak - RP","357","74.0","8","4","82","2.92","1.14"]
[191,"Booya's (Cathy)","Jason Kipnis","1","Cle - 2B,OF",423,"122/530",65,18,75,7,0.23]
[192,"Guzzlers (Rhonda)","Jesse Chávez","1","Tex - RP","353","95.1","5","5","92","2.55","1.06"]
[193,"Evolution (Bruce)","Matt Shoemaker","1","Tor - SP","576","31.0","2","0","33","4.94","1.26"]
[194,"Guzzlers (Rhonda)","Isiah Kiner-Falefa","1","Tex - C,2B,3B",1491,"93/356",43,4,34,7,0.261]
[195,"Guzzlers (Rhonda)","Frankie Montas","1","Oak - SP","1244","65.0","5","0","43","3.88","1.46"]
[196,"Guzzlers (Rhonda)","Ryan Brasier","1","Bos - RP","400","33.2","2","0","29","1.60","0.77"]
[197,"Guzzlers (Rhonda)","Albert Pujols","1","LAA - 1B",431,"114/465",50,19,64,1,0.245]
[198,"The Dominant Brand (Brandon)","Yonder Alonso","5","CWS - 1B",225,"129/516",64,23,83,0,0.25]
[199,"Moneyballers (Rob)","Sean Reid-Foley","5","Tor - SP","1232","33.1","2","0","42","5.13","1.56"]
[200,"The Mad Batters (Colin)","Lance McCullers Jr.","5","Hou - SP","358","128.1","10","0","142","3.86","1.17"]
[201,"Evolution (Bruce)","Kyle Seager","5","Sea - 3B",184,"129/583",62,22,78,2,0.221]
[202,"Josh Gone-aldson (Dave)","DJ LeMahieu","5","NYY - 2B",171,"147/533",90,15,62,6,0.276]
[203,"Woap (Mike)","Ryon Healy","5","Sea - 1B",307,"116/493",51,24,73,0,0.235]
[204,"Booya's (Cathy)","Steve Pearce","5","Bos - 1B,OF",1315,"61/215",35,11,42,0,0.284]
[205,"Numbats (Tom)","Brandon Lowe","5","TB - 2B,OF",1586,"30/129",16,6,25,2,0.233]
[206,"Guzzlers (Rhonda)","Yandy Díaz","5","TB - 1B,3B",1584,"34/109",15,1,15,0,0.312]
[207,"Lightning (Mike Goodman)","Ryan Borucki","5","Tor - SP","639","97.2","4","0","67","3.87","1.32"]
[208,"The Dominant Brand (Brandon)","Marco Estrada","5","Oak - SP","1551","143.2","7","0","103","5.64","1.43"]
[209,"Moneyballers (Rob)","James Shields","5","CWS - SP","1441","204.2","7","0","154","4.53","1.31"]
[210,"The Mad Batters (Colin)","Trey Mancini","5","Bal - 1B,OF",259,"141/582",69,24,58,0,0.242]
[211,"Evolution (Bruce)","Teoscar Hernández","5","Tor - OF",323,"114/476",67,22,57,5,0.239]
[212,"Josh Gone-aldson (Dave)","Delino DeShields","5","Tex - OF",1252,"72/334",52,2,22,20,0.216]
[213,"Woap (Mike)","Ronald Guzmán","5","Tex - 1B",1386,"91/387",46,16,58,1,0.235]
[214,"Booya's (Cathy)","Ivan Nova","5","CWS - SP","505","161.0","9","0","114","4.19","1.28"]
[215,"Guzzlers (Rhonda)","Kevin Pillar","5","Tor - OF",355,"129/512",65,15,59,14,0.252]
[216,"Lightning (Mike Goodman)","Framber Valdez","5","Hou - SP","436","37.0","4","0","34","2.19","1.24"]
[217,"Numbats (Tom)","Justus Sheffield","5","Sea - RP","1220","2.2","0","0","0","10.13","2.63"]
[218,"Moneyballers (Rob)","Mark Trumbo","5","Bal - OF",550,"86/330",41,17,44,0,0.261]
[219,"The Dominant Brand (Brandon)","Josh Reddick","5","Hou - OF",373,"105/433",63,17,47,7,0.242]
[220,"The Mad Batters (Colin)","Brent Honeywell","5","TB - SP","1001","-","-","-","-","-","-"]
[221,"Evolution (Bruce)","Jay Bruce","5","Sea - 1B,OF",303,"71/319",31,9,37,2,0.223]
[222,"Josh Gone-aldson (Dave)","Domingo Germán","5","NYY - SP,RP","1373","85.2","2","0","102","5.57","1.33"]
[223,"Woap (Mike)","Kole Calhoun","5","LAA - OF",452,"102/491",71,19,57,6,0.208]
[224,"Booya's (Cathy)","Jon Jay","5","CWS - OF",493,"141/527",74,3,40,4,0.268]
[225,"Numbats (Tom)","Greg Bird","5","NYY - 1B",1564,"54/272",23,11,38,0,0.199]
[226,"Guzzlers (Rhonda)","Felix Peña","5","LAA - SP","591","92.2","3","0","85","4.18","1.24"]
["228","zimmerman","Joe Biagini","5"]
[228,"The Mad Batters (Colin)","Eduardo Núñez","5","Bos - 2B,3B",397,"127/480",56,10,44,7,0.265]
[229,"Evolution (Bruce)","Willie Calhoun","5","Tex - OF",1696,"22/99",8,2,11,0,0.222]
[230,"Josh Gone-aldson (Dave)","Michael Kopech","5","CWS - SP","1138","14.1","1","0","15","5.02","1.53"]
[231,"Woap (Mike)","Hanley Ramirez","5","Bos - 1B",1460,"45/177",25,6,29,4,0.254]
[232,"Booya's (Cathy)","Tyson Ross","5","Det - SP,RP","1184","149.2","8","0","122","4.15","1.30"]
[233,"Guzzlers (Rhonda)","Danny Salazar","5","Cle - SP","563","-","-","-","-","-","-"]
[234,"Numbats (Tom)","Chad Pinder","5","Oak - 2B,3B,OF",1396,"77/298",43,13,27,0,0.258]
[235,"Lightning (Mike Goodman)","Sean Manaea","5","Oak - SP","346","160.2","12","0","108","3.59","1.08"]
[236,"The Dominant Brand (Brandon)","Robbie Grossman","5","Min - OF",1174,"108/396",50,5,48,0,0.273]
[237,"Josh Gone-aldson (Dave)","Blake Swihart","5","Bos - C,1B,OF",1575,"44/192",28,3,18,6,0.229]
[238,"Woap (Mike)","Spencer Turnbull","5","Det - SP","1213","16.1","0","0","15","6.06","1.29"]
[239,"Booya's (Cathy)","Matt Davidson","5","Tex - 1B,3B",552,"99/434",51,20,62,0,0.228]
[240,"Guzzlers (Rhonda)","Zack Britton","5","NYY - RP","299","40.2","2","7","34","3.10","1.23"]
[241,"The Dominant Brand (Brandon)","Yusmeiro Petit","5","Oak - RP","339","93.0","7","0","76","3.00","1.01"]
[242,"Josh Gone-aldson (Dave)","Jaime Barria","5","LAA - SP","403","129.1","10","0","98","3.41","1.27"]
[243,"Woap (Mike)","Brett Anderson","5","Oak - SP","1323","80.1","4","0","47","4.48","1.28"]
[244,"Booya's (Cathy)","Mike Leake","5","Sea - SP","644","185.2","10","0","119","4.36","1.30"]
[245,"Moneyballers (Rob)","Rowdy Tellez","5","Tor - 1B",1613,"22/70",10,4,14,0,0.314]
[246,"Guzzlers (Rhonda)","Troy Tulowitzki","5","NYY - SS",1738,"-/-","-","-","-","-","-"]
[247,"The Dominant Brand (Brandon)","Freddy Galvis","5","Tor - 2B,SS",392,"149/602",62,13,67,8,0.248]
[248,"Woap (Mike)","Christian Vázquez","5","Bos - C",1572,"52/251",24,3,16,4,0.207]
[249,"Booya's (Cathy)","Mitch Garver","5","Min - C",1484,"81/302",38,7,45,0,0.268]
[250,"The Dominant Brand (Brandon)","Jordan Zimmermann","5","Det - SP","1359","131.1","7","0","111","4.52","1.26"]

{"sheet":"Summary","index":2,"n_rows":13,"n_cols":15,"rows_kept":13}
["Owners","Current Used Points","Remaining Points","Max Bidding Points","Players Left to Draft","C","1B","2B","3B","SS","OF","DH","SP","RP","Reserve"]
["Lightning (Mike Goodman)",{"$f":"used1","v":260},{"$f":"'2018 Pre-Draft Rosters'!D22","v":0},{"$f":"'2018 Pre-Draft Rosters'!D23","v":0},{"$f":"'2018 Pre-Draft Rosters'!D24","v":0},{"$f":"1-COUNT('2018 Pre-Draft Rosters'!D3)","v":0},{"$f":"1-COUNT('2018 Pre-Draft Rosters'!D4)","v":0},{"$f":"1-COUNT('2018 Pre-Draft Rosters'!D5)","v":0},{"$f":"1-COUNT('2018 Pre-Draft Rosters'!D6)","v":0},{"$f":"1-COUNT('2018 Pre-Draft Rosters'!D7)","v":0},{"$f":"3-COUNT('2018 Pre-Draft Rosters'!D8:D10)","v":0},{"$f":"1-COUNT('2018 Pre-Draft Rosters'!D11)","v":0},{"$f":"5-COUNT('2018 Pre-Draft Rosters'!D12:D16)","v":0},{"$f":"4-COUNT('2018 Pre-Draft Rosters'!D17:D20)","v":0},{"$f":"7-COUNT('2018 Pre-Draft Rosters'!D27:D33)","v":0}]
["Evolution (Bruce)",{"$f":"used2","v":244},{"$f":"'2018 Pre-Draft Rosters'!H22","v":16},{"$f":"'2018 Pre-Draft Rosters'!H23","v":16},{"$f":"'2018 Pre-Draft Rosters'!H24","v":0},{"$f":"1-COUNT('2018 Pre-Draft Rosters'!H3)","v":0},{"$f":"1-COUNT('2018 Pre-Draft Rosters'!H4)","v":0},{"$f":"1-COUNT('2018 Pre-Draft Rosters'!H5)","v":0},{"$f":"1-COUNT('2018 Pre-Draft Rosters'!H6)","v":0},{"$f":"1-COUNT('2018 Pre-Draft Rosters'!H7)","v":0},{"$f":"3-COUNT('2018 Pre-Draft Rosters'!H8:H10)","v":0},{"$f":"1-COUNT('2018 Pre-Draft Rosters'!H11)","v":0},{"$f":"5-COUNT('2018 Pre-Draft Rosters'!H12:H16)","v":0},{"$f":"4-COUNT('2018 Pre-Draft Rosters'!H17:H20)","v":0},{"$f":"7-COUNT('2018 Pre-Draft Rosters'!H27:H33)","v":0}]
["The Mad Batters (Colin)",{"$f":"used3","v":260},{"$f":"'2018 Pre-Draft Rosters'!L22","v":0},{"$f":"'2018 Pre-Draft Rosters'!L23","v":0},{"$f":"'2018 Pre-Draft Rosters'!L24","v":0},{"$f":"1-COUNT('2018 Pre-Draft Rosters'!L3)","v":0},{"$f":"1-COUNT('2018 Pre-Draft Rosters'!L4)","v":0},{"$f":"1-COUNT('2018 Pre-Draft Rosters'!L5)","v":0},{"$f":"1-COUNT('2018 Pre-Draft Rosters'!L6)","v":0},{"$f":"1-COUNT('2018 Pre-Draft Rosters'!L7)","v":0},{"$f":"3-COUNT('2018 Pre-Draft Rosters'!L8:L10)","v":0},{"$f":"1-COUNT('2018 Pre-Draft Rosters'!L11)","v":0},{"$f":"5-COUNT('2018 Pre-Draft Rosters'!L12:L16)","v":0},{"$f":"4-COUNT('2018 Pre-Draft Rosters'!L17:L20)","v":0},{"$f":"7-COUNT('2018 Pre-Draft Rosters'!L27:L33)","v":0}]
["Woap (Mike)",{"$f":"used4","v":260},{"$f":"'2018 Pre-Draft Rosters'!P22","v":0},{"$f":"'2018 Pre-Draft Rosters'!P23","v":0},{"$f":"'2018 Pre-Draft Rosters'!P24","v":0},{"$f":"1-COUNT('2018 Pre-Draft Rosters'!P3)","v":0},{"$f":"1-COUNT('2018 Pre-Draft Rosters'!P4)","v":0},{"$f":"1-COUNT('2018 Pre-Draft Rosters'!P5)","v":0},{"$f":"1-COUNT('2018 Pre-Draft Rosters'!P6)","v":0},{"$f":"1-COUNT('2018 Pre-Draft Rosters'!P7)","v":0},{"$f":"3-COUNT('2018 Pre-Draft Rosters'!P8:P10)","v":0},{"$f":"1-COUNT('2018 Pre-Draft Rosters'!P11)","v":0},{"$f":"5-COUNT('2018 Pre-Draft Rosters'!P12:P16)","v":0},{"$f":"4-COUNT('2018 Pre-Draft Rosters'!P17:P20)","v":0},{"$f":"7-COUNT('2018 Pre-Draft Rosters'!P27:P33)","v":0}]
["The Dominant Brand (Brandon)",{"$f":"used5","v":260},{"$f":"'2018 Pre-Draft Rosters'!T22","v":0},{"$f":"'2018 Pre-Draft Rosters'!T23","v":0},{"$f":"'2018 Pre-Draft Rosters'!T24","v":0},{"$f":"1-COUNT('2018 Pre-Draft Rosters'!T3)","v":0},{"$f":"1-COUNT('2018 Pre-Draft Rosters'!T4)","v":0},{"$f":"1-COUNT('2018 Pre-Draft Rosters'!T5)","v":0},{"$f":"1-COUNT('2018 Pre-Draft Rosters'!T6)","v":0},{"$f":"1-COUNT('2018 Pre-Draft Rosters'!T7)","v":0},{"$f":"3-COUNT('2018 Pre-Draft Rosters'!T8:T10)","v":0},{"$f":"1-COUNT('2018 Pre-Draft Rosters'!T11)","v":0},{"$f":"5-COUNT('2018 Pre-Draft Rosters'!T12:T16)","v":0},{"$f":"4-COUNT('2018 Pre-Draft Rosters'!T17:T20)","v":0},{"$f":"7-COUNT('2018 Pre-Draft Rosters'!T27:T33)","v":0}]
["Guzzlers (Rhonda)",{"$f":"used6","v":260},{"$f":"'2018 Pre-Draft Rosters'!X22","v":0},{"$f":"'2018 Pre-Draft Rosters'!X23","v":0},{"$f":"'2018 Pre-Draft Rosters'!X24","v":0},{"$f":"1-COUNT('2018 Pre-Draft Rosters'!X3)","v":0},{"$f":"1-COUNT('2018 Pre-Draft Rosters'!X4)","v":0},{"$f":"1-COUNT('2018 Pre-Draft Rosters'!X5)","v":0},{"$f":"1-COUNT('2018 Pre-Draft Rosters'!X6)","v":0},{"$f":"1-COUNT('2018 Pre-Draft Rosters'!X7)","v":0},{"$f":"3-COUNT('2018 Pre-Draft Rosters'!X8:X10)","v":0},{"$f":"1-COUNT('2018 Pre-Draft Rosters'!X11)","v":0},{"$f":"5-COUNT('2018 Pre-Draft Rosters'!X12:X16)","v":0},{"$f":"4-COUNT('2018 Pre-Draft Rosters'!X17:X20)","v":0},{"$f":"7-COUNT('2018 Pre-Draft Rosters'!X27:X33)","v":0}]
["Moneyballers (Rob)",{"$f":"used7","v":256},{"$f":"'2018 Pre-Draft Rosters'!AB22","v":4},{"$f":"'2018 Pre-Draft Rosters'!AB23","v":4},{"$f":"'2018 Pre-Draft Rosters'!AB24","v":0},{"$f":"1-COUNT('2018 Pre-Draft Rosters'!AB3)","v":0},{"$f":"1-COUNT('2018 Pre-Draft Rosters'!AB4)","v":0},{"$f":"1-COUNT('2018 Pre-Draft Rosters'!AB5)","v":0},{"$f":"1-COUNT('2018 Pre-Draft Rosters'!AB6)","v":0},{"$f":"1-COUNT('2018 Pre-Draft Rosters'!AB7)","v":0},{"$f":"3-COUNT('2018 Pre-Draft Rosters'!AB8:AB10)","v":0},{"$f":"1-COUNT('2018 Pre-Draft Rosters'!AB11)","v":0},{"$f":"5-COUNT('2018 Pre-Draft Rosters'!AB12:AB16)","v":0},{"$f":"4-COUNT('2018 Pre-Draft Rosters'!AB17:AB20)","v":0},{"$f":"7-COUNT('2018 Pre-Draft Rosters'!AB27:AB33)","v":0}]
["Booya's (Cathy)",{"$f":"used8","v":260},{"$f":"'2018 Pre-Draft Rosters'!AF22","v":0},{"$f":"'2018 Pre-Draft Rosters'!AF23","v":0},{"$f":"'2018 Pre-Draft Rosters'!AF24","v":0},{"$f":"1-COUNT('2018 Pre-Draft Rosters'!AF3)","v":0},{"$f":"1-COUNT('2018 Pre-Draft Rosters'!AF4)","v":0},{"$f":"1-COUNT('2018 Pre-Draft Rosters'!AF5)","v":0},{"$f":"1-COUNT('2018 Pre-Draft Rosters'!AF6)","v":0},{"$f":"1-COUNT('2018 Pre-Draft Rosters'!AF7)","v":0},{"$f":"3-COUNT('2018 Pre-Draft Rosters'!AF8:AF10)","v":0},{"$f":"1-COUNT('2018 Pre-Draft Rosters'!AF11)","v":0},{"$f":"5-COUNT('2018 Pre-Draft Rosters'!AF12:AF16)","v":0},{"$f":"4-COUNT('2018 Pre-Draft Rosters'!AF17:AF20)","v":0},{"$f":"7-COUNT('2018 Pre-Draft Rosters'!AF27:AF33)","v":0}]
["Freebirds (Todd)",{"$f":"used9","v":0},{"$f":"'2018 Pre-Draft Rosters'!AJ22","v":260},{"$f":"'2018 Pre-Draft Rosters'!AJ23","v":243},{"$f":"'2018 Pre-Draft Rosters'!AJ24","v":18},{"$f":"1-COUNT('2018 Pre-Draft Rosters'!AJ3)","v":1},{"$f":"1-COUNT('2018 Pre-Draft Rosters'!AJ4)","v":1},{"$f":"1-COUNT('2018 Pre-Draft Rosters'!AJ5)","v":1},{"$f":"1-COUNT('2018 Pre-Draft Rosters'!AJ6)","v":1},{"$f":"1-COUNT('2018 Pre-Draft Rosters'!AJ7)","v":1},{"$f":"3-COUNT('2018 Pre-Draft Rosters'!AJ8:AJ10)","v":3},{"$f":"1-COUNT('2018 Pre-Draft Rosters'!AJ11)","v":1},{"$f":"5-COUNT('2018 Pre-Draft Rosters'!AJ12:AJ16)","v":5},{"$f":"4-COUNT('2018 Pre-Draft Rosters'!AJ17:AJ20)","v":4},{"$f":"7-COUNT('2018 Pre-Draft Rosters'!AJ27:AJ33)","v":7}]
["Numbats (Tom)",{"$f":"used10","v":255},{"$f":"'2018 Pre-Draft Rosters'!AN22","v":5},{"$f":"'2018 Pre-Draft Rosters'!AN23","v":5},{"$f":"'2018 Pre-Draft Rosters'!AN24","v":0},{"$f":"1-COUNT('2018 Pre-Draft Rosters'!AN3)","v":0},{"$f":"1-COUNT('2018 Pre-Draft Rosters'!AN4)","v":0},{"$f":"1-COUNT('2018 Pre-Draft Rosters'!AN5)","v":0},{"$f":"1-COUNT('2018 Pre-Draft Rosters'!AN6)","v":0},{"$f":"1-COUNT('2018 Pre-Draft Rosters'!AN7)","v":0},{"$f":"3-COUNT('2018 Pre-Draft Rosters'!AN8:AN10)","v":0},{"$f":"1-COUNT('2018 Pre-Draft Rosters'!AN11)","v":0},{"$f":"5-COUNT('2018 Pre-Draft Rosters'!AN12:AN16)","v":0},{"$f":"4-COUNT('2018 Pre-Draft Rosters'!AN17:AN20)","v":0},{"$f":"7-COUNT('2018 Pre-Draft Rosters'!AN27:AN33)","v":0}]
["Josh Gone-aldson (Dave)",{"$f":"used11","v":257},{"$f":"'2018 Pre-Draft Rosters'!AR22","v":3},{"$f":"'2018 Pre-Draft Rosters'!AR23","v":3},{"$f":"'2018 Pre-Draft Rosters'!AR24","v":0},{"$f":"1-COUNT('2018 Pre-Draft Rosters'!AR3)","v":0},{"$f":"1-COUNT('2018 Pre-Draft Rosters'!AR4)","v":0},{"$f":"1-COUNT('2018 Pre-Draft Rosters'!AR5)","v":0},{"$f":"1-COUNT('2018 Pre-Draft Rosters'!AR6)","v":0},{"$f":"1-COUNT('2018 Pre-Draft Rosters'!AR7)","v":0},{"$f":"3-COUNT('2018 Pre-Draft Rosters'!AR8:AR10)","v":0},{"$f":"1-COUNT('2018 Pre-Draft Rosters'!AR11)","v":0},{"$f":"5-COUNT('2018 Pre-Draft Rosters'!AR12:AR16)","v":0},{"$f":"4-COUNT('2018 Pre-Draft Rosters'!AR17:AR20)","v":0},{"$f":"7-COUNT('2018 Pre-Draft Rosters'!AR27:AR33)","v":0}]
[{"$nulls":4},{"$f":"SUM(E2:E12)","v":18},{"$f":"SUM(F2:F12)-1","v":0},{"$f":"SUM(G2:G12)-1","v":0},{"$f":"SUM(H2:H12)-1","v":0},{"$f":"SUM(I2:I12)-1","v":0},{"$f":"SUM(J2:J12)-1","v":0},{"$f":"SUM(K2:K12)-3","v":0},{"$f":"SUM(L2:L12)-1","v":0},{"$f":"SUM(M2:M12)-5","v":0},{"$f":"SUM(N2:N12)-4","v":0},{"$f":"SUM(O2:O12)-7","v":0}]

{"sheet":"Catchers","index":3,"n_rows":73,"n_cols":9,"rows_kept":73}
["Player","Team","Rank","H/AB","R","HR","RBI","SB","Avg."]
[]
[]
[]
[]
[]
["Nick Hundley","Oak - C",1503,"68/282",34,10,31,2,0.241]
["Austin Romine","NYY - C",1509,"59/242",30,10,42,1,0.244]
["Martín Maldonado","Hou - C",1510,"84/373",39,9,44,0,0.225]
["James McCann","CWS - C",1536,"94/427",31,8,39,0,0.22]
["Kevan Smith","LAA - C",1539,"50/171",21,3,21,1,0.292]
["Kevin Plawecki","Cle - C",1563,"50/238",33,7,30,0,0.21]
["Max Stassi","Hou - C",1567,"50/221",28,8,27,0,0.226]
[]
[]
[]
["Luke Maile","Tor - C",1585,"50/202",22,3,27,2,0.248]
["Caleb Joseph","Bal - C",1589,"58/265",28,3,17,2,0.219]
["Sandy Leon","Bos - C",1622,"47/265",30,5,22,1,0.177]
["Austin Wynns","Bal - C",1630,"28/110",16,4,11,0,0.255]
["José Briceño","LAA - C",1652,"28/117",12,5,10,0,0.239]
["Chris Herrmann","Oak - C",1655,"18/76",6,2,7,0,0.237]
["Jesús Sucre","Bal - C",1660,"38/182",9,1,17,1,0.209]
["Michael Pérez","TB - C",1665,"21/74",9,1,11,0,0.284]
["Josh Phegley","Oak - C",1666,"19/93",13,2,15,0,0.204]
["Roberto Pérez","Cle - C",1682,"30/179",16,2,19,1,0.168]
["Jason Castro","Min - C",1692,"9/63",4,1,3,0,0.143]
["Reese McGuire","Tor - C",1697,"9/31",5,2,4,1,0.29]
["Jeff Mathis","Tex - C",1708,"39/195",15,1,20,0,0.2]
["Chance Sisco","Bal - C",1718,"29/160",13,2,16,1,0.181]
["Bruce Maxwell","Oak - C",1728,"10/55",5,1,6,0,0.182]
["Grayson Greiner","Det - C",1729,"21/96",9,0,12,0,0.219]
["Bobby Wilson","Det - C",1735,"24/135",12,2,16,0,0.178]
["Derek Norris","Det - C",1741,"-/-","-","-","-","-","-"]
["Cam Gallagher","KC - C",1746,"13/63",5,1,7,0,0.206]
["David Freitas","Sea - C",1751,"20/93",9,1,5,0,0.215]
["Meibrys Viloria","KC - C",1755,"7/27",4,0,4,0,0.259]
["Ryan Lavarnway","NYY - C,1B",1760,"4/6",1,0,1,0,0.667]
["Ryan Hanigan","Cle - C",1772,"-/-","-","-","-","-","-"]
["Nick Ciuffo","TB - C",1777,"7/37",3,1,5,0,0.189]
["Jett Bandy","Tex - C",1779,"12/64",5,1,1,0,0.188]
["Adam Moore","TB - C",1782,"4/18",2,1,2,0,0.222]
["Brett Nicholas","Tex - C",1787,"-/-","-","-","-","-","-"]
["Kyle Higashioka","NYY - C",1794,"12/72",6,3,6,0,0.167]
["Juan Centeno","Bos - C",1801,"6/37",3,1,3,0,0.162]
["Dustin Garneau","LAA - C",1805,"1/2",0,0,1,0,0.5]
["Jose Trevino","Tex - C",1808,"2/8",0,0,3,0,0.25]
["Mike Ohlman","Bos - C",1855,"-/-","-","-","-","-","-"]
["Josh Breaux","NYY - C",1886,"-/-","-","-","-","-","-"]
["Garrett Stubbs","Hou - C",1894,"-/-","-","-","-","-","-"]
["Zack Collins","CWS - C",1899,"-/-","-","-","-","-","-"]
["Cal Raleigh","Sea - C",1910,"-/-","-","-","-","-","-"]
["Joey Morgan","Det - C",1933,"-/-","-","-","-","-","-"]
["Max Pentecost","Tor - C",1937,"-/-","-","-","-","-","-"]
["MJ Melendez","KC - C",1939,"-/-","-","-","-","-","-"]
["Oscar Hernandez","Bos - C",1940,"-/-","-","-","-","-","-"]
["Ronaldo Hernandez","TB - C",2018,"-/-","-","-","-","-","-"]
["Anthony Seigler","NYY - C",2023,"-/-","-","-","-","-","-"]
["Bo Naylor","Cle - C",2041,"-/-","-","-","-","-","-"]
["Seby Zavala","CWS - C",2053,"-/-","-","-","-","-","-"]
["Sean Murphy","Oak - C",2091,"-/-","-","-","-","-","-"]
["Ben Rortvedt","Min - C",2115,"-/-","-","-","-","-","-"]
["Kade Scivicque","Det - C",2129,"-/-","-","-","-","-","-"]
["Chase Vallot","KC - C",2190,"-/-","-","-","-","-","-"]
["Jake Rogers","Det - C",2218,"-/-","-","-","-","-","-"]
["Beau Taylor","Oak - C",2291,"1/5",0,0,0,0,0.2]
["Alfredo González","CWS - C",2310,"1/9",0,0,1,0,0.111]
["Tuffy Gosewisch","Sea - C",2318,"-/-","-","-","-","-","-"]
["Eric Haase","Cle - C",2322,"2/16",0,0,1,0,0.125]
["Jose Lobaton","Sea - C",2326,"7/49",3,0,4,0,0.143]
["Jarrod Saltalamacchia","Det - C,1B",2329,"0/7",0,0,0,0,0]
["Andrew Susac","Bal - C",2331,"3/26",1,0,0,0,0.115]
["Carlos Pérez","Bal - C",2332,"10/70",1,1,3,1,0.143]

{"sheet":"1st Base","index":4,"n_rows":59,"n_cols":9,"rows_kept":59}
["Player","Team","Rank","H/AB","R","HR","RBI","SB","Avg."]
{"$rows_empty":9}
["Justin Bour","LAA - 1B",295,"96/423",49,20,59,2,0.227]
[]
[]
["Kendrys Morales","Tor - 1B",317,"103/413",47,21,57,2,0.249]
["Mitch Moreland","Bos - 1B",407,"99/404",57,15,68,2,0.245]
[]
[]
["Mark Canha","Oak - 1B,OF",1072,"91/365",60,17,52,1,0.249]
[]
["Logan Morrison","Min - 1B",1372,"59/318",41,15,39,1,0.186]
[]
["Ehire Adrianza","Min - 1B,3B,SS",1417,"84/335",42,6,39,5,0.251]
["Tyler Austin","Min - 1B",1452,"56/244",34,17,47,1,0.23]
[]
["Chris Davis","Bal - 1B",1535,"79/470",40,16,49,2,0.168]
["Hunter Dozier","KC - 1B,3B",1540,"83/362",36,11,34,2,0.229]
["Nicky Delmonico","CWS - 1B,OF",1553,"61/284",31,8,25,1,0.215]
[]
[]
[]
[]
["Ronny Rodriguez","Det - 1B,2B,3B,SS",1618,"43/191",17,5,20,2,0.225]
["Ryan Rua","Tex - 1B,OF",1623,"27/139",17,6,12,3,0.194]
["Adam Lind","NYY - 1B",1628,"-/-","-","-","-","-","-"]
["José Fernández","LAA - 1B",1654,"31/116",9,2,11,1,0.267]
["Andrew Romine","Sea - 1B,2B,SS",1672,"25/119",15,0,2,1,0.21]
["Brandon Moss","Oak - 1B,OF",1678,"-/-","-","-","-","-","-"]
["Daniel Vogelbach","Sea - 1B",1684,"18/87",9,4,13,0,0.207]
["Brandon Dixon","Det - 1B,OF",1701,"21/118",14,5,10,0,0.178]
["Cheslor Cuthbert","KC - 1B,3B",1704,"20/103",11,3,7,0,0.194]
["Chris Carter","LAA - 1B",1750,"-/-","-","-","-","-","-"]
["Ryan Lavarnway","NYY - C,1B",1760,"4/6",1,0,1,0,0.667]
["Brock Stassi","Min - 1B",1857,"-/-","-","-","-","-","-"]
["Mike Ford","Sea - 1B",1865,"-/-","-","-","-","-","-"]
["Brendan McKay","TB - 1B",1887,"-/-","-","-","-","-","-"]
["Evan White","Sea - 1B",1942,"-/-","-","-","-","-","-"]
["Chris Johnson","Bal - 1B,3B",2048,"-/-","-","-","-","-","-"]
["Matt Thaiss","LAA - 1B",2052,"-/-","-","-","-","-","-"]
["Lewin Díaz","Min - 1B",2092,"-/-","-","-","-","-","-"]
["Joey Curletta","Sea - 1B",2108,"-/-","-","-","-","-","-"]
["Gavin Sheets","CWS - 1B",2118,"-/-","-","-","-","-","-"]
["Reynaldo Rivera","Det - 1B",2170,"-/-","-","-","-","-","-"]
["Bobby Bradley","Cle - 1B",2180,"-/-","-","-","-","-","-"]
["Nick Pratto","KC - 1B",2207,"-/-","-","-","-","-","-"]
["Nate Lowe","TB - 1B",2230,"-/-","-","-","-","-","-"]
["Josh Ockimey","Bos - 1B",2246,"-/-","-","-","-","-","-"]
["Casey Gillaspie","CWS - 1B",2265,"-/-","-","-","-","-","-"]
["AJ Reed","Hou - 1B",2317,"0/3",0,0,0,0,0]
["Jarrod Saltalamacchia","Det - C,1B",2329,"0/7",0,0,0,0,0]

{"sheet":"2nd Base","index":5,"n_rows":71,"n_cols":9,"rows_kept":71}
["Player","Team","Rank","H/AB","R","HR","RBI","SB","Avg."]
{"$rows_empty":11}
["Yolmer Sánchez","CWS - 2B,3B",438,"145/600",62,8,55,14,0.242]
["Josh Harrison","Det - 2B",1272,"86/344",41,8,37,3,0.25]
["Brock Holt","Bos - 2B,SS,OF",1345,"89/321",41,7,46,7,0.277]
[]
["Daniel Robertson","TB - 2B,3B,SS",1444,"74/282",46,9,34,2,0.262]
["Devon Travis","Tor - 2B",1449,"83/357",41,11,44,3,0.232]
[]
["Zack Cozart","LAA - 2B,3B,SS",1502,"49/224",29,5,18,0,0.219]
["Chris Owings","KC - 2B,3B,OF",1507,"58/281",34,4,22,11,0.206]
["Logan Forsythe","Min - 2B,3B",1546,"86/371",37,2,27,3,0.232]
["Jace Peterson","Bal - 2B,3B,OF",1558,"42/210",21,3,28,13,0.2]
["Tommy La Stella","LAA - 2B,3B",1569,"45/169",23,1,19,0,0.266]
[]
["Ronald Torreyes","Min - 2B,3B,SS",1604,"28/100",9,0,7,0,0.28]
["Ronny Rodriguez","Det - 1B,2B,3B,SS",1618,"43/191",17,5,20,2,0.225]
["Franklin Barreto","Oak - 2B",1625,"17/73",10,5,16,0,0.233]
["Brandon Drury","Tor - 2B,3B",1632,"13/77",5,1,10,0,0.169]
["Dustin Pedroia","Bos - 2B",1635,"1/11",1,0,0,0,0.091]
["Ryan Goins","CWS - 2B",1645,"26/115",10,0,6,0,0.226]
["Richard Ureña","Tor - 2B,SS",1648,"29/99",10,1,6,2,0.293]
["Chase d'Arnaud","Tex - 2B,3B",1663,"20/93",9,3,9,2,0.215]
["Andrew Romine","Sea - 1B,2B,SS",1672,"25/119",15,0,2,1,0.21]
["Max Moroff","Cle - 2B",1681,"11/59",7,3,9,0,0.186]
["Christian Arroyo","TB - 2B,3B",1706,"14/53",5,1,6,0,0.264]
["Darwin Barney","Tex - 2B,SS",1714,"-/-","-","-","-","-","-"]
["Dawel Lugo","Det - 2B",1732,"20/94",10,1,8,0,0.213]
["Eric Sogard","Tor - 2B,SS",1749,"13/97",7,0,2,3,0.134]
["Tyler Wade","NYY - 2B",1775,"11/66",8,1,5,1,0.167]
["Kaleb Cowart","Det - 2B,3B",1806,"15/112",7,1,10,1,0.134]
["Taylor Featherston","Min - 2B",1807,"-/-","-","-","-","-","-"]
["Marco Hernández","Bos - 2B,3B",1816,"-/-","-","-","-","-","-"]
["Christopher Bostick","Bal - 2B,OF",1823,"3/16",0,0,2,0,0.188]
["Micah Johnson","TB - 2B",1845,"-/-","-","-","-","-","-"]
["Travis Blankenhorn","Min - 2B",1881,"-/-","-","-","-","-","-"]
["Tony Renda","Bos - 2B,OF",1888,"-/-","-","-","-","-","-"]
["Luís Rengifo","LAA - 2B,SS",1962,"-/-","-","-","-","-","-"]
["Shed Long","Sea - 2B",2001,"-/-","-","-","-","-","-"]
["Nick Solak","TB - 2B",2012,"-/-","-","-","-","-","-"]
["Eric Stamets","Cle - 2B,SS",2017,"-/-","-","-","-","-","-"]
["Andy Ibanez","Tex - 2B",2032,"-/-","-","-","-","-","-"]
["Eliezer Álvarez","Tex - 2B,SS",2042,"-/-","-","-","-","-","-"]
["Kody Clemens","Det - 2B",2075,"-/-","-","-","-","-","-"]
["Leonardo Jimenez","Tor - 2B",2095,"-/-","-","-","-","-","-"]
["Kean Wong","TB - 2B",2120,"-/-","-","-","-","-","-"]
["Willi Castro","Det - 2B,SS",2121,"-/-","-","-","-","-","-"]
["Eli White","Tex - 2B",2122,"-/-","-","-","-","-","-"]
["Marcos Brito","Oak - 2B",2143,"-/-","-","-","-","-","-"]
["Vidal Brujan","TB - 2B",2151,"-/-","-","-","-","-","-"]
["Dylan Moore","Sea - 2B,3B",2196,"-/-","-","-","-","-","-"]
["Luis Arraez","Min - 2B",2197,"-/-","-","-","-","-","-"]
["Nick Madrigal","CWS - 2B",2210,"-/-","-","-","-","-","-"]
["Jonathan Arauz","Hou - 2B,SS",2241,"-/-","-","-","-","-","-"]
["Cavan Biggio","Tor - 2B",2242,"-/-","-","-","-","-","-"]
["Yunior Severino","Min - 2B",2243,"-/-","-","-","-","-","-"]
["Gordon Beckham","Det - 2B",2277,"8/44",3,0,1,1,0.182]
["Steve Wilkerson","Bal - 2B",2292,"8/46",2,0,3,1,0.174]
["Steve Lombardozzi","Oak - 2B,OF",2301,"-/-","-","-","-","-","-"]
["Michael Martínez","Cle - 2B,OF",2309,"-/-","-","-","-","-","-"]
["Mike Freeman","Cle - 2B",2321,"0/0",0,0,0,0,"-"]

{"sheet":"3rd Base","index":6,"n_rows":77,"n_cols":9,"rows_kept":77}
["Player","Team","Rank","H/AB","R","HR","RBI","SB","Avg."]
{"$rows_empty":7}
["Yolmer Sánchez","CWS - 2B,3B",438,"145/600",62,8,55,14,0.242]
[]
["Matt Duffy","TB - 3B",503,"148/503",59,4,44,12,0.294]
[]
[]
[]
["Ehire Adrianza","Min - 1B,3B,SS",1417,"84/335",42,6,39,5,0.251]
["Alcides Escobar","KC - 3B,SS,OF",1422,"112/485",54,4,34,8,0.231]
["Danny Valencia","Det - 1B,2B,3B,SS,OF",1439,"67/255",28,9,28,1,0.263]
["Daniel Robertson","TB - 2B,3B,SS",1444,"74/282",46,9,34,2,0.262]
[]
["Zack Cozart","LAA - 2B,3B,SS",1502,"49/224",29,5,18,0,0.219]
["Chris Owings","KC - 2B,3B,OF",1507,"58/281",34,4,22,11,0.206]
["Hunter Dozier","KC - 1B,3B",1540,"83/362",36,11,34,2,0.229]
["Logan Forsythe","Min - 2B,3B",1546,"86/371",37,2,27,3,0.232]
["Renato Núñez","Bal - 3B",1556,"61/236",28,8,22,0,0.258]
["Jace Peterson","Bal - 2B,3B,OF",1558,"42/210",21,3,28,13,0.2]
["Tommy La Stella","LAA - 2B,3B",1569,"45/169",23,1,19,0,0.266]
[]
[]
["Ronald Torreyes","Min - 2B,3B,SS",1604,"28/100",9,0,7,0,0.28]
["José Rondón","CWS - 3B,SS",1605,"23/100",15,6,14,2,0.23]
["Ronny Rodriguez","Det - 1B,2B,3B,SS",1618,"43/191",17,5,20,2,0.225]
["Patrick Wisdom","Tex - 3B",1629,"13/50",11,4,10,2,0.26]
["Brandon Drury","Tor - 2B,3B",1632,"13/77",5,1,10,0,0.169]
["J.P. Crawford","Sea - 3B,SS",1640,"25/117",17,3,12,2,0.214]
["Ryan Flaherty","Cle - 3B",1644,"35/161",17,2,13,4,0.217]
["Taylor Ward","LAA - 3B",1661,"24/135",14,6,15,2,0.178]
["Chase d'Arnaud","Tex - 2B,3B",1663,"20/93",9,3,9,2,0.215]
["Cheslor Cuthbert","KC - 1B,3B",1704,"20/103",11,3,7,0,0.194]
["Christian Arroyo","TB - 2B,3B",1706,"14/53",5,1,6,0,0.264]
["Gio Urshela","NYY - 3B,SS",1723,"10/43",7,1,3,0,0.233]
["Pete Kozma","Det - 3B,SS",1739,"15/69",7,1,8,0,0.217]
["Cliff Pennington","Tex - 3B",1768,"4/29",1,0,0,0,0.138]
["Rio Ruiz","Bal - 3B",1791,"1/12",1,0,0,0,0.083]
["Ramón Torres","KC - 3B",1799,"5/28",4,0,1,0,0.179]
["Rubén Tejada","Bal - 3B,SS",1802,"-/-","-","-","-","-","-"]
["Kaleb Cowart","Det - 2B,3B",1806,"15/112",7,1,10,1,0.134]
["Zach Vincej","Bal - 3B",1813,"2/4",0,0,1,0,0.5]
["Marco Hernández","Bos - 2B,3B",1816,"-/-","-","-","-","-","-"]
["Chris Coghlan","Tor - 3B,OF",1842,"-/-","-","-","-","-","-"]
["Jose Miranda","Min - 3B",1873,"-/-","-","-","-","-","-"]
["Jomar Reyes","Bal - 3B",1882,"-/-","-","-","-","-","-"]
["Triston Casas","Bos - 3B",1915,"-/-","-","-","-","-","-"]
["Michael Chavis","Bos - 3B",1977,"-/-","-","-","-","-","-"]
["Rylan Bannon","Bal - 3B",1993,"-/-","-","-","-","-","-"]
["Bobby Dalbec","Bos - 3B",2035,"-/-","-","-","-","-","-"]
["Chris Johnson","Bal - 1B,3B",2048,"-/-","-","-","-","-","-"]
["Josh Lowe","TB - 3B",2071,"-/-","-","-","-","-","-"]
["Emmanuel Rivera","KC - 3B",2076,"-/-","-","-","-","-","-"]
["Danny Díaz","Bos - 3B",2106,"-/-","-","-","-","-","-"]
["Kelvin Gutierrez","KC - 3B",2107,"-/-","-","-","-","-","-"]
["Nolan Jones","Cle - 3B",2117,"-/-","-","-","-","-","-"]
["Jean Carlos Encarnación","Bal - 3B",2156,"-/-","-","-","-","-","-"]
["Sheldon Neuse","Oak - 3B",2173,"-/-","-","-","-","-","-"]
["Jonathan Ornelas","Tex - 3B",2174,"-/-","-","-","-","-","-"]
["Brandon Howlett","Bos - 3B",2175,"-/-","-","-","-","-","-"]
["Joe Rizzo","Sea - 3B",2176,"-/-","-","-","-","-","-"]
["Andrew Bechtold","Min - 3B",2181,"-/-","-","-","-","-","-"]
["Dylan Moore","Sea - 2B,3B",2196,"-/-","-","-","-","-","-"]
["Jordan Groshans","Tor - 3B",2208,"-/-","-","-","-","-","-"]
["Miguel Hiraldo","Tor - 3B",2220,"-/-","-","-","-","-","-"]
["Trey Michalczewski","CWS - 3B",2237,"-/-","-","-","-","-","-"]
["Jake Burger","CWS - 3B",2255,"-/-","-","-","-","-","-"]
["Nick Northcut","Bos - 3B",2258,"-/-","-","-","-","-","-"]
["Steve Selsky","Bos - 3B,OF",2293,"-/-","-","-","-","-","-"]
["Dustin Peterson","Det - 3B,OF",2298,"0/2",0,0,0,0,0]
["Darnell Sweeney","Tor - 3B,OF",2299,"0/2",0,0,0,0,0]
["Cody Asche","KC - 3B,OF",2313,"-/-","-","-","-","-","-"]

{"sheet":"Short Stop","index":7,"n_rows":90,"n_cols":9,"rows_kept":90}
["Player","Team","Rank","H/AB","R","HR","RBI","SB","Avg."]
{"$rows_empty":13}
["José Iglesias","Det - SS",492,"116/432",43,5,48,15,0.269]
[]
["Brock Holt","Bos - 2B,SS,OF",1345,"89/321",41,7,46,7,0.277]
["Jordy Mercer","Det - SS",1397,"99/394",43,6,39,2,0.251]
["Ehire Adrianza","Min - 1B,3B,SS",1417,"84/335",42,6,39,5,0.251]
["Alcides Escobar","KC - 3B,SS,OF",1422,"112/485",54,4,34,8,0.231]
["Daniel Robertson","TB - 2B,3B,SS",1444,"74/282",46,9,34,2,0.262]
["Zack Cozart","LAA - 2B,3B,SS",1502,"49/224",29,5,18,0,0.219]
["Adeiny Hechavarria","NYY - SS",1504,"73/296",34,6,31,2,0.247]
["Ronald Torreyes","Min - 2B,3B,SS",1604,"28/100",9,0,7,0,0.28]
["José Rondón","CWS - 3B,SS",1605,"23/100",15,6,14,2,0.23]
["Ronny Rodriguez","Det - 1B,2B,3B,SS",1618,"43/191",17,5,20,2,0.225]
["J.P. Crawford","Sea - 3B,SS",1640,"25/117",17,3,12,2,0.214]
["Richard Ureña","Tor - 2B,SS",1648,"29/99",10,1,6,2,0.293]
["Tzu-Wei Lin","Bos - SS",1668,"16/65",15,1,6,0,0.246]
["Andrew Romine","Sea - 1B,2B,SS",1672,"25/119",15,0,2,1,0.21]
["Darwin Barney","Tex - 2B,SS",1714,"-/-","-","-","-","-","-"]
["Gio Urshela","NYY - 3B,SS",1723,"10/43",7,1,3,0,0.233]
[]
["Pete Kozma","Det - 3B,SS",1739,"15/69",7,1,8,0,0.217]
["Alexi Amarista","Det - SS,OF",1745,"-/-","-","-","-","-","-"]
["Eric Sogard","Tor - 2B,SS",1749,"13/97",7,0,2,3,0.134]
["Rubén Tejada","Bal - 3B,SS",1802,"-/-","-","-","-","-","-"]
["CJ Chatham","Bos - SS",1867,"-/-","-","-","-","-","-"]
["Royce Lewis","Min - SS",1868,"-/-","-","-","-","-","-"]
["Luis Curbelo","CWS - SS",1874,"-/-","-","-","-","-","-"]
["Drew Jackson","Bal - SS",1877,"-/-","-","-","-","-","-"]
["Laz Rivera","CWS - SS",1879,"-/-","-","-","-","-","-"]
["Thairo Estrada","NYY - SS",1892,"-/-","-","-","-","-","-"]
["Wander Franco","TB - SS",1898,"-/-","-","-","-","-","-"]
["Leonardo Rivas","LAA - SS",1908,"-/-","-","-","-","-","-"]
["Richie Martin","Bal - SS",1914,"-/-","-","-","-","-","-"]
["Juan Querecuto","Sea - SS",1935,"-/-","-","-","-","-","-"]
["Yerdel Vargas","Oak - SS",1941,"-/-","-","-","-","-","-"]
["Luis Santana","Hou - SS",1948,"-/-","-","-","-","-","-"]
["Roberto Baldoquín","LAA - SS",1949,"-/-","-","-","-","-","-"]
["Orelvis Martinez","Tor - SS",1956,"-/-","-","-","-","-","-"]
["Luís Rengifo","LAA - 2B,SS",1962,"-/-","-","-","-","-","-"]
["Ronny Brito","Tor - SS",1963,"-/-","-","-","-","-","-"]
["Noelvi Marte","Sea - SS",1964,"-/-","-","-","-","-","-"]
["Nicholas Lopez","KC - SS",1970,"-/-","-","-","-","-","-"]
["Isaac Paredes","Det - SS",1984,"-/-","-","-","-","-","-"]
["Livan Soto","LAA - SS",1986,"-/-","-","-","-","-","-"]
["Alexander Campos","Oak - SS",1988,"-/-","-","-","-","-","-"]
["Kevin Merrell","Oak - SS",1999,"-/-","-","-","-","-","-"]
["Chris Seise","Tex - SS",2006,"-/-","-","-","-","-","-"]
["Wander Javier","Min - SS",2008,"-/-","-","-","-","-","-"]
["Eric Stamets","Cle - 2B,SS",2017,"-/-","-","-","-","-","-"]
["Eliezer Álvarez","Tex - 2B,SS",2042,"-/-","-","-","-","-","-"]
["Jean Carmona","Bal - SS",2043,"-/-","-","-","-","-","-"]
["Anderson Tejeda","Tex - SS",2047,"-/-","-","-","-","-","-"]
["Raynel Delgado","Cle - SS",2050,"-/-","-","-","-","-","-"]
["Lucius Fox","TB - SS",2077,"-/-","-","-","-","-","-"]
["Freudis Nova","Hou - SS",2090,"-/-","-","-","-","-","-"]
["Nick Allen","Oak - SS",2113,"-/-","-","-","-","-","-"]
["Willi Castro","Det - 2B,SS",2121,"-/-","-","-","-","-","-"]
["Jason Leblebijian","Tor - SS",2127,"-/-","-","-","-","-","-"]
["Miguelangel Sierra","Hou - SS",2131,"-/-","-","-","-","-","-"]
["Kevin Smith","Tor - SS",2149,"-/-","-","-","-","-","-"]
["Logan Warmoth","Tor - SS",2152,"-/-","-","-","-","-","-"]
["Antoni Flores","Bos - SS",2157,"-/-","-","-","-","-","-"]
["Nonie Williams","LAA - SS",2164,"-/-","-","-","-","-","-"]
["Ryan Mountcastle","Bal - SS",2168,"-/-","-","-","-","-","-"]
["Aaron Bracho","Cle - SS",2169,"-/-","-","-","-","-","-"]
["Jeremiah Jackson","LAA - SS",2178,"-/-","-","-","-","-","-"]
["Santiago Espinal","Tor - SS",2193,"-/-","-","-","-","-","-"]
["Nick Gordon","Min - SS",2201,"-/-","-","-","-","-","-"]
["Gabriel Rodriguez","Cle - SS",2212,"-/-","-","-","-","-","-"]
["Brayan Rocchio","Cle - SS",2232,"-/-","-","-","-","-","-"]
["Carlos Vargas","TB - SS",2236,"-/-","-","-","-","-","-"]
["Jonathan Arauz","Hou - 2B,SS",2241,"-/-","-","-","-","-","-"]
["Yu Chang","Cle - SS",2244,"-/-","-","-","-","-","-"]
["Jeremy Eierman","Oak - SS",2245,"-/-","-","-","-","-","-"]
["Jorge Mateo","Oak - SS",2251,"-/-","-","-","-","-","-"]
["Cadyn Grenier","Bal - SS",2268,"-/-","-","-","-","-","-"]
["Sergio Alcántara","Det - SS",2269,"-/-","-","-","-","-","-"]

{"sheet":"Outfield","index":8,"n_rows":212,"n_cols":9,"rows_kept":212}
["Player","Team","Rank","H/AB","R","HR","RBI","SB","Avg."]
{"$rows_empty":16}
["Kevin Kiermaier","TB - OF",270,"72/332",44,7,29,10,0.217]
[]
[]
[]
[]
["Cedric Mullins","Bal - OF",319,"40/170",23,4,11,2,0.235]
[]
[]
[]
["Denard Span","Sea - OF",377,"114/437",63,11,58,9,0.261]
[]
[]
[]
[]
["Alex Gordon","KC - OF",510,"124/506",56,13,54,12,0.245]
[]
["Mark Canha","Oak - 1B,OF",1072,"91/365",60,17,52,1,0.249]
[]
["Melky Cabrera","Cle - OF",1195,"70/250",28,6,39,1,0.28]
["Gorkys Hernández","Bos - OF",1225,"97/414",52,15,40,8,0.234]
[]
["Jake Cave","Min - OF",1256,"76/283",54,13,45,2,0.269]
[]
["Brock Holt","Bos - 2B,SS,OF",1345,"89/321",41,7,46,7,0.277]
["Leonys Martin","Cle - OF",1384,"81/318",48,11,33,7,0.255]
["Carlos Gómez","TB - OF",1389,"75/360",42,9,32,12,0.208]
["Leury García","CWS - OF",1395,"70/258",23,4,32,12,0.271]
[]
["Cameron Maybin","Sea - OF",1400,"85/342",32,4,28,10,0.249]
["Alcides Escobar","KC - 3B,SS,OF",1422,"112/485",54,4,34,8,0.231]
["Danny Valencia","Bal - 3B,OF",1439,"67/255",28,9,28,1,0.263]
["Adam Engel","CWS - OF",1454,"101/429",49,6,29,16,0.235]
["Jake Marisnick","Hou - OF",1456,"45/213",34,10,28,6,0.211]
["Greg Allen","Cle - OF",1462,"68/265",36,2,20,21,0.257]
["Tony Kemp","Hou - OF",1479,"67/255",37,6,30,9,0.263]
["JaCoby Jones","Det - OF",1485,"89/429",54,11,34,13,0.207]
["Chris Owings","KC - 2B,3B,OF",1507,"58/281",34,4,22,11,0.206]
["Matt Joyce","Cle - OF",1515,"43/207",34,7,15,0,0.208]
["Mikie Mahtook","Det - OF",1519,"45/223",24,9,29,4,0.202]
["Brian Goodwin","KC - OF",1528,"38/159",20,6,25,4,0.239]
["Joey Rickard","Bal - OF",1529,"52/213",27,8,23,4,0.244]
[]
["Hunter Pence","Tex - OF",1532,"53/235",19,4,24,5,0.226]
["Jorge Bonifacio","KC - OF",1537,"53/236",31,4,23,0,0.225]
["Nicky Delmonico","CWS - 1B,OF",1553,"61/284",31,8,25,1,0.215]
["Jace Peterson","Bal - 2B,3B,OF",1558,"42/210",21,3,28,13,0.2]
["Guillermo Heredia","TB - OF",1560,"69/292",29,5,19,2,0.236]
["Craig Gentry","Bal - OF",1561,"42/156",13,1,11,12,0.269]
["Brandon Guyer","CWS - OF",1568,"40/194",25,7,27,1,0.206]
["Bradley Zimmer","Cle - OF",1570,"24/106",14,2,9,4,0.226]
["Nick Martini","Oak - OF",1571,"45/152",26,1,19,0,0.296]
[]
["Tyler Naquin","Cle - OF",1576,"46/174",22,3,23,1,0.264]
["Dustin Fowler","Oak - OF",1577,"43/192",19,6,23,6,0.224]
["Victor Reyes","Det - OF",1579,"47/212",35,1,12,9,0.222]
[]
["Chris Young","LAA - OF",1602,"19/113",17,6,13,2,0.168]
["Billy McKinney","Tor - OF",1608,"30/119",14,6,13,1,0.252]
["Jacoby Ellsbury","NYY - OF",1610,"-/-","-","-","-","-","-"]
["Eric Young Jr.","LAA - OF",1616,"22/109",12,1,8,5,0.202]
["Ryan Rua","Tex - 1B,OF",1623,"27/139",17,6,12,3,0.194]
["Derek Fisher","Hou - OF",1637,"13/79",13,4,11,2,0.165]
["DJ Stewart","Bal - OF",1650,"10/40",8,3,10,2,0.25]
["Jordan Luplow","Cle - OF",1669,"17/92",16,3,7,2,0.185]
["Dwight Smith Jr.","Tor - OF",1673,"17/65",9,2,8,0,0.262]
["Brett Phillips","KC - OF",1676,"25/134",15,2,11,1,0.187]
["Brandon Moss","Oak - 1B,OF",1678,"-/-","-","-","-","-","-"]
["Charlie Tilson","CWS - OF",1680,"28/106",7,0,11,2,0.264]
["Alex Presley","Bal - OF",1683,"-/-","-","-","-","-","-"]
["Terrance Gore","KC - OF",1689,"1/5",5,0,0,6,0.2]
["Clint Frazier","NYY - OF",1691,"9/34",9,0,1,0,0.265]
["Peter Bourjos","LAA - OF",1695,"9/44",5,1,4,0,0.205]
[]
["Brandon Dixon","Det - 1B,OF",1701,"21/118",14,5,10,0,0.178]
["Ryan Schimpf","LAA - OF",1705,"1/5",2,1,2,0,0.2]
["Sam Travis","Bos - OF",1709,"8/36",5,1,7,0,0.222]
["Danny Santana","Tex - OF",1716,"5/28",4,0,2,1,0.179]
["Myles Straw","Hou - OF",1727,"3/9",4,1,1,2,0.333]
["Ichiro Suzuki","Sea - OF",1740,"9/44",5,0,0,0,0.205]
["Alexi Amarista","Det - SS,OF",1745,"-/-","-","-","-","-","-"]
["Jaycob Brugman","Bal - OF",1756,"-/-","-","-","-","-","-"]
["Michael Saunders","KC - OF",1757,"-/-","-","-","-","-","-"]
["Carlos Tocci","Tex - OF",1759,"27/120",11,0,5,0,0.225]
["Jonathan Davis","Tor - OF",1761,"5/25",3,0,0,3,0.2]
["Zack Granite","Min - OF",1762,"-/-","-","-","-","-","-"]
["Anthony Santander","Bal - OF",1764,"20/101",8,1,6,1,0.198]
["Brandon Barnes","Cle - OF",1767,"5/19",2,1,2,0,0.263]
["Willy García","CWS - OF",1770,"-/-","-","-","-","-","-"]
["Michael Hermosillo","LAA - OF",1783,"12/57",7,1,1,0,0.211]
["Tyler Collins","KC - OF",1785,"-/-","-","-","-","-","-"]
["Rymer Liriano","LAA - OF",1815,"-/-","-","-","-","-","-"]
["Darrell Ceciliani","Tor - OF",1820,"-/-","-","-","-","-","-"]
["Trayce Thompson","Cle - OF",1821,"15/128",15,3,9,3,0.117]
["Brett Eibner","Tex - OF",1822,"-/-","-","-","-","-","-"]
["Christopher Bostick","Bal - 2B,OF",1823,"3/16",0,0,2,0,0.188]
["Austin Hays","Bal - OF",1824,"-/-","-","-","-","-","-"]
["Michael Reed","Min - OF",1832,"2/7",1,0,0,0,0.286]
["Chad Huffman","Det - OF",1838,"-/-","-","-","-","-","-"]
["Cameron Perkins","Sea - OF",1841,"-/-","-","-","-","-","-"]
["Chris Coghlan","Tor - 3B,OF",1842,"-/-","-","-","-","-","-"]
["Anthony Alford","Tor - OF",1856,"2/19",3,0,1,1,0.105]
["Brewer Hicklen","KC - OF",1862,"-/-","-","-","-","-","-"]
["Gilberto Celestino","Min - OF",1863,"-/-","-","-","-","-","-"]
["Griffin Conine","Tor - OF",1876,"-/-","-","-","-","-","-"]
["Lazaro Armenteros","Oak - OF",1878,"-/-","-","-","-","-","-"]
["Tony Renda","Bos - 2B,OF",1888,"-/-","-","-","-","-","-"]
["Luke Raley","Min - OF",1891,"-/-","-","-","-","-","-"]
["Jameson Hannah","Oak - OF",1900,"-/-","-","-","-","-","-"]
["Rusney Castillo","Bos - OF",1903,"-/-","-","-","-","-","-"]
["Kyle Isbel","KC - OF",1904,"-/-","-","-","-","-","-"]
["George Valera","Cle - OF",1919,"-/-","-","-","-","-","-"]
["Pedro Gonzalez","Tex - OF",1921,"-/-","-","-","-","-","-"]
["Akil Baddoo","Min - OF",1923,"-/-","-","-","-","-","-"]
["Trent Deveaux","LAA - OF",1927,"-/-","-","-","-","-","-"]
["Donnie Dewees","KC - OF",1928,"-/-","-","-","-","-","-"]
["Jahmai Jones","LAA - OF",1934,"-/-","-","-","-","-","-"]
["Will Benson","Cle - OF",1947,"-/-","-","-","-","-","-"]
["Leody Taveras","Tex - OF",1952,"-/-","-","-","-","-","-"]
["Luis Robert","CWS - OF",1955,"-/-","-","-","-","-","-"]
["Jarred Kelenic","Sea - OF",1965,"-/-","-","-","-","-","-"]
["Kyler Murray","Oak - OF",1969,"-/-","-","-","-","-","-"]
["Steele Walker","CWS - OF",1974,"-/-","-","-","-","-","-"]
["Ronnie Dawson","Hou - OF",1976,"-/-","-","-","-","-","-"]
["Nick Decker","Bos - OF",1981,"-/-","-","-","-","-","-"]
["Khalil Lee","KC - OF",1992,"-/-","-","-","-","-","-"]
["Jesús Sánchez","TB - OF",1996,"-/-","-","-","-","-","-"]
["Joe McCarthy","TB - OF",1997,"-/-","-","-","-","-","-"]
["Skye Bolt","Oak - OF",2000,"-/-","-","-","-","-","-"]
["Luis Basabe","CWS - OF",2003,"-/-","-","-","-","-","-"]
["Garrett Whitley","TB - OF",2004,"-/-","-","-","-","-","-"]
["LaMonte Wade","Min - OF",2011,"-/-","-","-","-","-","-"]
["Bubba Starling","KC - OF",2016,"-/-","-","-","-","-","-"]
["Conner Capel","Cle - OF",2019,"-/-","-","-","-","-","-"]
["Scott Heineman","Tex - OF",2020,"-/-","-","-","-","-","-"]
["Brennon Lund","LAA - OF",2022,"-/-","-","-","-","-","-"]
["Estevan Florial","NYY - OF",2037,"-/-","-","-","-","-","-"]
["Jake Fraley","Sea - OF",2040,"-/-","-","-","-","-","-"]
["Everson Pereira","NYY - OF",2044,"-/-","-","-","-","-","-"]
["Luis Gonzalez","CWS - OF",2046,"-/-","-","-","-","-","-"]
["Julio Pablo Martinez","Tex - OF",2049,"-/-","-","-","-","-","-"]
["Seuly Matias","KC - OF",2054,"-/-","-","-","-","-","-"]
["Parker Meadows","Det - OF",2056,"-/-","-","-","-","-","-"]
["Kingston Liniak","Det - OF",2057,"-/-","-","-","-","-","-"]
["Blake Perkins","KC - OF",2061,"-/-","-","-","-","-","-"]
["Ryder Green","NYY - OF",2065,"-/-","-","-","-","-","-"]
["Michael Gigliotti","KC - OF",2067,"-/-","-","-","-","-","-"]
["Luis Barrera","Oak - OF",2068,"-/-","-","-","-","-","-"]
["Jacob Robson","Det - OF",2072,"-/-","-","-","-","-","-"]
["Jose Azocar","Det - OF",2073,"-/-","-","-","-","-","-"]
["Jordyn Adams","LAA - OF",2085,"-/-","-","-","-","-","-"]
["Troy Montgomery","Det - OF",2087,"-/-","-","-","-","-","-"]
["Josh Stowers","NYY - OF",2089,"-/-","-","-","-","-","-"]
["Bubba Thompson","Tex - OF",2096,"-/-","-","-","-","-","-"]
["Nick Schnell","TB - OF",2124,"-/-","-","-","-","-","-"]
["Dom Thom","Sea - OF",2125,"-/-","-","-","-","-","-"]
["Frank Schwindel","KC - OF",2126,"-/-","-","-","-","-","-"]
["Blake Rutherford","CWS - OF",2130,"-/-","-","-","-","-","-"]
["Greg Deichmann","Oak - OF",2132,"-/-","-","-","-","-","-"]
["Austin Beck","Oak - OF",2135,"-/-","-","-","-","-","-"]
["Travis Snider","Tex - OF",2139,"-/-","-","-","-","-","-"]
["Harold Ramírez","Tor - OF",2142,"-/-","-","-","-","-","-"]
["Trevor Larnach","Min - OF",2144,"-/-","-","-","-","-","-"]
["Cole Brannen","Bos - OF",2148,"-/-","-","-","-","-","-"]
["Braden Bishop","Sea - OF",2160,"-/-","-","-","-","-","-"]
["Yordan Álvarez","Hou - OF",2172,"-/-","-","-","-","-","-"]
["Miguel Aparicio","Tex - OF",2183,"-/-","-","-","-","-","-"]
["Kyle Lewis","Sea - OF",2187,"-/-","-","-","-","-","-"]
["Jacob Pearson","Min - OF",2189,"-/-","-","-","-","-","-"]
["Micker Adolfo","CWS - OF",2200,"-/-","-","-","-","-","-"]
["Alex Kirilloff","Min - OF",2203,"-/-","-","-","-","-","-"]
["Julio Rodriguez","Sea - OF",2213,"-/-","-","-","-","-","-"]
["J.J. Matijevic","Hou - OF",2222,"-/-","-","-","-","-","-"]
["Tyler Ramirez","Oak - OF",2224,"-/-","-","-","-","-","-"]
["Brent Rooker","Min - OF",2231,"-/-","-","-","-","-","-"]
["Oscar Mercado","Cle - OF",2238,"-/-","-","-","-","-","-"]
["Seth Beer","Hou - OF",2240,"-/-","-","-","-","-","-"]
["Brandon Marsh","LAA - OF",2247,"-/-","-","-","-","-","-"]
["Elier Hernandez","KC - OF",2250,"-/-","-","-","-","-","-"]
["Eric Jenkins","Tex - OF",2263,"-/-","-","-","-","-","-"]
["Daz Cameron","Det - OF",2270,"-/-","-","-","-","-","-"]
["Billy Burns","KC - OF",2272,"-/-","-","-","-","-","-"]
["Chris Heisey","Min - OF",2276,"-/-","-","-","-","-","-"]
["Ian Parmley","Tor - OF",2281,"-/-","-","-","-","-","-"]
["Kirk Nieuwenhuis","Sea - OF",2283,"-/-","-","-","-","-","-"]
["Steve Selsky","Bos - 3B,OF",2293,"-/-","-","-","-","-","-"]
["Dustin Peterson","Det - 3B,OF",2298,"0/2",0,0,0,0,0]
["Darnell Sweeney","Tor - 3B,OF",2299,"0/2",0,0,0,0,0]
["Steve Lombardozzi","Oak - 2B,OF",2301,"-/-","-","-","-","-","-"]
["Dalton Pompey","Tor - OF",2305,"2/10",0,0,0,0,0.2]
["Ryan Cordell","CWS - OF",2307,"4/37",3,1,4,0,0.108]
["Michael Martínez","Cle - 2B,OF",2309,"-/-","-","-","-","-","-"]
["Cody Asche","KC - 3B,OF",2313,"-/-","-","-","-","-","-"]
["Jacob May","CWS - OF",2319,"-/-","-","-","-","-","-"]
["Paulo Orlando","KC - OF",2324,"15/90",6,0,5,0,0.167]
["Jake Smolinski","TB - OF",2325,"5/39",2,0,2,1,0.128]

{"sheet":"DH","index":9,"n_rows":3,"n_cols":9,"rows_kept":3}
["Player","Team","Rank","H/AB","R","HR","RBI","SB","Avg."]
[]
["Ji-Man Choi","TB - Util","1526","50/190",25,10,32,2,0.263]

{"sheet":"Pitchers","index":10,"n_rows":292,"n_cols":9,"rows_kept":292}
["Player","Team","Rank","IP","W","S","K","ERA","WHIP"]
{"$rows_empty":28}
["Daniel Mengden","Oak - SP,RP","414","115.2","7","0","72","4.05","1.12"]
[]
[]
[]
["Edwin Jackson","Oak - SP","445","92.0","6","0","68","3.33","1.22"]
["Roenis Elías","Sea - SP,RP","456","51.0","3","0","34","2.65","1.22"]
[]
["Blaine Hardy","Det - SP,RP","469","86.0","4","1","66","3.56","1.17"]
["Jordan Montgomery","NYY - SP","476","27.1","2","0","23","3.62","1.35"]
["Hector Velázquez","Bos - SP,RP","491","85.0","7","0","53","3.18","1.45"]
[]
["Steven Wright","Bos - SP,RP","494","53.2","3","1","42","2.68","1.25"]
[]
[]
["Thomas Pannone","Tor - SP,RP","523","43.0","4","0","29","4.19","1.21"]
["Adalberto Mejía","Min - SP","530","22.1","2","0","13","2.01","1.16"]
[]
["David Phelps","Tor - SP,RP","573","-","-","-","-","-","-"]
["Alex Meyer","LAA - SP,RP","575","-","-","-","-","-","-"]
[]
[]
["Nate Karns","Bal - SP","593","-","-","-","-","-","-"]
["Dustin McGowan","TB - SP,RP","600","-","-","-","-","-","-"]
["Gabriel Moya","Min - SP,RP","620","36.1","3","0","31","4.71","1.32"]
[]
[]
["Gregory Soto","Det - SP","653","-","-","-","-","-","-"]
["Blaine Knight","Bal - SP","654","-","-","-","-","-","-"]
["Casey Mize","Det - SP","659","-","-","-","-","-","-"]
["Brenan Hanifee","Bal - SP","662","-","-","-","-","-","-"]
["Conner Greene","KC - SP","667","-","-","-","-","-","-"]
["A.J. Alexy","Tex - SP","668","-","-","-","-","-","-"]
["Nolan Watson","KC - SP","669","-","-","-","-","-","-"]
["Jackson Kowar","KC - SP","675","-","-","-","-","-","-"]
["Cole Winn","Tex - SP","676","-","-","-","-","-","-"]
["Luís Madero","LAA - SP","682","-","-","-","-","-","-"]
["Daulton Jefferies","Oak - SP","686","-","-","-","-","-","-"]
["Matthew Liberatore","TB - SP","688","-","-","-","-","-","-"]
["Konnor Pilkington","CWS - SP","689","-","-","-","-","-","-"]
["Patrick Sandoval","LAA - SP","691","-","-","-","-","-","-"]
["Austin Franklin","TB - SP","692","-","-","-","-","-","-"]
["Jonathan Hernandez","Tex - SP","693","-","-","-","-","-","-"]
["Grayson Long","LAA - SP","694","-","-","-","-","-","-"]
["Brady Aiken","Cle - SP","697","-","-","-","-","-","-"]
["Trey Ball","Bos - SP","699","-","-","-","-","-","-"]
["Brusdar Graterol","Min - SP","702","-","-","-","-","-","-"]
["Richard Lovelady","KC - SP","710","-","-","-","-","-","-"]
["Darwinzon Hernandez","Bos - SP","711","-","-","-","-","-","-"]
["Cristian Javier","Hou - SP","712","-","-","-","-","-","-"]
["A.J. Puk","Oak - SP","717","-","-","-","-","-","-"]
["Alex Wells","Bal - SP","719","-","-","-","-","-","-"]
["J.B. Bukauskas","Hou - SP","722","-","-","-","-","-","-"]
["Dane Dunning","CWS - SP","729","-","-","-","-","-","-"]
["Michael Mercado","TB - SP","730","-","-","-","-","-","-"]
["Cody Sedlock","Bal - SP","731","-","-","-","-","-","-"]
["Eli Morgan","Cle - SP","733","-","-","-","-","-","-"]
["Tyler Alexander","Det - SP","736","-","-","-","-","-","-"]
["Mike Shawaryn","Bos - SP","737","-","-","-","-","-","-"]
["Elvis Luciano","Tor - SP","739","-","-","-","-","-","-"]
["Chris Rodríguez","LAA - SP","744","-","-","-","-","-","-"]
["Jason Groome","Bos - SP","745","-","-","-","-","-","-"]
["Trent Thornton","Tor - SP","746","-","-","-","-","-","-"]
["José Suárez","LAA - SP","749","-","-","-","-","-","-"]
["Yefri Del Rosario","KC - SP","750","-","-","-","-","-","-"]
["Kyle Cody","Tex - SP","751","-","-","-","-","-","-"]
["Ashe Russell","KC - SP","752","-","-","-","-","-","-"]
["Nick Nelson","NYY - SP","755","-","-","-","-","-","-"]
["Tyler Phillips","Tex - SP","758","-","-","-","-","-","-"]
["Kevin Gadea","TB - SP","760","-","-","-","-","-","-"]
["Patrick Murphy","Tor - SP","762","-","-","-","-","-","-"]
["Tanner Houck","Bos - SP","763","-","-","-","-","-","-"]
["Norge Ruiz","Oak - SP","765","-","-","-","-","-","-"]
["Lewis Thorpe","Min - SP","767","-","-","-","-","-","-"]
["Luis Oviedo","Cle - SP","769","-","-","-","-","-","-"]
["Hans Crouse","Tex - SP","771","-","-","-","-","-","-"]
["Jon Harris","Tor - SP","775","-","-","-","-","-","-"]
["Deivi Garcia","NYY - SP","777","-","-","-","-","-","-"]
["Dean Kremer","Bal - SP","778","-","-","-","-","-","-"]
["Grayson Rodriguez","Bal - SP","782","-","-","-","-","-","-"]
["Rob Kaminsky","Cle - SP","783","-","-","-","-","-","-"]
["Dillon Tate","Bal - SP","785","-","-","-","-","-","-"]
["Logan Shore","Det - SP","786","-","-","-","-","-","-"]
["Garrett Whitlock","NYY - SP","788","-","-","-","-","-","-"]
["Jairo Solis","Hou - SP","793","-","-","-","-","-","-"]
["Drew Smyly","Tex - SP","796","-","-","-","-","-","-"]
["Jose Soriano","LAA - SP","798","-","-","-","-","-","-"]
["Jayson Schroeder","Hou - SP","800","-","-","-","-","-","-"]
["Corbin Martin","Hou - SP","801","-","-","-","-","-","-"]
["Griffin Canning","LAA - SP","803","-","-","-","-","-","-"]
["Sam McWilliams","KC - SP","809","-","-","-","-","-","-"]
["James Naile","Oak - SP","812","-","-","-","-","-","-"]
["T.J. Zeuch","Tor - SP","814","-","-","-","-","-","-"]
["Alex Speas","Tex - SP","818","-","-","-","-","-","-"]
["Blayne Enlow","Min - SP","822","-","-","-","-","-","-"]
["Kyle Zimmer","KC - SP","823","-","-","-","-","-","-"]
["Owen White","Tex - SP","827","-","-","-","-","-","-"]
["Lincoln Henzman","CWS - SP","828","-","-","-","-","-","-"]
["Jhonathan Diaz","Bos - SP","830","-","-","-","-","-","-"]
["James Kaprielian","Oak - SP","832","-","-","-","-","-","-"]
["Justin Dunn","Sea - SP","836","-","-","-","-","-","-"]
["Kodi Medeiros","CWS - SP","838","-","-","-","-","-","-"]
["Rogelio Armenteros","Hou - SP","839","-","-","-","-","-","-"]
["Brandon Bielak","Hou - SP","841","-","-","-","-","-","-"]
["Resly Linares","TB - SP","843","-","-","-","-","-","-"]
["Adam Kloffenstein","Tor - SP","846","-","-","-","-","-","-"]
["Roniel Raudes","Bos - SP","848","-","-","-","-","-","-"]
["Franklin Perez","Det - SP","849","-","-","-","-","-","-"]
["Sam Hentges","Cle - SP","853","-","-","-","-","-","-"]
["Kris Bubic","KC - SP","855","-","-","-","-","-","-"]
["Nate Pearson","Tor - SP","862","-","-","-","-","-","-"]
["Bryan Mata","Bos - SP","867","-","-","-","-","-","-"]
["Nate Smith","LAA - SP","875","-","-","-","-","-","-"]
["Jhoan Duran","Min - SP","878","-","-","-","-","-","-"]
["Luis Medina","NYY - SP","881","-","-","-","-","-","-"]
["Michael Baumann","Bal - SP","883","-","-","-","-","-","-"]
["Spencer Adams","CWS - SP","884","-","-","-","-","-","-"]
["Jesús Castillo","LAA - SP","887","-","-","-","-","-","-"]
["Kutter Crawford","Bos - SP","890","-","-","-","-","-","-"]
["Tim Lincecum","Tex - SP","891","-","-","-","-","-","-"]
["Tobias Myers","TB - SP","895","-","-","-","-","-","-"]
["A.J. Puckett","KC - SP","897","-","-","-","-","-","-"]
["Bernardo Flores","CWS - SP","899","-","-","-","-","-","-"]
["Logan Gilbert","Sea - SP","900","-","-","-","-","-","-"]
["Mason Englert","Tex - SP","903","-","-","-","-","-","-"]
["Kyle Funkhouser","Det - SP","905","-","-","-","-","-","-"]
["Travis Lakins","Bos - SP","907","-","-","-","-","-","-"]
["Scott Blewett","KC - SP","908","-","-","-","-","-","-"]
["Arnaldo Hernandez","KC - SP","909","-","-","-","-","-","-"]
["Freicer Pérez","NYY - SP","910","-","-","-","-","-","-"]
["Cody Anderson","Cle - SP","911","-","-","-","-","-","-"]
["Julian Merryweather","Tor - SP","916","-","-","-","-","-","-"]
["Trevor Stephan","NYY - SP","917","-","-","-","-","-","-"]
["Chris Ellis","KC - SP","918","-","-","-","-","-","-"]
["Jordan Balazovic","Min - SP","924","-","-","-","-","-","-"]
["Austin Cox","KC - SP","925","-","-","-","-","-","-"]
["Zac Lowther","Bal - SP","928","-","-","-","-","-","-"]
["Jordan Stephens","CWS - SP","929","-","-","-","-","-","-"]
["Brett Martin","Tex - SP","930","-","-","-","-","-","-"]
["Daniel Lynch","KC - SP","938","-","-","-","-","-","-"]
["Sandy Gaston","TB - SP","939","-","-","-","-","-","-"]
["Jordan Romano","Tex - SP","949","-","-","-","-","-","-"]
["DL Hall","Bal - SP","951","-","-","-","-","-","-"]
["Erik Swanson","Sea - SP","953","-","-","-","-","-","-"]
["Carlos Hernandez","KC - SP","956","-","-","-","-","-","-"]
["Sam Carlson","Sea - SP","957","-","-","-","-","-","-"]
["Keegan Akin","Bal - SP","958","-","-","-","-","-","-"]
["Albert Abreu","NYY - SP","959","-","-","-","-","-","-"]
["Matt Manning","Det - SP","964","-","-","-","-","-","-"]
["Manny Bañuelos","CWS - SP","970","-","-","-","-","-","-"]
["Jason Bahr","Tex - SP","973","-","-","-","-","-","-"]
["Jonathan Stiever","CWS - SP","974","-","-","-","-","-","-"]
["Aaron Civale","Cle - SP","976","-","-","-","-","-","-"]
["Taylor Hearn","Tex - SP","977","-","-","-","-","-","-"]
["Alec Hansen","CWS - SP","979","-","-","-","-","-","-"]
["Triston McKenzie","Cle - SP","980","-","-","-","-","-","-"]
["Dakota Chalmers","Oak - SP","981","-","-","-","-","-","-"]
["Josh Staumont","KC - SP","982","-","-","-","-","-","-"]
["Jerryell Rivera","LAA - SP","985","-","-","-","-","-","-"]
["Matt Sauer","NYY - SP","990","-","-","-","-","-","-"]
["Cameron Bishop","Bal - SP","991","-","-","-","-","-","-"]
["Grant Holmes","Oak - SP","992","-","-","-","-","-","-"]
["Eric Pardinho","Tor - SP","993","-","-","-","-","-","-"]
["Brock Burke","Tex - SP","996","-","-","-","-","-","-"]
[]
["Shane McClanahan","TB - SP","1002","-","-","-","-","-","-"]
["Beau Burrows","Det - SP","1008","-","-","-","-","-","-"]
["Foster Griffin","KC - SP","1015","-","-","-","-","-","-"]
["Brady Singer","KC - SP","1016","-","-","-","-","-","-"]
["Cole Ragans","Tex - SP","1019","-","-","-","-","-","-"]
["Yennsy Díaz","Tor - SP","1025","-","-","-","-","-","-"]
["Ricardo Sánchez","Sea - SP","1026","-","-","-","-","-","-"]
["Jorge Alcala","Min - SP","1027","-","-","-","-","-","-"]
["Lenny Torres","Cle - SP","1029","-","-","-","-","-","-"]
["Ethan Hankins","Cle - SP","1030","-","-","-","-","-","-"]
["Clarke Schmidt","NYY - SP","1031","-","-","-","-","-","-"]
["Brett Oberholtzer","Tor - SP,RP","1035","-","-","-","-","-","-"]
["Andrew Triggs","Oak - SP","1042","41.1","3","0","43","5.23","1.33"]
["Edinson Volquez","Tex - SP","1047","-","-","-","-","-","-"]
["TJ House","CWS - SP,RP","1049","-","-","-","-","-","-"]
["José De León","TB - SP","1062","-","-","-","-","-","-"]
["Liam Hendriks","Oak - SP,RP","1065","24.0","0","0","22","4.13","1.46"]
["Nick Tropeano","LAA - SP","1067","76.0","5","0","64","4.74","1.30"]
["Kohl Stewart","Min - SP","1068","36.2","2","0","24","3.68","1.42"]
["Adrian Sampson","Tex - SP","1121","23.0","0","0","15","4.30","1.22"]
["Paolo Espino","Tex - SP","1123","-","-","-","-","-","-"]
["Ervin Santana","CWS - SP","1124","24.2","0","0","16","8.03","1.62"]
["Hunter Wood","TB - SP,RP","1125","41.0","1","0","42","3.73","1.46"]
["Nick Tepesch","Tor - SP","1126","-","-","-","-","-","-"]
["Tim Melville","Bal - SP","1131","-","-","-","-","-","-"]
["Felix Jorge","Min - SP","1134","-","-","-","-","-","-"]
[]
[]
["Chase De Jong","Min - SP","1161","17.2","1","0","13","3.57","1.36"]
["Heath Fillmyer","KC - SP","1176","82.1","4","0","57","4.26","1.34"]
["Asher Wojciechowski","Cle - SP,RP","1182","-","-","-","-","-","-"]
[]
["Jesse Hahn","KC - SP","1188","-","-","-","-","-","-"]
["David Holmberg","Bal - SP,RP","1203","-","-","-","-","-","-"]
["Adam Wilk","Cle - SP,RP","1211","-","-","-","-","-","-"]
["Jharel Cotton","Oak - SP","1212","-","-","-","-","-","-"]
[]
["Justin Nicolino","Min - SP","1218","-","-","-","-","-","-"]
[]
["JC Ramírez","LAA - SP","1234","6.2","0","0","4","9.45","2.10"]
[]
["Fernando Romero","Min - SP","1251","55.2","3","0","45","4.69","1.42"]
["Jake Faria","TB - SP,RP","1259","65.0","4","0","50","5.40","1.43"]
["Ricky Nolasco","KC - SP","1266","-","-","-","-","-","-"]
["Brian Johnson","Bos - SP,RP","1281","99.1","4","0","87","4.17","1.43"]
["John Lamb","LAA - SP","1295","10.0","0","0","11","7.20","1.90"]
["Yohander Méndez","Tex - SP","1309","27.2","2","0","18","5.53","1.55"]
["Paul Blackburn","Oak - SP","1312","27.2","2","0","19","7.16","1.41"]
["Adam Plutko","Cle - SP,RP","1313","76.2","4","1","60","5.28","1.32"]
[]
["Josh Rogers","Bal - SP","1339","11.2","1","0","6","8.49","1.89"]
["Luis Cessa","NYY - SP,RP","1352","44.2","1","2","39","5.24","1.43"]
[]
["Erasmo Ramírez","Bos - SP","1369","45.2","2","0","33","6.50","1.40"]
[]
["Travis Wood","Det - SP,RP","1374","-","-","-","-","-","-"]
["Doug Fister","Tex - SP","1376","66.0","1","0","40","4.50","1.39"]
["Jorge López","KC - SP,RP","1378","53.2","2","0","38","5.03","1.47"]
["Jimmy Yacabonis","Bal - SP,RP","1381","40.0","0","0","33","5.40","1.45"]
["Wilmer Font","TB - SP,RP","1388","44.0","2","0","36","5.93","1.41"]
["Eric Skoglund","KC - SP","1391","70.0","1","0","49","5.14","1.21"]
["Ryan Carpenter","Det - SP","1392","22.1","1","0","15","7.25","1.70"]
["Tommy Milone","Sea - SP","1395","26.1","1","0","23","5.81","1.44"]
["Daniel Gossett","Oak - SP","1406","24.1","0","0","12","5.18","1.36"]
["Jefry Rodriguez","Cle - SP,RP","1411","52.0","3","0","39","5.71","1.54"]
["Glenn Sparkman","KC - SP,RP","1412","38.1","0","0","27","4.46","1.62"]
["Stephen Gonsalves","Min - SP","1423","24.2","2","0","16","6.57","2.03"]
["Ben Lively","KC - SP,RP","1429","30.1","0","0","27","5.64","1.85"]
["Ariel Jurado","Tex - SP","1430","54.2","5","0","22","5.93","1.54"]
["David Hess","Bal - SP","1431","103.1","3","0","74","4.88","1.38"]
[]
["Shelby Miller","Tex - SP","1449","16.0","0","0","19","10.69","2.00"]
["Danny Duffy","KC - SP","1450","155.0","8","0","141","4.88","1.49"]
["Dillon Peters","LAA - SP","1451","27.2","2","0","17","7.16","1.77"]
["Ian Kennedy","KC - SP","1455","119.2","3","0","105","4.66","1.38"]
["Daniel Norris","Det - SP","1459","44.1","0","0","51","5.68","1.47"]
["Alex Cobb","Bal - SP","1471","152.1","5","0","102","4.90","1.41"]
[]
["Carson Fulmer","CWS - SP","1486","32.1","2","0","29","8.07","1.89"]
["Yefry Ramírez","Bal - SP,RP","1498","65.1","1","0","62","5.92","1.53"]
["Andrew Kittredge","TB - SP,RP","1500","38.1","3","0","30","7.75","1.85"]
["Miguel González","CWS - SP","1501","12.1","0","0","5","12.41","2.43"]
["Drew Hutchison","NYY - SP,RP","1502","42.2","2","0","31","6.75","1.78"]
[]
["Félix Hernández","Sea - SP","1518","155.2","8","0","125","5.55","1.40"]
["Sam Gaviglio","Tor - SP","1531","123.2","3","0","105","5.31","1.44"]
[]
[]
["Clayton Richard","Tor - SP","1557","158.2","7","0","108","5.33","1.38"]
["Dylan Covey","CWS - SP,RP","1568","121.2","5","0","91","5.18","1.49"]
["Yovani Gallardo","Tex - SP","1594","94.1","8","0","58","6.39","1.63"]
[]
["Andrew Cashner","Bal - SP","1603","153.0","4","0","99","5.29","1.58"]
["Bartolo Colon","Tex - SP","1604","146.1","7","0","81","5.78","1.35"]
["Chris Tillman","Tex - SP","1635","26.2","1","0","13","10.46","2.21"]
["Martín Pérez","Min - SP,RP","1658","85.1","2","0","52","6.22","1.78"]
["Homer Bailey","KC - SP","1717","106.1","1","0","75","6.09","1.64"]
["Jason Hammel","Tex - SP,RP","1727","127.0","4","0","92","6.02","1.63"]
["Matt Moore","Det - SP,RP","1748","102.0","3","0","86","6.79","1.66"]

{"sheet":"Relief Pitchers","index":11,"n_rows":327,"n_cols":9,"rows_kept":327}
["Player","Team","Rank","IP","W","S","K","ERA","WHIP"]
{"$rows_empty":21}
["Ryan Tepera","Tor - RP","374","64.2","5","7","68","3.62","1.22"]
["Will Harris","Hou - RP","379","56.2","5","0","64","3.49","1.09"]
[]
[]
["Tyler Clippard","Cle - RP","391","68.2","4","7","85","3.67","1.17"]
["Joe Smith","Hou - RP","393","45.2","5","0","46","3.74","1.01"]
["Héctor Rondón","Hou - RP","394","59.0","2","15","67","3.20","1.32"]
["Oliver Pérez","Cle - RP","395","32.1","1","0","43","1.39","0.74"]
[]
["Chris Devenski","Hou - RP","405","47.1","2","2","51","4.18","1.16"]
[]
["Taylor Cole","LAA - RP","409","36.0","4","0","39","2.75","0.89"]
["Shawn Kelley","Tex - RP","410","49.0","2","0","50","2.94","0.90"]
["Daniel Mengden","Oak - SP,RP","414","115.2","7","0","72","4.05","1.12"]
["Tony Sipp","Hou - RP","416","38.2","3","0","42","1.86","1.03"]
[]
["Brandon Workman","Bos - RP","422","41.1","6","0","37","3.27","1.21"]
["Adam Warren","Sea - RP","425","51.2","3","0","52","3.14","1.32"]
["Richard Bleier","Bal - RP","430","32.2","3","0","15","1.93","1.22"]
[]
["Jonathan Holder","NYY - RP","438","66.0","1","0","60","3.14","1.09"]
["Chaz Roe","TB - RP","444","50.1","1","1","53","3.58","1.01"]
["Noé Ramírez","LAA - RP","450","83.1","7","1","95","4.54","1.26"]
["Alex Wilson","Cle - RP","451","61.2","2","0","43","3.36","1.05"]
["Kevin McCarthy","KC - RP","454","72.0","5","0","46","3.25","1.25"]
["Keynan Middleton","LAA - RP","455","17.2","0","6","16","2.04","1.30"]
["Roenis Elías","Sea - SP,RP","456","51.0","3","0","34","2.65","1.22"]
["Emilio Pagán","TB - RP","459","62.0","3","0","63","4.35","1.19"]
["J.B. Wendelken","Oak - RP","465","16.2","0","0","14","0.54","0.78"]
["Blaine Hardy","Det - SP,RP","469","86.0","4","1","66","3.56","1.17"]
["Jace Fry","CWS - RP","470","51.1","2","4","70","4.38","1.11"]
["Cam Bedrosian","LAA - RP","472","64.0","5","1","57","3.80","1.39"]
["Nate Jones","CWS - RP","473","30.0","2","5","32","3.00","1.43"]
["Dan Altavilla","Sea - RP","474","20.2","3","0","23","2.61","1.26"]
["Sam Tuivailala","Sea - RP","477","37.0","4","0","30","3.41","1.43"]
["Jim Johnson","LAA - RP","478","63.1","5","2","45","3.84","1.36"]
[]
["Adam Cimber","Cle - RP","483","68.1","3","0","58","3.42","1.24"]
["Chasen Bradford","Sea - RP","484","53.2","5","0","38","3.69","1.29"]
[]
["Hector Velázquez","Bos - SP,RP","491","85.0","7","0","53","3.18","1.45"]
["Steven Wright","Bos - SP,RP","494","53.2","3","1","42","2.68","1.25"]
["Joe Jiménez","Det - RP","495","62.2","5","3","78","4.31","1.20"]
["Victor Alcántara","Det - RP","496","30.0","1","0","21","2.40","1.03"]
["Dan Jennings","LAA - RP","499","64.1","4","1","45","3.22","1.38"]
["Juan Minaya","CWS - RP","507","46.2","2","1","58","3.28","1.46"]
["Heath Hembree","Bos - RP","508","60.0","4","0","76","4.20","1.33"]
["Louis Coleman","Det - RP","510","51.1","4","0","41","3.51","1.31"]
["Nick Wittgren","Cle - RP","515","33.2","2","0","31","2.94","1.31"]
["Bobby Poyner","Bos - RP","521","22.1","1","0","24","3.22","1.12"]
["Thomas Pannone","Tor - SP,RP","523","43.0","4","0","29","4.19","1.21"]
["Paul Fry","Bal - RP","525","37.2","1","2","36","3.35","1.27"]
["Ty Buttrey","LAA - RP","528","16.1","0","4","20","3.31","1.22"]
["Daniel Hudson","LAA - RP","529","46.0","3","0","44","4.11","1.22"]
["Hansel Robles","LAA - RP","531","56.0","2","2","59","3.70","1.39"]
["Chih-Wei Hu","Cle - RP","537","13.0","0","0","12","4.15","0.77"]
["Tony Zych","Sea - RP","538","-","-","-","-","-","-"]
["Tim Mayza","Tor - RP","539","35.2","2","0","40","3.28","1.32"]
["Tyler Olson","Cle - RP","540","27.1","2","0","40","4.94","1.39"]
["Jerry Blevins","Oak - RP","541","42.2","3","1","41","4.85","1.36"]
["Danny Farquhar","NYY - RP","548","8.0","1","0","9","5.63","0.75"]
["Anthony Swarzak","Sea - RP","565","26.1","0","4","31","6.15","1.59"]
["Justin Anderson","LAA - RP","568","55.1","3","4","67","4.07","1.48"]
["Randall Delgado","CWS - RP","571","11.1","2","0","5","4.76","1.50"]
["David Phelps","Tor - SP,RP","573","-","-","-","-","-","-"]
["Alex Meyer","LAA - SP,RP","575","-","-","-","-","-","-"]
["Austin Maddox","Bos - RP","577","-","-","-","-","-","-"]
["David Paulino","Tor - RP","579","6.2","1","0","6","1.35","1.20"]
["Scott Barlow","KC - RP","580","15.0","1","0","15","3.60","1.27"]
["Rob Whalen","Sea - RP","583","4.0","0","0","0","0.00","0.50"]
["Carson Smith","Bos - RP","584","14.1","1","0","18","3.77","1.40"]
["Ian Hamilton","CWS - RP","586","8.0","1","0","5","4.50","1.00"]
["Drew VerHagen","Det - RP","588","56.1","3","0","53","4.63","1.15"]
["Marcus Walden","Bos - RP","590","14.2","0","1","14","3.68","1.16"]
["Zach Putnam","CWS - RP","592","-","-","-","-","-","-"]
["Ben Heller","NYY - RP","594","-","-","-","-","-","-"]
["Jon Edwards","Cle - RP","599","8.2","0","0","10","3.12","1.15"]
["Dustin McGowan","TB - SP,RP","600","-","-","-","-","-","-"]
["Al Alburquerque","Tor - RP","604","-","-","-","-","-","-"]
["Sean Gilmartin","Bal - RP","605","27.0","1","0","15","3.00","1.26"]
["Ryan Merritt","TB - RP","606","-","-","-","-","-","-"]
["Zac Rosscup","Sea - RP","607","11.1","0","0","20","4.76","1.15"]
["Stephen Tarpley","NYY - RP","610","9.0","0","0","13","3.00","1.33"]
["Addison Reed","Min - RP","612","56.0","1","0","44","4.50","1.43"]
["Aaron Brooks","Oak - RP","615","2.2","0","0","1","0.00","1.13"]
["Andrew Vasquez","Min - RP","619","5.0","1","0","7","5.40","1.40"]
["Gabriel Moya","Min - SP,RP","620","36.1","3","0","31","4.71","1.32"]
["Cionel Pérez","Hou - RP","622","11.1","0","0","12","3.97","1.15"]
["Adam Kolarek","TB - RP","623","34.1","1","2","19","3.93","1.25"]
["Matt Magill","Min - RP","624","56.2","3","0","56","3.81","1.43"]
["Matt Dermody","Tor - RP","627","-","-","-","-","-","-"]
["Ryan Dull","Oak - RP","631","25.1","0","0","21","4.26","1.14"]
["Tommy Kahnle","NYY - RP","632","23.1","2","1","30","6.56","1.63"]
["Simon Castro","Oak - RP","633","-","-","-","-","-","-"]
["Leonel Campos","Cle - RP","634","-","-","-","-","-","-"]
["Jeffrey Springs","Tex - RP","636","32.0","1","0","31","3.38","1.44"]
["Gabriel Ynoa","Bal - RP","637","-","-","-","-","-","-"]
["Trevor Hildenberger","Min - RP","643","73.0","4","7","70","5.42","1.38"]
["Rhiner Cruz","Tor - RP","648","3.1","0","0","4","2.70","1.50"]
["Eduardo Jimenez","Det - RP","655","-","-","-","-","-","-"]
["Vicente Campos","LAA - RP","656","-","-","-","-","-","-"]
["Branden Kline","Bal - RP","657","-","-","-","-","-","-"]
["Wyatt Mills","Sea - RP","673","-","-","-","-","-","-"]
["Zack Burdi","CWS - RP","679","-","-","-","-","-","-"]
["Shawn Morimando","Cle - RP","690","-","-","-","-","-","-"]
["Shawn Tolleson","Tex - RP","698","-","-","-","-","-","-"]
["Joe Palumbo","Tex - RP","703","-","-","-","-","-","-"]
["Brady Rodgers","Hou - RP","708","-","-","-","-","-","-"]
["Joey Gerber","Sea - RP","709","-","-","-","-","-","-"]
["Denyi Reyes","Bos - RP","725","-","-","-","-","-","-"]
["Reed Garrett","Det - RP","740","-","-","-","-","-","-"]
["Bryan Garcia","Det - RP","743","-","-","-","-","-","-"]
["Jean Carlos Mejía","Cle - RP","747","-","-","-","-","-","-"]
["Brandon Brennan","Sea - RP","754","-","-","-","-","-","-"]
["Chris Lee","Bal - RP","766","-","-","-","-","-","-"]
["Jacob Waguespack","Tor - RP","792","-","-","-","-","-","-"]
["Colin Poche","TB - RP","794","-","-","-","-","-","-"]
["Tyler Jay","Min - RP","811","-","-","-","-","-","-"]
["Bryan Abreu","Hou - RP","813","-","-","-","-","-","-"]
["Josh Taylor","Bos - RP","824","-","-","-","-","-","-"]
["Art Warren","Sea - RP","854","-","-","-","-","-","-"]
["Ryne Harper","Min - RP","861","-","-","-","-","-","-"]
["Joe Harvey","NYY - RP","865","-","-","-","-","-","-"]
["Ian Gibaut","TB - RP","876","-","-","-","-","-","-"]
["Zack Weiss","Min - RP","880","0.0","0","0","0","-","-"]
["Bo Schultz","Bal - RP","888","-","-","-","-","-","-"]
["Alex Faedo","Det - RP","889","-","-","-","-","-","-"]
["Chandler Shepherd","Bos - RP","898","-","-","-","-","-","-"]
["José Mujica","TB - RP","901","-","-","-","-","-","-"]
["Kyle Bird","Tex - RP","914","-","-","-","-","-","-"]
["Tyler Johnson","CWS - RP","922","-","-","-","-","-","-"]
["Wei-Chieh Huang","Tex - RP","923","-","-","-","-","-","-"]
["Hunter Harvey","Bal - RP","934","-","-","-","-","-","-"]
["Kevin Chapman","Min - RP","968","-","-","-","-","-","-"]
["Durbin Feltman","Bos - RP","988","-","-","-","-","-","-"]
["Anthony Gose","Tex - RP","999","-","-","-","-","-","-"]
["Héctor Pérez","Tor - RP","1000","-","-","-","-","-","-"]
["Stiward Aquino","LAA - RP","1007","-","-","-","-","-","-"]
["Ryan O'Rourke","Bal - RP","1009","-","-","-","-","-","-"]
["Alex Scherff","Bos - RP","1011","-","-","-","-","-","-"]
["R.J. Alaniz","Sea - RP","1013","-","-","-","-","-","-"]
["Domingo Acevedo","NYY - RP","1017","-","-","-","-","-","-"]
["Jacob Lindgren","CWS - RP","1023","-","-","-","-","-","-"]
["Brett Oberholtzer","Tor - SP,RP","1035","-","-","-","-","-","-"]
["Austin Adams","LAA - RP","1037","-","-","-","-","-","-"]
["Dario Alvarez","Sea - RP","1038","-","-","-","-","-","-"]
["Blake Wood","LAA - RP","1039","11.2","1","0","10","2.31","1.29"]
["Ryan Garton","Sea - RP","1040","-","-","-","-","-","-"]
["Ashur Tolliver","Sea - RP","1043","-","-","-","-","-","-"]
["James Hoyt","Cle - RP","1044","0.1","0","0","0","0.00","6.00"]
["Ronald Herrera","Tex - RP","1046","-","-","-","-","-","-"]
["TJ House","CWS - SP,RP","1049","-","-","-","-","-","-"]
["Osmer Morales","LAA - RP","1050","0.1","0","0","0","0.00","3.00"]
["Rex Brothers","NYY - RP","1052","0.0","0","0","0","-","-"]
["Jack Leathersich","Cle - RP","1055","-","-","-","-","-","-"]
["Seth Maness","KC - RP","1058","-","-","-","-","-","-"]
["Chris Martin","Tex - RP","1059","41.2","1","0","37","4.54","1.22"]
["Connor Sadzeck","Tex - RP","1061","9.1","0","0","7","0.96","1.82"]
["Liam Hendriks","Oak - SP,RP","1065","24.0","0","0","22","4.13","1.46"]
["Jairo Labourt","CWS - RP","1066","-","-","-","-","-","-"]
["Jake Newberry","KC - RP","1083","13.1","2","0","11","4.73","1.65"]
["Preston Claiborne","Cle - RP","1084","-","-","-","-","-","-"]
["Josh Edgin","Bal - RP","1085","-","-","-","-","-","-"]
["Francis Martes","Hou - RP","1088","-","-","-","-","-","-"]
["Dean Deetz","Hou - RP","1089","3.1","0","0","3","5.40","1.50"]
["Danny Coulombe","NYY - RP","1094","23.2","1","0","26","4.56","1.48"]
["Max Povse","Sea - RP","1095","-","-","-","-","-","-"]
["José Ruiz","CWS - RP","1097","4.1","0","0","6","4.15","1.85"]
["Ryan Weber","Bos - RP","1098","5.1","0","0","1","5.06","1.31"]
["Tim Hill","KC - RP","1099","45.2","1","2","42","4.53","1.31"]
["Reymin Guduan","Hou - RP","1103","3.1","0","0","4","2.70","0.30"]
["Jayson Aquino","Bal - RP","1104","-","-","-","-","-","-"]
["Caleb Frare","CWS - RP","1106","7.0","0","0","9","5.14","1.43"]
["Andrew Moore","TB - RP","1110","-","-","-","-","-","-"]
["Robbie Ross Jr.","CWS - RP","1112","-","-","-","-","-","-"]
["Taylor Guerrieri","Tex - RP","1113","9.2","0","0","8","4.66","1.34"]
["Dayan Díaz","LAA - RP","1117","-","-","-","-","-","-"]
["Jake Jewell","LAA - RP","1119","2.0","0","0","1","9.00","1.50"]
["Hunter Wood","TB - SP,RP","1125","41.0","1","0","42","3.73","1.46"]
[]
["Luke Bard","LAA - RP","1130","11.2","0","0","13","5.40","1.29"]
["Ben Taylor","Cle - RP","1132","6.0","0","0","8","6.00","1.17"]
["Nick Gardewine","Tex - RP","1133","5.0","0","0","4","3.60","1.40"]
["Justin Shafer","Tor - RP","1136","8.1","0","0","2","3.24","1.56"]
["Evan Scribner","TB - RP","1137","-","-","-","-","-","-"]
["Brandon Cumpton","Tor - RP","1139","1.2","0","0","2","5.40","3.00"]
["Nick Goody","Cle - RP","1140","11.2","0","0","12","6.94","1.71"]
["Ryan Sherriff","TB - RP","1143","5.2","0","0","3","6.35","1.76"]
[]
["Tyler Danish","Sea - RP","1149","6.1","1","0","5","7.11","1.89"]
["Jeff Ferrell","Bal - RP","1151","-","-","-","-","-","-"]
["Dan Otero","Cle - RP","1158","58.2","2","1","43","5.22","1.26"]
["Luke Farrell","Tex - RP","1160","31.1","3","0","39","5.17","1.47"]
["Ross Detwiler","Sea - RP","1162","6.0","0","0","2","4.50","1.67"]
["Michael Ynoa","CWS - RP","1174","-","-","-","-","-","-"]
["Andres Machado","KC - RP","1178","-","-","-","-","-","-"]
["Murphy Smith","Tor - RP","1179","3.1","0","0","0","8.10","1.80"]
["Asher Wojciechowski","Cle - SP,RP","1182","-","-","-","-","-","-"]
[]
["Brad Goldberg","CWS - RP","1191","-","-","-","-","-","-"]
["José Fernández","Det - RP","1197","10.1","0","0","6","6.10","1.35"]
["Jake Buchanan","Oak - RP","1199","-","-","-","-","-","-"]
["Alexi Ogando","Cle - RP","1200","1.0","0","0","1","18.00","5.00"]
["David Holmberg","Bal - SP,RP","1203","-","-","-","-","-","-"]
["Ricardo Rodríguez","Tex - RP","1205","6.2","0","0","3","4.05","1.80"]
["Luis García","LAA - RP","1207","46.0","3","1","51","6.07","1.46"]
["Kyle Crockett","Oak - RP","1208","9.1","1","0","11","5.79","1.93"]
["Sandy Baez","Det - RP","1209","14.1","0","0","10","5.02","1.47"]
["David Hale","NYY - RP","1210","13.2","0","0","8","4.61","1.54"]
["Adam Wilk","Cle - SP,RP","1211","-","-","-","-","-","-"]
["Myles Jaye","Min - RP","1214","-","-","-","-","-","-"]
["John Curtiss","LAA - RP","1217","6.1","0","0","7","5.68","1.89"]
[]
["John Means","Bal - RP","1222","3.1","0","0","4","13.50","1.80"]
["Gregory Infante","Bal - RP","1226","9.0","1","0","6","8.00","2.22"]
["Hoby Milner","TB - RP","1228","7.1","0","0","8","7.36","1.91"]
["Austin Pruitt","TB - RP","1229","69.2","2","4","42","4.65","1.26"]
["Mike Morin","Min - RP","1233","4.0","0","0","6","6.75","1.75"]
["Tim Collins","Min - RP","1235","22.2","0","0","21","4.37","1.54"]
["Ricardo Pinto","TB - RP","1239","-","-","-","-","-","-"]
["Tyler Thornburg","Bos - RP","1247","24.0","2","0","21","5.63","1.58"]
["Colten Brewer","Bos - RP","1249","9.2","1","0","10","5.59","2.28"]
["Jake Diekman","KC - RP","1252","53.1","1","2","66","4.73","1.50"]
["Nick Rumbelow","Sea - RP","1257","17.2","0","0","16","6.11","1.42"]
["Jake Faria","TB - SP,RP","1259","65.0","4","0","50","5.40","1.43"]
["Lisalverto Bonilla","Cle - RP","1260","-","-","-","-","-","-"]
["Casey Sadler","TB - RP","1263","4.1","0","0","3","8.31","2.77"]
["Neil Ramírez","Cle - RP","1264","41.2","0","0","51","4.54","1.30"]
["Tyler Duffey","Min - RP","1265","25.0","2","0","19","7.20","1.20"]
["Aaron Bummer","CWS - RP","1271","31.2","0","0","35","4.26","1.58"]
["C.D. Pelham","Tex - RP","1272","7.2","0","0","7","7.04","2.09"]
["Dean Kiekhefer","Oak - RP","1273","2.0","0","0","1","18.00","4.00"]
["Chris Rowley","Tex - RP","1276","0.2","0","0","0","40.50","4.50"]
["Brian Ellington","Bos - RP","1279","-","-","-","-","-","-"]
["Brian Johnson","Bos - SP,RP","1281","99.1","4","0","87","4.17","1.43"]
["John Axford","Tor - RP","1282","54.2","4","0","54","5.27","1.35"]
["Zac Curtis","Tex - RP","1284","16.1","0","0","18","4.96","1.90"]
["Williams Jerez","LAA - RP","1287","15.0","0","0","15","6.00","1.67"]
["D.J. Snelten","Bal - RP","1288","4.1","0","0","4","10.38","2.77"]
["Nestor Cortes Jr.","NYY - RP","1291","4.2","0","0","3","7.71","3.00"]
["Tanner Anderson","Oak - RP","1293","11.1","1","0","6","6.35","2.03"]
["Chris Hatcher","Oak - RP","1294","36.1","3","0","30","4.95","1.65"]
["Jeanmar Gómez","Tex - RP","1299","25.0","0","0","27","4.68","1.56"]
["Jalen Beeks","TB - RP","1304","50.2","5","0","42","5.51","1.50"]
["Ryan Burr","CWS - RP","1307","9.2","0","0","6","7.45","1.86"]
["Miguel Almonte","LAA - RP","1310","7.0","0","0","7","10.29","1.71"]
["Josh Lucas","Bal - RP","1311","14.1","0","0","14","6.28","1.74"]
["Adam Plutko","Cle - SP,RP","1313","76.2","4","1","60","5.28","1.32"]
["Kevin Jepsen","Tex - RP","1314","16.2","0","0","8","5.94","1.56"]
["Thyago Vieira","CWS - RP","1316","17.2","1","1","15","7.13","1.70"]
["Akeel Morris","LAA - RP","1324","14.0","0","0","7","5.79","1.86"]
["Jeff Beliveau","Cle - RP","1326","4.2","0","1","2","11.57","2.57"]
["Miguel Castro","Bal - RP","1327","86.1","2","0","57","3.96","1.45"]
["Danny Barnes","Tor - RP","1329","41.0","3","0","38","5.71","1.68"]
["Gerson Bautista","Sea - RP","1333","4.1","0","0","3","12.46","3.00"]
["Jhan Maríñez","Bal - RP","1334","8.0","0","0","3","5.63","2.25"]
["Tanner Scott","Bal - RP","1337","53.1","3","0","76","5.40","1.56"]
["Evan Marshall","CWS - RP","1338","7.0","0","0","9","7.71","2.29"]
["Javy Guerra","Tor - RP","1340","35.2","1","1","30","5.55","1.51"]
["Jason Adam","KC - RP","1341","32.1","0","0","37","6.12","1.39"]
["Rafael Montero","Tex - RP","1347","-","-","-","-","-","-"]
["Daniel Stumpf","Det - RP","1349","38.1","1","0","37","4.93","1.57"]
["Luis Santos","TB - RP","1350","20.0","1","0","24","7.20","1.80"]
["Luis Cessa","NYY - SP,RP","1352","44.2","1","2","39","5.24","1.43"]
["Oliver Drake","TB - RP","1361","47.2","1","0","51","5.29","1.45"]
["Zach McAllister","Tex - RP","1370","45.0","1","0","39","6.20","1.49"]
["A.J. Cole","Cle - RP","1371","48.1","4","0","59","6.14","1.59"]
["Eduardo Paredes","Det - RP","1372","18.1","0","0","15","6.87","1.75"]
[]
["Travis Wood","Det - SP,RP","1374","-","-","-","-","-","-"]
["Jorge López","KC - SP,RP","1378","53.2","2","0","38","5.03","1.47"]
["Zack Littell","Min - RP","1379","20.1","0","0","14","6.20","1.77"]
["Johnny Barbato","Det - RP","1380","6.2","0","0","2","12.15","2.40"]
["Jimmy Yacabonis","Bal - SP,RP","1381","40.0","0","0","33","5.40","1.45"]
["Buck Farmer","Det - RP","1386","69.1","3","0","57","4.15","1.56"]
["Brooks Pounders","Cle - RP","1387","15.1","0","0","17","7.63","1.76"]
["Wilmer Font","TB - SP,RP","1388","44.0","2","0","36","5.93","1.41"]
["Preston Guilmet","Min - RP","1407","10.0","0","0","8","11.70","2.20"]
["Brian Flynn","KC - RP","1408","75.2","3","1","47","4.04","1.61"]
["Jefry Rodriguez","Cle - SP,RP","1411","52.0","3","0","39","5.71","1.54"]
["Glenn Sparkman","KC - SP,RP","1412","38.1","0","0","27","4.46","1.62"]
["Zac Reininger","Det - RP","1413","21.1","1","0","18","7.59","1.73"]
["Donnie Hart","Bal - RP","1418","19.1","0","0","13","5.59","2.22"]
["Pedro Araujo","Bal - RP","1427","28.0","1","0","29","7.71","1.68"]
["Ben Lively","KC - SP,RP","1429","30.1","0","0","27","5.64","1.85"]
["Josh Osich","Bal - RP","1432","12.0","0","0","10","8.25","2.25"]
["Tyler Cloyd","TB - RP","1434","17.2","0","0","13","8.66","1.98"]
["Matt Hall","Det - RP","1436","8.0","0","0","5","14.63","2.75"]
["Cody Carroll","Bal - RP","1437","17.0","0","0","16","9.00","2.00"]
["Evan Phillips","Bal - RP","1439","11.2","0","0","8","13.11","1.97"]
["Justin Grimm","Cle - RP","1468","17.1","1","0","11","10.38","1.90"]
["Matt Belisle","Min - RP","1476","34.1","1","0","25","7.86","1.75"]
["Mark Leiter Jr.","Tor - RP","1483","23.1","0","0","22","7.71","2.01"]
["Chris Volstad","CWS - RP","1497","47.1","1","0","29","6.27","1.63"]
["Yefry Ramírez","Bal - SP,RP","1498","65.1","1","0","62","5.92","1.53"]
["Andrew Kittredge","TB - SP,RP","1500","38.1","3","0","30","7.75","1.85"]
["Drew Hutchison","NYY - SP,RP","1502","42.2","2","0","31","6.75","1.78"]
["Bruce Rondón","CWS - RP","1521","29.2","2","1","40","8.49","2.16"]
["Mike Wright","Bal - RP","1522","84.1","4","0","74","5.55","1.62"]
["Blaine Boyer","KC - RP","1528","21.2","2","1","9","12.05","2.08"]
[]
["Dylan Covey","CWS - SP,RP","1568","121.2","5","0","91","5.18","1.49"]
["Martín Pérez","Min - SP,RP","1658","85.1","2","0","52","6.22","1.78"]
["Jason Hammel","Tex - SP,RP","1727","127.0","4","0","92","6.02","1.63"]
["Matt Moore","Det - SP,RP","1748","102.0","3","0","86","6.79","1.66"]

{"sheet":"Data","index":12,"n_rows":50,"n_cols":11,"rows_kept":50}
["Owners","Position"]
["Lightning (Mike Goodman)","Catcher"]
["Evolution (Bruce)","1st Base"]
["The Mad Batters (Colin)","2nd Base"]
["Woap (Mike)","3rd Base"]
["The Dominant Brand (Brandon)","Short Stop"]
["Guzzlers (Rhonda)","Outfield #1"]
["Moneyballers (Rob)","Outfield #2"]
["Booya's (Cathy)","Outfield #3"]
["Freebirds (Todd)","DH"]
["Numbats (Tom)","Starting Pitcher #1"]
["Josh Gone-aldson (Dave)","Starting Pitcher #2"]
[null,"Starting Pitcher #3"]
[null,"Starting Pitcher #4"]
[null,"Starting Pitcher #5"]
[null,"Relief Pitcher #1"]
[null,"Relief Pitcher #2"]
[null,"Relief Pitcher #3"]
[null,"Relief Pitcher #4"]
[null,"Reserve Roster #1"]
[null,"Reserve Roster #2"]
[null,"Reserve Roster #3"]
[null,"Reserve Roster #4"]
[null,"Reserve Roster #5"]
[null,"Reserve Roster #6"]
[null,"Reserve Roster #7"]
[]
["Make sure every year to select all the players for each position and recreate the bookmark name (delete name first, then recreate name) to ensure all players get listed.",null,"catchers","first","second","third","ss","outfield","dh","pitchers","relief"]
["Ensure that all players are listed when clicking on the button."]
[]
[null,"Change Draft Order Yearly"]
[]
["The Dominant Brand (Brandon)",1]
["Moneyballers (Rob)",2]
["Freebirds (Todd)",3]
["The Mad Batters (Colin)",4]
["Evolution (Bruce)",5]
["Josh Gone-aldson (Dave)",6]
["Woap (Mike)",7]
["Booya's (Cathy)",8]
["Numbats (Tom)",9]
["Guzzlers (Rhonda)",10]
["Lightning (Mike Goodman)",11]
[]
[]
[]
["Formulas to Retreive Name and Position"]
["=RIGHT(A1,LEN(A1)+ 5-FIND(\"-\",A1))","Position"]
["=LEFT(A1,FIND(\"-\",A1) -5)","Name"]
["=Trim(cell)","Trim the positions for extra space"]