{"text_format":"3","workbook":"xlsx","n_sheets":13,"sheets":["2018 Pre-Draft Rosters","Draft List","Summary","Catchers","1st Base","2nd Base","3rd Base","Short Stop","Outfield","DH","Pitchers","Relief Pitchers","Data"],"not_rendered":{"macros":1,"defined_names":49},"read":"whole","date_system":"1900"}

{"sheet":"2018 Pre-Draft Rosters","index":0,"n_rows":34,"n_cols":45,"rows_kept":34,"merged":[[0,1,0,4],[0,5,0,8],[0,9,0,12],[0,13,0,16],[0,17,0,20],[0,21,0,24],[0,25,0,28],[0,29,0,32],[0,33,0,36],[0,37,0,39],[0,41,0,43],[22,1,22,2],[22,5,22,6],[22,9,22,10],[22,13,22,14],[22,17,22,18],[22,21,22,22],[22,25,22,26],[22,29,22,30],[22,33,22,34],[22,37,22,38],[22,41,22,42],[23,1,23,2],[23,5,23,6],[23,9,23,10],[23,13,23,14],[23,17,23,18],[23,21,23,22],[23,25,23,26],[23,29,23,30],[23,33,23,34],[23,37,23,38],[23,41,23,42],[24,1,24,2],[24,5,24,6],[24,9,24,10],[24,13,24,14],[24,17,24,18],[24,21,24,22],[25,1,25,2],[25,5,25,6],[25,9,25,10],[25,13,25,14],[25,17,25,18],[25,21,25,22],[25,26,25,27],[25,30,25,31],[25,34,25,35],[25,38,25,39],[25,42,25,43]]}
[null,"Lightning (Mike Goodman)",{"$nulls":3},"Evolution (Bruce)",{"$nulls":3},"Miggy Pop (Colin)",{"$nulls":3},"Woap (Mike)",{"$nulls":3},"The Dominant Brand (Brandon)",{"$nulls":3},"Guzzlers (Rhonda)",{"$nulls":3},"Moneyballers (Rob)",{"$nulls":3}," Booya's (Cathy)",{"$nulls":3},"Freebirds (Todd)",{"$nulls":3},"Numbats (Tom)",{"$nulls":3},"TheDunnShow (Dave)"]
[null,"Pos.","Player","$","years","Pos.","Player","$","years","Pos.","Player","$","years","Pos.","Player","$","years","Pos.","Player","$","years","Pos.","Player","$","years","Pos.","Player","$","years","Pos.","Player","$","years","Pos.","Player","$","years","Pos.","Player","$","years","Pos.","Player","$","years"]
[{"$f":"11-COUNT(D3,H3,L3,P3,T3,X3,AB3,AF3,AJ3,AN3,AR3)","v":7},"C","Gary Sánchez\nNYY - C",15,2,"C","Mike Zunino\nSea - C",6,2,"C",{"$nulls":3},"C",{"$nulls":3},"C","Brian McCann\nHou - C",11,1,"C",{"$nulls":3},"C","Welington Castillo\nCWS - C",6,1,"C",{"$nulls":3},"C",{"$nulls":3},"C",{"$nulls":3},"C"]
[6,"1B",{"$nulls":3},"1B",{"$nulls":3},"1B","Yuli Gurriel\nHou - 1B",10,2,"1B",{"$nulls":3},"1B",{"$nulls":3},"1B",{"$nulls":3},"1B","José Abreu\nCWS - 1B",37,1,"1B",{"$nulls":3},"1B","Yonder Alonso\nCle - 1B",5,1,"1B","Greg Bird\nNYY - 1B",5,1,"1B","Justin Smoak\nTor - 1B",5,1]
[{"$f":"11-COUNT(D5,H5,L5,P5,T5,X5,AB5,AF5,AJ5,AN5,AR5)","v":3},"2B","Jose Altuve\nHou - 2B",51,1,"2B","Rougned Odor\nTex - 2B",15,1,"2B","Jonathan Schoop\nBal - 2B",17,2,"2B","Robinson Canó\nSea - 2B",26,1,"2B",{"$nulls":3},"2B","Brian Dozier\nMin - 2B",8,1,"2B",{"$nulls":3},"2B","José Ramírez\nCle - 2B,3B",15,2,"2B","Marwin González\nHou - 1B,2B,3B,SS,OF",5,1,"2B","Yoán Moncada\nCWS - 2B",11,2,"2B"]
[4,"3B","Ryon Healy\nSea - 1B,3B",5,1,"3B","Joey Gallo\nTex - 1B,3B,OF",10,2,"3B","Miguel Sanó\nMin - 1B,3B",15,1,"3B","Mike Moustakas\nKC - 3B",17,1,"3B","Nicholas Castellanos\nDet - 3B,OF",23,1,"3B",{"$nulls":3},"3B",{"$nulls":3},"3B",{"$nulls":3},"3B","Matt Davidson\nCWS - 1B,3B",5,1,"3B","Alex Bregman\nHou - 3B,SS",15,3,"3B"]
[{"$f":"11-COUNT(D7,H7,L7,P7,T7,X7,AB7,AF7,AJ7,#REF!,AR7)","v":4},"SS","Francisco Lindor\nCle - SS",15,1,"SS","Tim Anderson\nCWS - SS",10,1,"SS","Marcus Semien\nOak - SS",5,1,"SS",{"$nulls":3},"SS","Xander Bogaerts\nBos - SS",35,1,"SS","Tim Beckham\nBal - 2B,SS",5,1,"SS",{"$nulls":3},"SS","Didi Gregorius\nNYY - SS",6,2,"SS",{"$nulls":3},"SS",{"$nulls":3},"SS","Carlos Correa\nHou - SS",15,1]
[{"$f":"11-COUNT(D8,H8,L8,P8,T8,X8,AB8,AF8,AJ8,AN8,AR8)","v":4},"OF#1","Justin Upton\nLAA - OF",42,1,"OF#1",{"$nulls":3},"OF#1","Eduardo Núñez\nBos - 2B,3B,SS,OF",5,1,"OF#1","Mike Trout\nLAA - OF",63,1,"OF#1",{"$nulls":3},"OF#1","Mookie Betts\nBos - OF",15,1,"OF#1",{"$nulls":3},"OF#1","Brett Gardner\nNYY - OF",1,1,"OF#1",{"$nulls":3},"OF#1","Nomar Mazara\nTex - OF",10,1,"OF#1","Aaron Judge\nNYY - OF",15,3]
[5,"OF#2","Josh Reddick\nHou - OF",1,1,"OF#2",{"$nulls":3},"OF#2","Mark Trumbo\nBal - OF",10,1,"OF#2","Kevin Kiermaier\nTB - OF",2,1,"OF#2",{"$nulls":3},"OF#2","Whit Merrifield\nKC - 2B,OF",10,2,"OF#2",{"$nulls":3},"OF#2","Mitch Haniger\nSea - OF",7,2,"OF#2",{"$nulls":3},"OF#2",{"$nulls":3},"OF#2","Delino DeShields\nTex - OF",5,1]
[6,"OF#3",{"$nulls":3},"OF#3","Trey Mancini\nBal - 1B,OF",5,1,"OF#3","Jackie Bradley Jr.\nBos - OF",10,1,"OF#3","Andrew Benintendi\nBos - OF",10,2,"OF#3",{"$nulls":3},"OF#3",{"$nulls":3},"OF#3","Kevin Pillar\nTor - OF",15,1,"OF#3",{"$nulls":3},"OF#3","Byron Buxton\nMin - OF",21,3,"OF#3",{"$nulls":3},"OF#3"]
[10,"DH",{"$nulls":3},"DH",{"$nulls":3},"DH",{"$nulls":3},"DH",{"$nulls":3},"DH",{"$nulls":3},"DH","Brad Miller\nTB - 2B",6,1,"DH",{"$nulls":3},"DH",{"$nulls":3},"DH",null,null,"","DH",{"$nulls":3},"DH"]
[{"$f":"11-COUNT(D12,#REF!,L12,P12,T12,X12,AB12,AF12,#REF!,AN12,AR12)","v":5},"SP#1","Dylan Bundy\nBal - SP",10,1,"SP#1","Collin McHugh\nHou - SP",6,1,"SP#1",{"$nulls":3},"SP#1","Michael Fulmer\nDet - SP",15,2,"SP#1","Carlos Carrasco\nCle - SP",37,2,"SP#1",{"$nulls":3},"SP#1",{"$nulls":3},"SP#1","Trevor Bauer\nCle - SP",13,1,"SP#1","Cole Hamels\nTex - SP",10,1,"SP#1","Charlie Morton\nHou - SP",5,1,"SP#1","Chris Sale\nBos - SP",52,2]
[{"$f":"11-COUNT(D13,#REF!,L13,P13,T13,X13,AB13,AF13,AJ13,AN13,AR13)","v":6},"SP#2","James Paxton\nSea - SP",26,1,"SP#2","Alex Cobb\nTB - SP",5,1,"SP#2",{"$nulls":3},"SP#2","Blake Snell\nTB - SP",10,2,"SP#2","Kevin Gausman\nBal - SP",24,1,"SP#2",{"$nulls":3},"SP#2",{"$nulls":3},"SP#2",{"$nulls":3},"SP#2",{"$nulls":3},"SP#2","Sean Manaea\nOak - SP",10,1,"SP#2","Sonny Gray\nNYY - SP",7,2]
[{"$f":"11-COUNT(D14,H16,L14,P14,T14,X14,AB14,AF14,AJ14,AN14,AR14)","v":8},"SP#3","Jake Faria\nTB - SP",5,1,"SP#3","Danny Duffy\nKC - SP",10,1,"SP#3",{"$nulls":3},"SP#3",{"$nulls":3},"SP#3",{"$nulls":3},"SP#3","Dallas Keuchel\nHou - SP",23,1,"SP#3",{"$nulls":3},"SP#3",{"$nulls":3},"SP#3",{"$nulls":3},"SP#3",{"$nulls":3},"SP#3"]
[{"$f":"11-COUNT(D19,H13,L15,P15,T15,X15,AB15,AF15,AJ15,AN15,AR15)","v":6},"SP#4",{"$nulls":3},"SP#4",{"$nulls":3},"SP#4","Jordan Montgomery\nNYY - SP",5,1,"SP#4",{"$nulls":3},"SP#4",{"$nulls":3},"SP#4","Justin Verlander\nHou - SP",27,1,"SP#4","Rick Porcello\nBos - SP",6,1,"SP#4",{"$nulls":3},"SP#4",{"$nulls":3},"SP#4",{"$nulls":3},"SP#4"]
[{"$f":"11-COUNT(D17,#REF!,L16,P16,T16,X16,AB16,AF16,AJ12,AN16,AR16)","v":4},"SP#5",{"$nulls":3},"SP#5","José Berríos\nMin - SP",15,3,"SP#5","Carlos Rodón\nCWS - SP",11,1,"SP#5","J.A. Happ\nTor - SP",6,1,"SP#5","Ervin Santana\nMin - SP",10,1,"SP#5","CC Sabathia\nNYY - SP",1,1,"SP#5","Aaron Sanchez\nTor - SP",15,1,"SP#5",{"$nulls":3},"SP#5",{"$nulls":3},"SP#5",{"$nulls":3},"SP#5"]
[{"$f":"11-COUNT(#REF!,H17,L17,P17,T17,X17,AB17,AF17,AJ17,AN17,AR17)","v":9},"RP#1","Cam Bedrosian\nLAA - RP",10,1,"RP#1","Blake Parker\nLAA - RP",5,1,"RP#1",{"$nulls":3},"RP#1",{"$nulls":3},"RP#1",{"$nulls":3},"RP#1",{"$nulls":3},"RP#1",{"$nulls":3},"RP#1",{"$nulls":3},"RP#1",{"$nulls":3},"RP#1",{"$nulls":3},"RP#1","Blake Treinen\nOak - RP",5,1]
[9,"RP#2","Nate Jones\nCWS - RP",10,1,"RP#2",{"$nulls":3},"RP#2",{"$nulls":3},"RP#2",{"$nulls":3},"RP#2",{"$nulls":3},"RP#2",{"$nulls":3},"RP#2",{"$nulls":3},"RP#2",{"$nulls":3},"RP#2","Dellin Betances\nNYY - RP",20,1,"RP#2",{"$nulls":3},"RP#2"]
[{"$f":"11-COUNT(#REF!,H19,L19,P19,T19,X19,AB19,AF19,AJ19,AN19,AR19)","v":6},"RP#3","Cody Allen\nCle - RP",32,1,"RP#3",{"$nulls":3},"RP#3","Tony Zych\nSea - RP",1,1,"RP#3",{"$nulls":3},"RP#3","Matt Bush\nTex - RP",6,1,"RP#3",{"$nulls":3},"RP#3","Ryan Tepera\nTor - RP",5,1,"RP#3","Aroldis Chapman\nNYY - RP",53,2,"RP#3","Chris Devenski\nHou - RP",5,1,"RP#3",{"$nulls":3},"RP#3"]
[{"$f":"11-COUNT(#REF!,#REF!,L20,P20,T20,X20,AB20,AF20,AJ20,AN20,AR20)","v":5},"RP#4","Álex Cláudio\nTex - RP",5,1,"RP#4","Brad Peacock\nHou - SP,RP",10,2,"RP#4","Edwin Díaz\nSea - RP",15,2,"RP#4",{"$nulls":3},"RP#4","Alex Colomé\nTB - RP",14,1,"RP#4",{"$nulls":3},"RP#4","Kelvin Herrera\nKC - RP",6,1,"RP#4","Andrew Miller\nCle - RP",25,2,"RP#4","Shane Greene\nDet - RP",5,1,"RP#4","Mike Clevinger\nCle - SP,RP",5,1,"RP#4"]
[null,null,"Current Used Points",{"$f":"SUM(D3:D20)","v":227},null,null,"Current Used Points",{"$f":"SUM(H3:H20)","v":97},null,null,"Current Used Points",{"$f":"SUM(L3:L20)","v":104},null,null,"Current Used Points",{"$f":"SUM(P3:P20)","v":149},null,null,"Current Used Points",{"$f":"SUM(T3:T20)","v":160},null,null,"Current Used Points",{"$f":"SUM(X3:X20)","v":95},null,null,"Current Used Points",{"$f":"SUM(AB3:AB20)","v":90},null,null,"Current Used Points",{"$f":"SUM(AF3:AF20)","v":120},null,null,"Current Used Points",{"$f":"SUM(AJ3:AJ20)","v":76},null,null,"Current Used Points",{"$f":"SUM(AN3:AN20)","v":61},null,null,"Current Used Points",{"$f":"SUM(AR3:AR20)","v":104}]
[null,null,"Remaining Points",{"$f":"SUM(260-D21)","v":33},null,null,"Remaining Points",{"$f":"SUM(260-H21)","v":163},null,null,"Remaining Points",{"$f":"SUM(260-L21)","v":156},null,null,"Remaining Points",{"$f":"SUM(260-P21)","v":111},null,null,"Remaining Points",{"$f":"SUM(260-T21)","v":100},null,null,"Remaining Points",{"$f":"SUM(260-X21)","v":165},null,null,"Remaining Points",{"$f":"SUM(260-AB21)","v":170},null,null,"Remaining Points",{"$f":"SUM(260-AF21)","v":140},null,null,"Remaining Points",{"$f":"SUM(260-AJ21)","v":184},null,null,"Remaining Points",{"$f":"SUM(260-AN21)","v":199},null,null,"Remaining Points",{"$f":"SUM(260-AR21)","v":156}]
[null,"Maximum Bidding Points",null,{"$f":"(D22-(18-COUNT(D3:D20))+(IF(COUNT(D3:D20)=18,0,1)))","v":29},null,"Maximum Bidding Points",null,{"$f":"(H22-(18-COUNT(H3:H20))+(IF(COUNT(H3:H20)=18,0,1)))","v":157},null,"Maximum Bidding Points",null,{"$f":"(L22-(18-COUNT(L3:L20))+(IF(COUNT(L3:L20)=18,0,1)))","v":150},null,"Maximum Bidding Points",null,{"$f":"(P22-(18-COUNT(P3:P20))+(IF(COUNT(P3:P20)=18,0,1)))","v":102},null,"Maximum Bidding Points",null,{"$f":"(T22-(18-COUNT(T3:T20))+(IF(COUNT(T3:T20)=18,0,1)))","v":91},null,"Maximum Bidding Points",null,{"$f":"(X22-(18-COUNT(X3:X20))+(IF(COUNT(X3:X20)=18,0,1)))","v":156},null,"Maximum Bidding Points",null,{"$f":"(AB22-(18-COUNT(AB3:AB20))+(IF(COUNT(AB3:AB20)=18,0,1)))","v":160},null,"Maximum Bidding Points",null,{"$f":"(AF22-(18-COUNT(AF3:AF20))+(IF(COUNT(AF3:AF20)=18,0,1)))","v":130},null,"Maximum Bidding Points",null,{"$f":"(AJ22-(18-COUNT(AJ3:AJ20))+(IF(COUNT(AJ3:AJ20)=18,0,1)))","v":175},null,"Maximum Bidding Points",null,{"$f":"(AN22-(18-COUNT(AN3:AN20))+(IF(COUNT(AN3:AN20)=18,0,1)))","v":189},null,"Maximum Bidding Points",null,{"$f":"(AR22-(18-COUNT(AR3:AR20))+(IF(COUNT(AR3:AR20)=18,0,1)))","v":146}]
[null,"Remaining # of Players to Draft",null,{"$f":"18-COUNT(D3:D20)","v":5},null,"Remaining # of Players to Draft",null,{"$f":"18-COUNT(H3:H20)","v":7},null,"Remaining # of Players to Draft",null,{"$f":"18-COUNT(L3:L20)","v":7},null,"Remaining # of Players to Draft",null,{"$f":"18-COUNT(P3:P20)","v":10},null,"Remaining # of Players to Draft",null,{"$f":"18-COUNT(T3:T20)","v":10},null,"Remaining # of Players to Draft",null,{"$f":"18-COUNT(X3:X20)","v":10},null,"Remaining # of Players to Draft",null,{"$f":"18-COUNT(AB3:AB20)","v":11},null,"Remaining # of Players to Draft",null,{"$f":"18-COUNT(AF3:AF20)","v":11},null,"Remaining # of Players to Draft",null,{"$f":"18-COUNT(AJ3:AJ20)","v":10},null,"Remaining # of Players to Draft",null,{"$f":"18-COUNT(AN3:AN20)","v":11},null,"Remaining # of Players to Draft",null,{"$f":"18-COUNT(AR3:AR20)","v":11}]
[]
[]
[null,null,"Matt Olson\nOak - 1B,OF",5,"r2018",null,"Bradley Zimmer\nCle - OF",5,"r2018",null,"Franklin Barreto\nOak - 2B,SS",5,"r2018",null,"Rafael Devers\nBos - 3B",5,"r2018",{"$nulls":9},"AJ Reed\nHou - 1B",5,"r2018",null,"David Price\nBos - SP,RP",30,"r2018",null,"Michael Kopech\nCWS - SP",1,"r2018",null,"Jeimer Candelario\nDet - 3B",5,"r2018",null,"Willy Adames\nTB - SS",5,"r2018"]
[null,null,"Austin Hays\nBal - OF",5,"r2018",null,"Lucas Giolito\nCWS - SP",5,"r2018",null,"Clint Frazier\nNYY - OF",5,"r2018",null,"Gleyber Torres\nNYY - SS",5,"r2018",{"$nulls":17},"Carson Smith\nBos - RP",5,"r2018",{"$nulls":5},"Marco Gonzales\nSea - SP",5,"r2018"]
[null,null,"Dustin Fowler\nOak - OF",5,"r2018",{"$nulls":9},"Kyle Tucker\nHou - OF",5,"r2018",{"$nulls":17},"Addison Reed\nMin - RP",5,"r2018"]
[]
[]
[]
[]
[null,null,{"$f":"\"Draft Order = \"&VLOOKUP(\"Lightning (Mike Goodman)\",draft_order,2,FALSE)","v":"Draft Order = 11"},{"$nulls":3},{"$f":"\"Draft Order = \"&VLOOKUP(\"Evolution (Bruce)\",draft_order,2,FALSE)","v":"Draft Order = 4"},{"$nulls":3},{"$f":"\"Draft Order = \"&VLOOKUP(\"Miggy Pop (Colin)\",draft_order,2,FALSE)","v":"Draft Order = 7"},{"$nulls":3},{"$f":"\"Draft Order = \"&VLOOKUP(\"Woap (Mike)\",draft_order,2,FALSE)","v":"Draft Order = 6"},{"$nulls":3},{"$f":"\"Draft Order = \"&VLOOKUP(\"The Dominant Brand (Brandon)\",draft_order,2,FALSE)","v":"Draft Order = 5"},{"$nulls":3},{"$f":"\"Draft Order = \"&VLOOKUP(\"Guzzlers (Rhonda)\",draft_order,2,FALSE)","v":"Draft Order = 10"},{"$nulls":3},{"$f":"\"Draft Order = \"&VLOOKUP(\"Moneyballers (Rob)\",draft_order,2,FALSE)","v":"Draft Order = 1"},{"$nulls":3},{"$f":"\"Draft Order = \"&VLOOKUP(\"Booya's (Cathy)\",draft_order,2,FALSE)","v":"Draft Order = 2"},{"$nulls":3},{"$f":"\"Draft Order = \"&VLOOKUP(\"Freebirds (Todd)\",draft_order,2,FALSE)","v":"Draft Order = 3"},{"$nulls":3},{"$f":"\"Draft Order = \"&VLOOKUP(\"Numbats (Tom)\",draft_order,2,FALSE)","v":"Draft Order = 8"},{"$nulls":3},{"$f":"\"Draft Order = \"&VLOOKUP(\"TheDunnShow (Dave)\",draft_order,2,FALSE)","v":"Draft Order = 9"}]

{"sheet":"Draft List","index":1,"n_rows":114,"n_cols":12,"rows_kept":114}
[113,"Owner","Player","Bid","Team/Position","Rank","AB/Innings","R/Wins","HR/Saves","RBI/SO","SB/ERA","Avg./WHIP"]
[1,"Lightning (Mike Goodman)","Gary Sánchez","15","NYY - C","26","131/471","79","33","90","2",".278"]
[2,"Lightning (Mike Goodman)","José Altuve","51","Hou - 2B",2,"204/590","112","24","81","32",".346"]
[3,"Lightning (Mike Goodman)","Ryon Healy","5","Sea - 1B,3B",309,"156/576","66","25","78","0",".271"]
[4,"Lightning (Mike Goodman)","Francisco Lindor","15","Cle - SS",20,"178/651","99","33","89","15",".273"]
[5,"Lightning (Mike Goodman)","Justin Upton","42","LAA - OF",38,"152/557","100","35","109","14",".273"]
[6,"Lightning (Mike Goodman)","Josh Reddick","1","Hou - OF",205,"150/477","77","13","82","7",".314"]
[7,"Lightning (Mike Goodman)","Dylan Bundy","10","Bal - SP",194,"169.2","13","0","152","4.24","1.20"]
[8,"Lightning (Mike Goodman)","James Paxton","26","Sea - SP",75,"136.0","12","0","156","2.98","1.10"]
[9,"Lightning (Mike Goodman)","Jake Faria","5","TB - SP",232,"86.2","5","0","84","3.43","1.18"]
[10,"Lightning (Mike Goodman)","Cam Bedrosian","10","LAA - RP",287,"44.2","6","6","53","4.43","1.30"]
[11,"Lightning (Mike Goodman)","Nate Jones","10","CWS - RP",297,"11.2","1","0","15","2.31","1.29"]
[12,"Lightning (Mike Goodman)","Cody Allen","32","Cle - RP",105,"67.1","3","30","92","2.94","1.16"]
[13,"Lightning (Mike Goodman)","Álex Cláudio","5","Tex - RP",315,"82.2","4","11","56","2.50","1.04"]
[14,"Lightning (Mike Goodman)","Matt Olson","5","Oak - 1B,OF",123,"49/189","33","24","45","0",".259"]
[15,"Lightning (Mike Goodman)","Austin Hays","5","Bal - OF",1528,"13/60","4","1","8","0",".217"]
[16,"Lightning (Mike Goodman)","Dustin Fowler","5","Oak - OF",1622,"-/-","-","-","-","-","-"]
[17,"Evolution (Bruce)","Mike Zunino","6","Sea - C","203","97/387","52","25","64","1",".251"]
[18,"Miggy Pop (Colin)","Rougned Odor","15","Tex - 2B",92,"124/607","79","30","75","15",".204"]
[19,"Evolution (Bruce)","Joey Gallo","10","Tex - 1B,3B,OF","113","94/449","85","41","80","7",".209"]
[20,"Evolution (Bruce)","Tim Anderson","10","CWS - SS",210,"151/587","72","17","56","15",".257"]
[21,"Evolution (Bruce)","Trey Mancini","5","Bal - 1B,OF",242,"159/543","65","24","78","1",".293"]
[22,"Evolution (Bruce)","Collin McHugh","6","Hou - SP",444,"63.1","5","0","62","3.55","1.29"]
[23,"Evolution (Bruce)","Alex Cobb","5","TB - SP",211,"179.1","12","0","128","3.66","1.22"]
[24,"Evolution (Bruce)","José Berríos","15","Min - SP",98,"145.2","14","0","139","3.89","1.23"]
[25,"Evolution (Bruce)","Danny Duffy","10","KC - SP",144,"146.1","9","0","130","3.81","1.26"]
[26,"Evolution (Bruce)","Blake Parker","5","LAA - RP",245,"67.1","3","8","86","2.54","0.83"]
[27,"Evolution (Bruce)","Brad Peacock","10","Hou - SP,RP",276,"132.0","13","0","161","3.00","1.19"]
[28,"Evolution (Bruce)","Bradley Zimmer","5","Cle - OF",183,"72/299","41","8","39","18",".241"]
[29,"Evolution (Bruce)","Lucas Giolito","5","CWS - SP",263,"45.1","3","0","34","2.38","0.95"]
[30,"Miggy Pop (Colin)","Yuli Gurriel","10","Hou - 1B","174","158/529","69","18","75","3",".299"]
[31,"Miggy Pop (Colin)","Jonathan Schoop","17","Bal - 2B",77,"182/622","92","32","105","1",".293"]
[32,"Miggy Pop (Colin)","Miguel Sanó","15","Min - 1B,3B",100,"112/424","75","28","77","0",".264"]
[33,"Miggy Pop (Colin)","Marcus Semien","5","Oak - SS",226,"85/342","53","10","40","12",".249"]
[34,"Miggy Pop (Colin)","Eduardo Núñez","5","Bos - 2B,3B,SS,OF",228,"146/467","60","12","58","24",".313"]
[35,"Miggy Pop (Colin)","Mark Trumbo","10","Bal - OF",188,"131/559","79","23","65","1",".234"]
[36,"Miggy Pop (Colin)","Jackie Bradley Jr.","10","Bos - OF",217,"118/482","58","17","63","8",".245"]
[37,"Miggy Pop (Colin)","Jordan Montgomery","5","NYY - SP",288,"155.1","9","0","144","3.88","1.23"]
[38,"Miggy Pop (Colin)","Carlos Rodón","11","CWS - SP",285,"69.1","2","0","76","4.15","1.37"]
[39,"Miggy Pop (Colin)","Tony Zych","1","Sea - RP",422,"40.2","6","1","35","2.66","1.25"]
[40,"Miggy Pop (Colin)","Edwin Díaz","15","Sea - RP",97,"66.0","4","34","89","3.27","1.15"]
[41,"Miggy Pop (Colin)","Franklin Barreto","5","Oak - 2B,SS",1473,"14/71","10","2","6","2",".197"]
[42,"Miggy Pop (Colin)","Clint Frazier","5","NYY - OF",1403,"31/134","16","4","17","1",".231"]
[43,"Woap (Mike)","Robinson Canó","26","Sea - 2B",54,"166/592","79","23","97","1",".280"]
[44,"Woap (Mike)","Mike Moustakas","17","KC - 3B",101,"151/555","75","38","85","0",".272"]
[45,"Woap (Mike)","Mike Trout","63","LAA - OF",1,"123/402","92","33","72","22",".306"]
[46,"Woap (Mike)","Kevin Kiermaier","2","TB - OF",152,"105/380","56","15","39","16",".276"]
[47,"Woap (Mike)","Andrew Benintendi","10","Bos - OF",43,"155/573","84","20","90","20",".271"]
[48,"Woap (Mike)","Michael Fulmer","15","Det - SP",169,"164.2","10","0","114","3.83","1.15"]
[49,"Woap (Mike)","Blake Snell","10","TB - SP",171,"129.1","5","0","119","4.04","1.33"]
[50,"Woap (Mike)","J.A. Happ","6","Tor - SP",255,"145.1","10","0","142","3.53","1.31"]
[51,"Woap (Mike)","Rafael Devers","5","Bos - 3B",83,"63/222","34","10","30","3",".284"]
[52,"Woap (Mike)","Gleyber Torres","5","NYY - SS",332,"-/-","-","-","-","-","-"]
[53,"Woap (Mike)","Kyle Tucker","5","Hou - OF",1616,"-/-","-","-","-","-","-"]
[54,"The Dominant Brand (Brandon)","Brian McCann","11","Hou - C","216","84/349","47","18","62","1",".241"]
[55,"The Dominant Brand (Brandon)","Nicholas Castellanos","23","Det - 3B,OF",133,"167/614","73","26","101","4",".272"]
[56,"The Dominant Brand (Brandon)","Xander Bogaerts","35","Bos - SS",61,"156/571","94","10","62","15",".273"]
[57,"The Dominant Brand (Brandon)","Carlos Carrasco","37","Cle - SP",34,"200.0","18","0","226","3.29","1.10"]
[58,"The Dominant Brand (Brandon)","Kevin Gausman","24","Bal - SP",182,"186.2","11","0","179","4.68","1.49"]
[59,"The Dominant Brand (Brandon)","Ervin Santana","10","Min - SP",301,"211.1","16","0","167","3.28","1.13"]
[60,"The Dominant Brand (Brandon)","Matt Bush","6","Tex - RP",413,"52.1","3","10","58","3.78","1.45"]
[61,"The Dominant Brand (Brandon)","Alex Colomé","14","TB - RP",134,"66.2","2","47","58","3.24","1.20"]
[62,"Guzzlers (Rhonda)","Brian Dozier","8","Min - 2B",41,"167/617","106","34","93","16",".271"]
[63,"Guzzlers (Rhonda)","Tim Beckham","5","Bal - 2B,SS",323,"148/533","67","22","62","6",".278"]
[64,"Guzzlers (Rhonda)","Mookie Betts","15","Bos - OF",7,"166/628","101","24","102","26",".264"]
[65,"Guzzlers (Rhonda)","Whit Merrifield","10","KC - 2B,OF",106,"169/587","80","19","78","34",".288"]
[66,"Guzzlers (Rhonda)","Brad Miller","6","TB - 2B",1208,"68/338","43","9","40","5",".201"]
[67,"Guzzlers (Rhonda)","Dallas Keuchel","23","Hou - SP",70,"145.2","14","0","125","2.90","1.12"]
[68,"Guzzlers (Rhonda)","Justin Verlander","27","Hou - SP",35,"206.0","15","0","219","3.36","1.17"]
[69,"Guzzlers (Rhonda)","CC Sabathia","1","NYY - SP",368,"148.2","14","0","120","3.69","1.27"]
[70,"Numbats (Tom)","Greg Bird","5","NYY - 1B","121","28/147","20","9","28","0",".190"]
[71,"Numbats (Tom)","Yoán Moncada","11","CWS - 2B",151,"46/199","31","8","22","3",".231"]
[72,"Numbats (Tom)","Alex Bregman","15","Hou - 3B,SS",55,"158/556","88","19","71","17",".284"]
[73,"Numbats (Tom)","Nomar Mazara","10","Tex - OF",150,"140/554","64","20","101","2",".253"]
[74,"Numbats (Tom)","Charlie Morton","5","Hou - SP",209,"146.2","14","0","163","3.62","1.19"]
[75,"Numbats (Tom)","Sean Manaea","10","Oak - SP",224,"158.2","12","0","140","4.37","1.40"]
[76,"Numbats (Tom)","Mike Clevinger","5","Cle - SP,RP",259,"121.2","12","0","137","3.11","1.25"]
[77,"Numbats (Tom)","Jeimer Candelario","5","Det - 3B",293,"36/127","18","3","16","0",".283"]
[78,"TheDunnShow (Dave)","Justin Smoak","5","Tor - 1B","87","151/560","85","38","90","0",".270"]
[79,"TheDunnShow (Dave)","Carlos Correa","15","Hou - SS",15,"133/422","82","24","84","2",".315"]
[80,"TheDunnShow (Dave)","Aaron Judge","15","NYY - OF",17,"154/542","128","52","114","9",".284"]
[81,"TheDunnShow (Dave)","Delino DeShields","5","Tex - OF",207,"101/376","75","6","22","29",".269"]
[82,"TheDunnShow (Dave)","Chris Sale","52","Bos - SP",13,"214.1","17","0","308","2.90","0.97"]
[83,"TheDunnShow (Dave)","Sonny Gray","7","NYY - SP",126,"162.1","10","0","153","3.55","1.21"]
[84,"TheDunnShow (Dave)","Blake Treinen","5","Oak - RP",215,"75.2","3","16","74","3.93","1.39"]
[85,"TheDunnShow (Dave)","Willy Adames","5","TB - SS",1676,"-/-","-","-","-","-","-"]
[86,"TheDunnShow (Dave)","Marco Gonzales","5","Sea - SP",1213,"40.0","1","0","32","6.08","1.75"]
[87,"Booya's (Cathy)","José Ramírez","15","Cle - 2B,3B",25,"186/585","107","29","83","17",".318"]
[88,"Booya's (Cathy)","Didi Gregorius","6","NYY - SS",119,"153/534","73","25","87","3",".287"]
[89,"Booya's (Cathy)","Brett Gardner","1","NYY - OF",138,"157/594","96","21","63","23",".264"]
[90,"Booya's (Cathy)","Mitch Haniger","7","Sea - OF",236,"104/369","58","16","47","5",".282"]
[91,"Booya's (Cathy)","Trevor Bauer","13","Cle - SP",168,"176.1","17","0","196","4.19","1.37"]
[92,"Booya's (Cathy)","Aroldis Chapman","53","NYY - RP",74,"50.1","4","22","69","3.22","1.13"]
[93,"Booya's (Cathy)","Andrew Miller","25","Cle - RP",197,"62.2","4","2","95","1.44","0.83"]
[94,"Booya's (Cathy)","David Price","30","Bos - SP,RP",128,"74.2","6","0","76","3.38","1.19"]
[95,"Freebirds (Todd)","Yonder Alonso","5","Cle - 1B","270","120/451","72","28","67","2",".266"]
[96,"Freebirds (Todd)","Marwin González","5","Hou - 1B,2B,3B,SS,OF",195,"138/455","67","23","90","8",".303"]
[97,"Freebirds (Todd)","Matt Davidson","5","CWS - 1B,3B",1171,"91/414","43","26","68","0",".220"]
[98,"Freebirds (Todd)","Byron Buxton","21","Min - OF",56,"117/462","69","16","51","29",".253"]
[99,"Freebirds (Todd)","Cole Hamels","10","Tex - SP",177,"148.0","11","0","105","4.20","1.20"]
[100,"Freebirds (Todd)","Dellin Betances","20","NYY - RP",261,"59.2","3","10","100","2.87","1.22"]
[101,"Freebirds (Todd)","Chris Devenski","5","Hou - RP",328,"80.2","8","4","100","2.68","0.94"]
[102,"Freebirds (Todd)","Shane Greene","5","Det - RP",246,"67.2","4","9","73","2.66","1.24"]
[103,"Freebirds (Todd)","Michael Kopech","1","CWS - SP",312,"-","-","-","-","-","-"]
[104,"Freebirds (Todd)","Carson Smith","5","Bos - RP",586,"6.2","0","1","7","1.35","1.35"]
[105,"Freebirds (Todd)","Addison Reed","5","Min - RP",321,"76.0","2","19","76","2.84","1.05"]
[106,"Moneyballers (Rob)","Welington Castillo","6","CWS - C","235","96/341","44","20","53","0",".282"]
[107,"Moneyballers (Rob)","José Abreu","37","CWS - 1B","33","189/621","95","33","102","3",".304"]
[108,"Moneyballers (Rob)","Kevin Pillar","15","Tor - OF",426,"150/587","72","16","42","15",".256"]
[109,"Moneyballers (Rob)","Rick Porcello","6","Bos - SP",244,"203.1","11","0","181","4.65","1.40"]
[110,"Moneyballers (Rob)","Aaron Sanchez","15","Tor - SP",253,"36.0","1","0","24","4.25","1.72"]
[111,"Moneyballers (Rob)","Ryan Tepera","5","Tor - RP",384,"77.2","7","2","81","3.59","1.13"]
[112,"Moneyballers (Rob)","Kelvin Herrera","6","KC - RP",163,"59.1","3","26","56","4.25","1.35"]
[113,"Moneyballers (Rob)","AJ Reed","5","Hou - 1B","1853","0/6","0","0","0","0",".000"]

{"sheet":"Summary","index":2,"n_rows":13,"n_cols":15,"rows_kept":13}
["Owners","Current Used Points","Remaining Points","Max Bidding Points","Players Left to Draft","C","1B","2B","3B","SS","OF","DH","SP","RP","Reserve"]
["Lightning (Mike Goodman)",{"$f":"used1","v":227},{"$f":"'2018 Pre-Draft Rosters'!D22","v":33},{"$f":"'2018 Pre-Draft Rosters'!D23","v":29},{"$f":"'2018 Pre-Draft Rosters'!D24","v":5},{"$f":"1-COUNT('2018 Pre-Draft Rosters'!D3)","v":0},{"$f":"1-COUNT('2018 Pre-Draft Rosters'!D4)","v":1},{"$f":"1-COUNT('2018 Pre-Draft Rosters'!D5)","v":0},{"$f":"1-COUNT('2018 Pre-Draft Rosters'!D6)","v":0},{"$f":"1-COUNT('2018 Pre-Draft Rosters'!D7)","v":0},{"$f":"3-COUNT('2018 Pre-Draft Rosters'!D8:D10)","v":1},{"$f":"1-COUNT('2018 Pre-Draft Rosters'!D11)","v":1},{"$f":"5-COUNT('2018 Pre-Draft Rosters'!D12:D16)","v":2},{"$f":"4-COUNT('2018 Pre-Draft Rosters'!D17:D20)","v":0},{"$f":"7-COUNT('2018 Pre-Draft Rosters'!D27:D33)","v":4}]
["Evolution (Bruce)",{"$f":"used2","v":97},{"$f":"'2018 Pre-Draft Rosters'!H22","v":163},{"$f":"'2018 Pre-Draft Rosters'!H23","v":157},{"$f":"'2018 Pre-Draft Rosters'!H24","v":7},{"$f":"1-COUNT('2018 Pre-Draft Rosters'!H3)","v":0},{"$f":"1-COUNT('2018 Pre-Draft Rosters'!H4)","v":1},{"$f":"1-COUNT('2018 Pre-Draft Rosters'!H5)","v":0},{"$f":"1-COUNT('2018 Pre-Draft Rosters'!H6)","v":0},{"$f":"1-COUNT('2018 Pre-Draft Rosters'!H7)","v":0},{"$f":"3-COUNT('2018 Pre-Draft Rosters'!H8:H10)","v":2},{"$f":"1-COUNT('2018 Pre-Draft Rosters'!H11)","v":1},{"$f":"5-COUNT('2018 Pre-Draft Rosters'!H12:H16)","v":1},{"$f":"4-COUNT('2018 Pre-Draft Rosters'!H17:H20)","v":2},{"$f":"7-COUNT('2018 Pre-Draft Rosters'!H27:H33)","v":5}]
["The Soylent Knights (Colin)",{"$f":"used3","v":104},{"$f":"'2018 Pre-Draft Rosters'!L22","v":156},{"$f":"'2018 Pre-Draft Rosters'!L23","v":150},{"$f":"'2018 Pre-Draft Rosters'!L24","v":7},{"$f":"1-COUNT('2018 Pre-Draft Rosters'!L3)","v":1},{"$f":"1-COUNT('2018 Pre-Draft Rosters'!L4)","v":0},{"$f":"1-COUNT('2018 Pre-Draft Rosters'!L5)","v":0},{"$f":"1-COUNT('2018 Pre-Draft Rosters'!L6)","v":0},{"$f":"1-COUNT('2018 Pre-Draft Rosters'!L7)","v":0},{"$f":"3-COUNT('2018 Pre-Draft Rosters'!L8:L10)","v":0},{"$f":"1-COUNT('2018 Pre-Draft Rosters'!L11)","v":1},{"$f":"5-COUNT('2018 Pre-Draft Rosters'!L12:L16)","v":3},{"$f":"4-COUNT('2018 Pre-Draft Rosters'!L17:L20)","v":2},{"$f":"7-COUNT('2018 Pre-Draft Rosters'!L27:L33)","v":5}]
["Woap (Mike)",{"$f":"used4","v":149},{"$f":"'2018 Pre-Draft Rosters'!P22","v":111},{"$f":"'2018 Pre-Draft Rosters'!P23","v":102},{"$f":"'2018 Pre-Draft Rosters'!P24","v":10},{"$f":"1-COUNT('2018 Pre-Draft Rosters'!P3)","v":1},{"$f":"1-COUNT('2018 Pre-Draft Rosters'!P4)","v":1},{"$f":"1-COUNT('2018 Pre-Draft Rosters'!P5)","v":0},{"$f":"1-COUNT('2018 Pre-Draft Rosters'!P6)","v":0},{"$f":"1-COUNT('2018 Pre-Draft Rosters'!P7)","v":1},{"$f":"3-COUNT('2018 Pre-Draft Rosters'!P8:P10)","v":0},{"$f":"1-COUNT('2018 Pre-Draft Rosters'!P11)","v":1},{"$f":"5-COUNT('2018 Pre-Draft Rosters'!P12:P16)","v":2},{"$f":"4-COUNT('2018 Pre-Draft Rosters'!P17:P20)","v":4},{"$f":"7-COUNT('2018 Pre-Draft Rosters'!P27:P33)","v":4}]
["The Dominant Brand (Brandon)",{"$f":"used5","v":160},{"$f":"'2018 Pre-Draft Rosters'!T22","v":100},{"$f":"'2018 Pre-Draft Rosters'!T23","v":91},{"$f":"'2018 Pre-Draft Rosters'!T24","v":10},{"$f":"1-COUNT('2018 Pre-Draft Rosters'!T3)","v":0},{"$f":"1-COUNT('2018 Pre-Draft Rosters'!T4)","v":1},{"$f":"1-COUNT('2018 Pre-Draft Rosters'!T5)","v":1},{"$f":"1-COUNT('2018 Pre-Draft Rosters'!T6)","v":0},{"$f":"1-COUNT('2018 Pre-Draft Rosters'!T7)","v":0},{"$f":"3-COUNT('2018 Pre-Draft Rosters'!T8:T10)","v":3},{"$f":"1-COUNT('2018 Pre-Draft Rosters'!T11)","v":1},{"$f":"5-COUNT('2018 Pre-Draft Rosters'!T12:T16)","v":2},{"$f":"4-COUNT('2018 Pre-Draft Rosters'!T17:T20)","v":2},{"$f":"7-COUNT('2018 Pre-Draft Rosters'!T27:T33)","v":7}]
["Guzzlers (Rhonda)",{"$f":"used6","v":95},{"$f":"'2018 Pre-Draft Rosters'!X22","v":165},{"$f":"'2018 Pre-Draft Rosters'!X23","v":156},{"$f":"'2018 Pre-Draft Rosters'!X24","v":10},{"$f":"1-COUNT('2018 Pre-Draft Rosters'!X3)","v":1},{"$f":"1-COUNT('2018 Pre-Draft Rosters'!X4)","v":1},{"$f":"1-COUNT('2018 Pre-Draft Rosters'!X5)","v":0},{"$f":"1-COUNT('2018 Pre-Draft Rosters'!X6)","v":1},{"$f":"1-COUNT('2018 Pre-Draft Rosters'!X7)","v":0},{"$f":"3-COUNT('2018 Pre-Draft Rosters'!X8:X10)","v":1},{"$f":"1-COUNT('2018 Pre-Draft Rosters'!X11)","v":0},{"$f":"5-COUNT('2018 Pre-Draft Rosters'!X12:X16)","v":2},{"$f":"4-COUNT('2018 Pre-Draft Rosters'!X17:X20)","v":4},{"$f":"7-COUNT('2018 Pre-Draft Rosters'!X27:X33)","v":7}]
["Moneyballers (Rob)",{"$f":"used7","v":90},{"$f":"'2018 Pre-Draft Rosters'!AB22","v":170},{"$f":"'2018 Pre-Draft Rosters'!AB23","v":160},{"$f":"'2018 Pre-Draft Rosters'!AB24","v":11},{"$f":"1-COUNT('2018 Pre-Draft Rosters'!AB3)","v":0},{"$f":"1-COUNT('2018 Pre-Draft Rosters'!AB4)","v":0},{"$f":"1-COUNT('2018 Pre-Draft Rosters'!AB5)","v":1},{"$f":"1-COUNT('2018 Pre-Draft Rosters'!AB6)","v":1},{"$f":"1-COUNT('2018 Pre-Draft Rosters'!AB7)","v":1},{"$f":"3-COUNT('2018 Pre-Draft Rosters'!AB8:AB10)","v":2},{"$f":"1-COUNT('2018 Pre-Draft Rosters'!AB11)","v":1},{"$f":"5-COUNT('2018 Pre-Draft Rosters'!AB12:AB16)","v":3},{"$f":"4-COUNT('2018 Pre-Draft Rosters'!AB17:AB20)","v":2},{"$f":"7-COUNT('2018 Pre-Draft Rosters'!AB27:AB33)","v":6}]
["Booya's (Cathy)",{"$f":"used8","v":120},{"$f":"'2018 Pre-Draft Rosters'!AF22","v":140},{"$f":"'2018 Pre-Draft Rosters'!AF23","v":130},{"$f":"'2018 Pre-Draft Rosters'!AF24","v":11},{"$f":"1-COUNT('2018 Pre-Draft Rosters'!AF3)","v":1},{"$f":"1-COUNT('2018 Pre-Draft Rosters'!AF4)","v":1},{"$f":"1-COUNT('2018 Pre-Draft Rosters'!AF5)","v":0},{"$f":"1-COUNT('2018 Pre-Draft Rosters'!AF6)","v":1},{"$f":"1-COUNT('2018 Pre-Draft Rosters'!AF7)","v":0},{"$f":"3-COUNT('2018 Pre-Draft Rosters'!AF8:AF10)","v":1},{"$f":"1-COUNT('2018 Pre-Draft Rosters'!AF11)","v":1},{"$f":"5-COUNT('2018 Pre-Draft Rosters'!AF12:AF16)","v":4},{"$f":"4-COUNT('2018 Pre-Draft Rosters'!AF17:AF20)","v":2},{"$f":"7-COUNT('2018 Pre-Draft Rosters'!AF27:AF33)","v":6}]
["Freebirds (Todd)",{"$f":"used9","v":76},{"$f":"'2018 Pre-Draft Rosters'!AJ22","v":184},{"$f":"'2018 Pre-Draft Rosters'!AJ23","v":175},{"$f":"'2018 Pre-Draft Rosters'!AJ24","v":10},{"$f":"1-COUNT('2018 Pre-Draft Rosters'!AJ3)","v":1},{"$f":"1-COUNT('2018 Pre-Draft Rosters'!AJ4)","v":0},{"$f":"1-COUNT('2018 Pre-Draft Rosters'!AJ5)","v":0},{"$f":"1-COUNT('2018 Pre-Draft Rosters'!AJ6)","v":0},{"$f":"1-COUNT('2018 Pre-Draft Rosters'!AJ7)","v":1},{"$f":"3-COUNT('2018 Pre-Draft Rosters'!AJ8:AJ10)","v":2},{"$f":"1-COUNT('2018 Pre-Draft Rosters'!AJ11)","v":1},{"$f":"5-COUNT('2018 Pre-Draft Rosters'!AJ12:AJ15)","v":4},{"$f":"4-COUNT('2018 Pre-Draft Rosters'!AJ17:AJ20)","v":1},{"$f":"7-COUNT('2018 Pre-Draft Rosters'!AJ27:AJ33)","v":4}]
["Numbats (Tom)",{"$f":"used10","v":61},{"$f":"'2018 Pre-Draft Rosters'!AN22","v":199},{"$f":"'2018 Pre-Draft Rosters'!AN23","v":189},{"$f":"'2018 Pre-Draft Rosters'!AN24","v":11},{"$f":"1-COUNT('2018 Pre-Draft Rosters'!AN3)","v":1},{"$f":"1-COUNT('2018 Pre-Draft Rosters'!AN4)","v":0},{"$f":"1-COUNT('2018 Pre-Draft Rosters'!AN5)","v":0},{"$f":"1-COUNT('2018 Pre-Draft Rosters'!AN6)","v":0},{"$f":"1-COUNT('2018 Pre-Draft Rosters'!#REF!)","v":1},{"$f":"3-COUNT('2018 Pre-Draft Rosters'!AN8:AN10)","v":2},{"$f":"1-COUNT('2018 Pre-Draft Rosters'!AN11)","v":1},{"$f":"5-COUNT('2018 Pre-Draft Rosters'!AN12:AN16)","v":3},{"$f":"4-COUNT('2018 Pre-Draft Rosters'!AN17:AN20)","v":3},{"$f":"7-COUNT('2018 Pre-Draft Rosters'!AN7:AN33)","v":-2}]
["TheDunnShow (Dave)",{"$f":"used11","v":104},{"$f":"'2018 Pre-Draft Rosters'!AR22","v":156},{"$f":"'2018 Pre-Draft Rosters'!AR23","v":146},{"$f":"'2018 Pre-Draft Rosters'!AR24","v":11},{"$f":"1-COUNT('2018 Pre-Draft Rosters'!AR3)","v":1},{"$f":"1-COUNT('2018 Pre-Draft Rosters'!AR4)","v":0},{"$f":"1-COUNT('2018 Pre-Draft Rosters'!AR5)","v":1},{"$f":"1-COUNT('2018 Pre-Draft Rosters'!AR6)","v":1},{"$f":"1-COUNT('2018 Pre-Draft Rosters'!AR7)","v":0},{"$f":"3-COUNT('2018 Pre-Draft Rosters'!AR8:AR10)","v":1},{"$f":"1-COUNT('2018 Pre-Draft Rosters'!AR11)","v":1},{"$f":"5-COUNT('2018 Pre-Draft Rosters'!AR12:AR16)","v":3},{"$f":"4-COUNT('2018 Pre-Draft Rosters'!AR17:AR20)","v":3},{"$f":"7-COUNT('2018 Pre-Draft Rosters'!AR27:AR33)","v":5}]
[{"$nulls":4},{"$f":"SUM(E2:E12)","v":103},{"$f":"SUM(F2:F12)","v":7},6,3,4,4,15,10,29,25,51]

{"sheet":"Catchers","index":3,"n_rows":64,"n_cols":9,"rows_kept":64}
["Player","Team","Rank","H/AB","R","HR","RBI","SB","Avg."]
["Salvador Perez","KC - C","148","126/471","57","27","80","1",".268"]
["Evan Gattis","Hou - C","189","79/300","41","12","55","0",".263"]
["Wilson Ramos","TB - C","202","54/208","19","11","35","0",".260"]
["Jonathan Lucroy","Oak - C ","279","112/423","45","6","40","1",".265"]
["Russell Martin","Tor - C,3B","290","68/307","49","13","35","1",".221"]
["Robinson Chirinos","Tex - C","306","67/263","46","17","38","1",".255"]
["James McCann","Det - C","1192","89/352","39","13","49","1",".253"]
["Christian Vázquez","Bos - C","1206","94/324","43","5","32","7",".290"]
["Jason Castro","Min - C","1222","86/356","49","10","47","0",".242"]
["Yan Gomes","Cle - C","1232","79/341","43","14","56","0",".232"]
["Sandy Leon","Bos - C","1278","61/271","32","7","39","0",".225"]
["Martín Maldonado","LAA - C","1294","95/429","43","14","38","0",".221"]
["René Rivera","LAA - C","1295","55/218","23","10","35","0",".252"]
["Jesús Sucre","TB - C","1318","45/176","20","7","29","2",".256"]
["Kevan Smith","CWS - C","1325","78/276","23","4","30","0",".283"]
["Caleb Joseph","Bal - C","1326","65/254","31","8","28","0",".256"]
["John Hicks","Det - C,1B","1331","46/173","25","6","22","2",".266"]
["Derek Norris","Det - C","1338","36/179","21","9","24","1",".201"]
["Roberto Pérez","Cle - C","1350","45/217","22","8","38","0",".207"]
["Omar Narváez","CWS - C","1361","70/253","23","2","14","0",".277"]
["Bruce Maxwell","Oak - C","1378","52/219","21","3","22","0",".237"]
["Drew Butera","KC - C","1398","37/163","18","3","14","0",".227"]
["Carlos Ruiz","Sea - C","1407","27/125","14","3","11","1",".216"]
["Austin Romine","NYY - C,1B","1408","50/229","19","2","21","0",".218"]
["Ryan Hanigan","Cle - C","1429","27/101","9","2","12","0",".267"]
["Brett Nicholas","Tex - C","1443","15/63","7","2","11","0",".238"]
["Geovany Soto","CWS - C","1446","8/42","5","3","9","0",".190"]
["Juan Centeno","Tex - C","1455","12/52","5","2","4","0",".231"]
["Josh Phegley","Oak - C","1467","30/149","14","3","10","0",".201"]
["Curt Casali","Tex - C","1472","3/9","2","1","3","0",".333"]
["Chance Sisco","Bal - C","1484","6/18","3","2","4","0",".333"]
["Tim Federowicz","Hou - C","1506","3/13","3","2","3","0",".231"]
["Carlos Pérez","LAA - C","1518","2/20","1","1","3","0",".100"]
["Dustin Garneau","Oak - C","1519","21/112","10","2","9","0",".188"]
["Max Stassi","Hou - C","1523","4/24","5","2","4","0",".167"]
["Cam Gallagher","KC - C","1524","6/24","2","1","5","0",".250"]
["Anthony Recker","Ari - C","1538","1/7","1","0","0","0",".143"]
["Mike Marjama","Sea - C","1539","3/9","1","1","1","0",".333"]
["Juan Graterol","LAA - C","1540","17/84","5","0","10","0",".202"]
["Blake Swihart","Bos - C","1554","1/5","1","0","0","0",".200"]
["David Freitas","Sea - C","1559","4/17","2","0","2","0",".235"]
["Jarrod Saltalamacchia","Tor - C","1573","1/25","1","0","0","0",".040"]
["Mitch Garver","Min - C","1577","9/46","5","0","3","0",".196"]
["Mike Ohlman","Tex - C","1588","3/13","1","0","1","0",".231"]
["Oscar Hernandez","Bos - C","1594","-/-","-","-","-","-","-"]
["Erik Kratz","NYY - C","1600","2/2","0","0","2","0","1.000"]
["Sean Murphy","Oak - C","1636","-/-","-","-","-","-","-"]
["Miguel Gonzalez","Det - C","1644","-/-","-","-","-","-","-"]
["Garrett Stubbs","Hou - C","1648","-/-","-","-","-","-","-"]
["Reese McGuire","Tor - C","1651","-/-","-","-","-","-","-"]
["Zack Collins","CWS - C","1655","-/-","-","-","-","-","-"]
["Ben Rortvedt","Min - C","1657","-/-","-","-","-","-","-"]
["Max Pentecost","Tor - C","1700","-/-","-","-","-","-","-"]
["MJ Melendez","KC - C","1703","-/-","-","-","-","-","-"]
["Taylor Ward","LAA - C","1713","-/-","-","-","-","-","-"]
["Chase Vallot","KC - C","1738","-/-","-","-","-","-","-"]
["Jake Rogers","Det - C","1771","-/-","-","-","-","-","-"]
["Danny Jansen","Tor - C","1785","-/-","-","-","-","-","-"]
["Luke Maile","Tor - C","1843","19/130","10","2","7","1",".146"]
["Andrew Susac","Bal - C","1855","1/12","0","0","0","0",".083"]
["A.J. Jimenez","Tex - C","1867","1/12","0","0","0","0",".083"]
["Kyle Higashioka","NYY - C","1870","0/18","2","0","0","0",".000"]
["Tuffy Gosewisch","Sea - C","1872","2/28","1","0","0","0",".071"]

{"sheet":"1st Base","index":4,"n_rows":53,"n_cols":9,"rows_kept":53}
["Player","Team","Rank","H/AB","R","HR","RBI","SB","Avg."]
["Edwin Encarnacion","Cle - 1B","42","143/554","96","38","107","2",".258"]
["Miguel Cabrera","Det - 1B","66","117/469","50","16","60","0",".249"]
["Chris Davis","Bal - 1B","149","98/456","65","26","61","1",".215"]
["Hanley Ramirez","Bos - 1B","250","120/496","58","23","62","1",".242"]
["Neil Walker","NYY - 1B,2B ",255,"102/385","59","14","49","0",".265"]
["Kendrys Morales","Tor - 1B","256","139/557","67","28","85","0",".250"]
["Logan Morrison","Min - 1B","296","126/512","75","38","85","2",".246"]
["Albert Pujols","LAA - 1B","302","143/593","53","23","101","3",".241"]
["Joe Mauer","Min - 1B","320","160/525","69","7","71","2",".305"]
["Mitch Moreland","Bos - 1B","335","125/508","73","22","79","0",".246"]
["Mike Napoli","Cle - 1B","461","82/425","60","29","66","1",".193"]
["Danny Valencia","Bal - 1B,OF","468","115/450","54","15","66","2",".256"]
["Adam Lind","NYY - 1B,OF","506","81/267","39","14","59","1",".303"]
["Matt Holliday","NYY - 1B","589","86/373","50","19","64","1",".231"]
["C.J. Cron","TB - 1B","614","84/339","39","16","56","3",".248"]
["Lucas Duda","KC - 1B","1004","92/423","50","30","64","0",".217"]
["Brandon Moss","Oak - 1B","1101","75/362","41","22","50","2",".207"]
["Luis Valbuena","LAA - 1B,3B","1144","69/347","42","22","65","0",".199"]
["Steve Pearce","Tor - 1B,OF","1214","79/313","38","13","37","0",".252"]
["Kennys Vargas","Min - 1B","1245","61/241","33","11","41","0",".253"]
["Chris Carter","LAA - 1B","1267","37/184","20","8","26","0",".201"]
["Andrew Romine","Sea - 1B,2B,3B,SS,OF","1289","74/318","45","4","25","6",".233"]
["Taylor Motter","Sea - 1B,2B,SS,OF","1330","51/258","29","7","26","12",".198"]
["John Hicks","Det - C,1B","1331","46/173","25","6","22","2",".266"]
["Trevor Plouffe","Tex - 1B,3B","1341","56/283","31","9","19","1",".198"]
["Ryan Rua","Tex - 1B,OF","1362","28/129","17","3","12","2",".217"]
["Jace Peterson","NYY - 1B,2B,3B,OF","1374","40/186","15","2","17","3",".215"]
["Jefry Marte","LAA - 1B,3B","1395","22/127","10","4","14","1",".173"]
["Rickie Weeks Jr.","TB - 1B","1400","21/97","13","2","8","1",".216"]
["Tyler White","Hou - 1B","1402","17/61","7","3","10","0",".279"]
["Austin Romine","NYY - C,1B","1408","50/229","19","2","21","0",".218"]
["Tyler Austin","NYY - 1B","1456","9/40","4","2","8","0",".225"]
["James Loney","Tex - 1B","1458","-/-","-","-","-","-","-"]
["Sam Travis","Bos - 1B","1468","20/76","13","0","1","1",".263"]
["Chris Johnson","Bal - 1B,3B","1529","-/-","-","-","-","-","-"]
["Richie Shaffer","Cle - 1B,3B","1568","-/-","-","-","-","-","-"]
["Brock Stassi","Min - 1B","1570","13/78","6","2","7","0",".167"]
["Lewin Díaz","Min - 1B","1637","-/-","-","-","-","-","-"]
["Brendan McKay","TB - 1B","1638","-/-","-","-","-","-","-"]
["Gavin Sheets","CWS - 1B","1664","-/-","-","-","-","-","-"]
["Daniel Palka","CWS - 1B,OF","1682","-/-","-","-","-","-","-"]
["Evan White","Sea - 1B","1704","-/-","-","-","-","-","-"]
["Bobby Bradley","Cle - 1B","1725","-/-","-","-","-","-","-"]
["Rowdy Tellez","Tor - 1B","1741","-/-","-","-","-","-","-"]
["Ryan O'Hearn","KC - 1B","1749","-/-","-","-","-","-","-"]
["Nick Pratto","KC - 1B","1756","-/-","-","-","-","-","-"]
["Ronald Guzman","Tex - 1B","1766","-/-","-","-","-","-","-"]
["Josh Ockimey","Bos - 1B","1800","-/-","-","-","-","-","-"]
["Jake Bauers","TB - 1B","1806","-/-","-","-","-","-","-"]
["Matt Thaiss","LAA - 1B","1818","-/-","-","-","-","-","-"]
["Casey Gillaspie","CWS - 1B","1824","-/-","-","-","-","-","-"]
["Daniel Vogelbach","Sea - 1B","1851","6/28","0","0","2","0",".214"]

{"sheet":"2nd Base","index":5,"n_rows":50,"n_cols":9,"rows_kept":50}
["Player","Team","Rank","H/AB","R","HR","RBI","SB","Avg."]
["Dee Gordon","Sea - 2B",36,"201/653","114","2","33","60",".308"]
["Ian Kinsler","LAA - 2B",143,"130/551","90","22","52","14",".236"]
["Jason Kipnis","Cle - 2B,OF",190,"78/336","43","12","35","6",".232"]
["Dustin Pedroia","Bos - 2B",220,"119/406","46","7","62","4",".293"]
["Neil Walker","NYY - 1B,2B ",255,"102/385","59","14","49","0",".265"]
["Devon Travis","Tor - 2B",307,"48/185","22","5","24","4",".259"]
["Jed Lowrie","Oak - 2B",329,"157/567","86","14","69","0",".277"]
["Adalberto Mondesi","KC - 2B",343,"9/53","4","1","3","5",".170"]
["Brandon Phillips","LAA - 2B,3B",362,"163/572","81","13","60","11",".285"]
["Eduardo Escobar","Min - 2B,3B,SS",449,"116/457","62","21","73","5",".254"]
["Yangervis Solarte","Tor - 2B,3B,SS",473,"119/466","49","18","64","3",".255"]
["Yolmer Sánchez","CWS - 2B,3B",541,"129/484","63","12","59","8",".267"]
["Brandon Drury","NYY - 2B",562,"119/445","41","13","63","1",".267"]
["Ronald Torreyes","NYY - 2B,3B,SS",1251,"92/315","35","3","36","2",".292"]
["Chad Pinder","Oak - 2B,SS,OF",1256,"67/282","36","15","42","2",".238"]
["Ryan Goins","KC - 2B,SS",1260,"99/418","37","9","62","3",".237"]
["Andrew Romine","Sea - 1B,2B,3B,SS,OF",1289,"74/318","45","4","25","6",".233"]
["Darwin Barney","Tex - 2B,3B,SS",1297,"78/336","34","6","25","7",".232"]
["Danny Espinosa","NYY - 2B",1314,"46/266","30","6","31","4",".173"]
["Taylor Motter","Sea - 1B,2B,SS,OF",1330,"51/258","29","7","26","12",".198"]
["Deven Marrero","Bos - 2B,3B",1339,"36/171","32","4","27","5",".211"]
["Alexi Amarista","Det - 2B,SS,OF",1364,"40/168","22","3","19","1",".238"]
["Jace Peterson","NYY - 1B,2B,3B,OF",1374,"40/186","15","2","17","3",".215"]
["Erik González","Cle - 2B,SS",1390,"28/110","18","4","11","1",".255"]
["Kaleb Cowart","LAA - 2B,3B",1393,"23/102","18","3","11","4",".225"]
["Brock Holt","Bos - 2B,3B,OF",1396,"28/140","20","0","7","2",".200"]
["Dixon Machado","Det - 2B,SS",1418,"43/166","17","1","11","1",".259"]
["Tyler Saladino","CWS - 2B,3B,SS",1420,"45/253","23","0","10","5",".178"]
["Daniel Robertson","TB - 2B,3B,SS",1421,"45/218","22","5","19","1",".206"]
["Brett Lawrie","CWS - 2B",1441,"-/-","-","-","-","-","-"]
["Matt Duffy","TB - 2B,3B",1444,"-/-","-","-","-","-","-"]
["Joey Wendle","TB - 2B",1463,"4/13","3","1","5","0",".308"]
["Taylor Featherston","Min - 2B",1490,"7/39","6","2","6","1",".179"]
["Gift Ngoepe","Tor - 2B",1492,"12/54","10","0","6","0",".222"]
["Ramón Torres","KC - 2B,3B",1493,"18/74","9","0","4","1",".243"]
["Tzu-Wei Lin","Bos - 2B,3B,SS",1496,"15/56","7","0","2","1",".268"]
["Rob Refsnyder","Cle - 2B,OF",1515,"15/88","8","0","0","4",".170"]
["Travis Blankenhorn","Min - 2B",1628,"-/-","-","-","-","-","-"]
["Willi Castro","Cle - 2B,SS",1667,"-/-","-","-","-","-","-"]
["Nick Solak","TB - 2B",1778,"-/-","-","-","-","-","-"]
["Jonathan Arauz","Hou - 2B,SS",1792,"-/-","-","-","-","-","-"]
["Andy Ibanez","Tex - 2B",1794,"-/-","-","-","-","-","-"]
["Max Schrock","Oak - 2B",1799,"-/-","-","-","-","-","-"]
["Tyler Wade","NYY - 2B",1835,"9/58","7","0","2","1",".155"]
["Hanser Alberto","Tex - 2B,SS",1837,"-/-","-","-","-","-","-"]
["Michael Martínez","Cle - 2B",1842,"6/37","2","0","0","0",".162"]
["Nolan Fontana","LAA - 2B",1847,"1/20","1","1","1","1",".050"]
["Steve Lombardozzi","Oak - 2B",1866,"0/8","0","0","0","0",".000"]
["Niko Goodrum","Det - 2B",1868,"1/17","1","0","0","0",".059"]

{"sheet":"3rd Base","index":6,"n_rows":54,"n_cols":9,"rows_kept":54}
["Player","Team","Rank","H/AB","R","HR","RBI","SB","Avg."]
["Manny Machado","Bal - 3B",22,"163/630","81","33","95","9",".259"]
["Josh Donaldson","Tor - 3B",30,"112/415","65","33","78","2",".270"]
["Adrián Béltre","Tex - 3B",96,"106/340","47","17","71","1",".312"]
["Kyle Seager","Sea - 3B",102,"144/578","72","27","88","2",".249"]
["Matt Chapman","Oak - 3B",252,"68/290","39","14","40","0",".234"]
["Russell Martin","Tor - C,3B",290,"68/307","49","13","35","1",".221"]
["Brandon Phillips","LAA - 2B,3B",362,"163/572","81","13","60","11",".285"]
["Eduardo Escobar","Min - 2B,3B,SS",449,"116/457","62","21","73","5",".254"]
["Yangervis Solarte","Tor - 2B,3B,SS",473,"119/466","49","18","64","3",".255"]
["Yolmer Sánchez","CWS - 2B,3B",541,"129/484","63","12","59","8",".267"]
["Brandon Drury","NYY - 2B",563,"102/385","59","14","49","0",".265"]
["Luis Valbuena","LAA - 1B,3B",1144,"69/347","42","22","65","0",".199"]
["Yunel Escobar","LAA - 3B",1157,"96/350","43","7","31","1",".274"]
["Ronald Torreyes","NYY - 2B,3B,SS",1251,"92/315","35","3","36","2",".292"]
["Andrew Romine","Sea - 1B,2B,3B,SS,OF",1289,"74/318","45","4","25","6",".233"]
["Darwin Barney","Tex - 2B,3B,SS",1297,"78/336","34","6","25","7",".232"]
["Ehire Adrianza","Min - 3B,SS,OF",1300,"43/162","30","2","24","8",".265"]
["Ryan Schimpf","Atl - 3B",1306,"26/165","24","14","25","0",".158"]
["Deven Marrero","Bos - 2B,3B",1339,"36/171","32","4","27","5",".211"]
["Trevor Plouffe","Tex - 1B,3B",1341,"56/283","31","9","19","1",".198"]
["Cheslor Cuthbert","KC - 3B",1358,"33/143","10","2","18","0",".231"]
["Jace Peterson","NYY - 1B,2B,3B,OF",1374,"40/186","15","2","17","3",".215"]
["Yandy Díaz","Cle - 3B",1377,"41/156","25","0","13","2",".263"]
["Kaleb Cowart","LAA - 2B,3B",1393,"23/102","18","3","11","4",".225"]
["Jefry Marte","LAA - 1B,3B",1395,"22/127","10","4","14","1",".173"]
["Brock Holt","Bos - 2B,3B,OF",1396,"28/140","20","0","7","2",".200"]
["Tyler Saladino","CWS - 2B,3B,SS",1420,"45/253","23","0","10","5",".178"]
["Daniel Robertson","TB - 2B,3B,SS",1421,"45/218","22","5","19","1",".206"]
["Drew Robinson","Tex - 3B,OF",1423,"24/107","11","6","13","0",".224"]
["Matt Duffy","TB - 2B,3B",1444,"-/-","-","-","-","-","-"]
["J.D. Davis","Hou - 3B",1447,"14/62","8","4","7","1",".226"]
["Giovanny Urshela","Cle - 3B",1462,"35/156","14","1","15","0",".224"]
["Marco Hernández","Bos - 3B,SS",1474,"16/58","7","0","2","0",".276"]
["Chris Coghlan","Tor - 3B,OF",1480,"15/75","7","1","5","0",".200"]
["Christian Arroyo","TB - 3B,SS",1489,"24/125","9","3","14","1",".192"]
["Ramón Torres","KC - 2B,3B",1493,"18/74","9","0","4","1",".243"]
["Tzu-Wei Lin","Bos - 2B,3B,SS",1496,"15/56","7","0","2","1",".268"]
["Miguel Andújar","NYY - 3B",1508,"4/7","0","0","4","1",".571"]
["Chris Johnson","Bal - 1B,3B",1529,"-/-","-","-","-","-","-"]
["Steve Selsky","Bos - 3B",1553,"1/9","0","0","0","0",".111"]
["Richie Shaffer","Cle - 1B,3B",1568,"-/-","-","-","-","-","-"]
["Hunter Dozier","KC - 3B",1591,"-/-","-","-","-","-","-"]
["Josh Lowe","TB - 3B",1609,"-/-","-","-","-","-","-"]
["Jomar Reyes","Bal - 3B",1630,"-/-","-","-","-","-","-"]
["Vladimir Guerrero Jr.","Tor - 3B",1650,"-/-","-","-","-","-","-"]
["Nolan Jones","Cle - 3B",1659,"-/-","-","-","-","-","-"]
["Sheldon Neuse","Oak - 3B",1720,"-/-","-","-","-","-","-"]
["Joe Rizzo","Sea - 3B",1722,"-/-","-","-","-","-","-"]
["Michael Chavis","Bos - 3B",1733,"-/-","-","-","-","-","-"]
["Dawel Lugo","Det - 3B,SS",1746,"-/-","-","-","-","-","-"]
["Trey Michalczewski","CWS - 3B",1790,"-/-","-","-","-","-","-"]
["Jake Burger","CWS - 3B",1815,"-/-","-","-","-","-","-"]
["Pete Kozma","Det - 3B,SS",1854,"5/45","6","1","2","0",".111"]

{"sheet":"Short Stop","index":7,"n_rows":59,"n_cols":9,"rows_kept":59}
["Player","Team","Rank","H/AB","R","HR","RBI","SB","Avg."]
["Elvis Andrus","Tex - SS",60,"191/643","100","20","88","25",".297"]
["Jean Segura","Sea - SS",90,"157/524","80","11","45","22",".300"]
["Andrelton Simmons","LAA - SS",198,"164/589","77","14","69","19",".278"]
["Zack Cozart","LAA - SS",225,"130/438","80","24","63","3",".297"]
["Jorge Polanco","Min - SS",267,"125/488","60","13","74","13",".256"]
["Eduardo Escobar","Min - 2B,3B,SS",449,"116/457","62","21","73","5",".254"]
["Yangervis Solarte","Tor - 2B,3B,SS",473,"119/466","49","18","64","3",".255"]
["Alcides Escobar","KC - SS",609,"150/599","71","6","54","4",".250"]
["José Iglesias","Det - SS",979,"118/463","56","6","54","7",".255"]
["Aledmys Díaz","Tor - SS",1219,"74/286","31","7","20","4",".259"]
["Adeiny Hechavarria","TB - SS",1250,"86/330","37","8","30","4",".261"]
["Ronald Torreyes","NYY - 2B,3B,SS",1251,"92/315","35","3","36","2",".292"]
["Chad Pinder","Oak - 2B,SS,OF",1256,"67/282","36","15","42","2",".238"]
["Ryan Goins","KC - 2B,SS",1260,"99/418","37","9","62","3",".237"]
["Erick Aybar","Min - SS",1273,"78/333","37","7","22","11",".234"]
["Troy Tulowitzki","Tor - SS",1282,"60/241","16","7","26","0",".249"]
["Andrew Romine","Sea - 1B,2B,3B,SS,OF",1289,"74/318","45","4","25","6",".233"]
["Darwin Barney","Tex - 2B,3B,SS",1297,"78/336","34","6","25","7",".232"]
["Ehire Adrianza","Min - 3B,SS,OF",1300,"43/162","30","2","24","8",".265"]
["Taylor Motter","Sea - 1B,2B,SS,OF",1330,"51/258","29","7","26","12",".198"]
["J.J. Hardy","Bal - SS",1344,"55/254","24","4","24","0",".217"]
["Alexi Amarista","Det - 2B,SS,OF",1364,"40/168","22","3","19","1",".238"]
["Erik González","Cle - 2B,SS",1390,"28/110","18","4","11","1",".255"]
["Dixon Machado","Det - 2B,SS",1418,"43/166","17","1","11","1",".259"]
["Tyler Saladino","CWS - 2B,3B,SS",1420,"45/253","23","0","10","5",".178"]
["Daniel Robertson","TB - 2B,3B,SS",1421,"45/218","22","5","19","1",".206"]
["Marco Hernández","Bos - 3B,SS",1474,"16/58","7","0","2","0",".276"]
["Rubén Tejada","Bal - SS",1475,"26/113","17","0","5","0",".230"]
["Christian Arroyo","TB - 3B,SS",1489,"24/125","9","3","14","1",".192"]
["Tzu-Wei Lin","Bos - 2B,3B,SS",1496,"15/56","7","0","2","1",".268"]
["Richard Ureña","Tor - SS",1537,"14/68","6","1","4","1",".206"]
["Royce Lewis","Min - SS",1613,"-/-","-","-","-","-","-"]
["Lucius Fox","TB - SS",1615,"-/-","-","-","-","-","-"]
["Andrew Velazquez","TB - SS",1618,"-/-","-","-","-","-","-"]
["Thairo Estrada","NYY - SS",1647,"-/-","-","-","-","-","-"]
["Willi Castro","Cle - 2B,SS",1667,"-/-","-","-","-","-","-"]
["Richie Martin","Oak - SS",1671,"-/-","-","-","-","-","-"]
["Miguelangel Sierra","Hou - SS",1675,"-/-","-","-","-","-","-"]
["Éngelb Vielma","Bal - SS",1686,"-/-","-","-","-","-","-"]
["Logan Warmoth","Tor - SS",1695,"-/-","-","-","-","-","-"]
["Roberto Baldoquín","LAA - SS",1711,"-/-","-","-","-","-","-"]
["Nonie Williams","LAA - SS",1712,"-/-","-","-","-","-","-"]
["Ryan Mountcastle","Bal - SS",1717,"-/-","-","-","-","-","-"]
["Isaac Paredes","Det - SS",1742,"-/-","-","-","-","-","-"]
["Dawel Lugo","Det - 3B,SS",1746,"-/-","-","-","-","-","-"]
["Bo Bichette","Tor - SS",1747,"-/-","-","-","-","-","-"]
["Nick Gordon","Min - SS",1748,"-/-","-","-","-","-","-"]
["Chris Seise","Tex - SS",1769,"-/-","-","-","-","-","-"]
["Wander Javier","Min - SS",1774,"-/-","-","-","-","-","-"]
["Carlos Vargas","TB - SS",1788,"-/-","-","-","-","-","-"]
["Jonathan Arauz","Hou - 2B,SS",1792,"-/-","-","-","-","-","-"]
["Yu Chang","Cle - SS",1798,"-/-","-","-","-","-","-"]
["Jorge Mateo","Oak - SS",1808,"-/-","-","-","-","-","-"]
["David Fletcher","LAA - SS",1810,"-/-","-","-","-","-","-"]
["Brendan Ryan","Det - SS",1834,"-/-","-","-","-","-","-"]
["Hanser Alberto","Tex - 2B,SS",1837,"-/-","-","-","-","-","-"]
["José Rondón","CWS - SS",1838,"-/-","-","-","-","-","-"]
["Pete Kozma","Det - 3B,SS",1854,"5/45","6","1","2","0",".111"]

{"sheet":"Outfield","index":8,"n_rows":155,"n_cols":9,"rows_kept":155}
["Player","Team","Rank","H/AB","R","HR","RBI","SB","Avg."]
["Giancarlo Stanton","NYY - OF",10,"168/597","123","59","132","2",".281"]
["J.D. Martinez","Bos - OF",16,"131/432","85","45","104","4",".303"]
["George Springer","Hou - OF",23,"155/548","112","34","85","5",".283"]
["Nelson Cruz","Sea - OF",37,"160/556","91","39","119","1",".288"]
["Khris Davis","Oak - OF",65,"140/566","91","43","110","4",".247"]
["Adam Jones","Bal - OF",94,"170/597","82","26","73","2",".285"]
["Eddie Rosario","Min - OF",137,"157/542","79","27","78","9",".290"]
["Avisaíl García","CWS - OF",166,"171/518","75","18","80","5",".330"]
["Jason Kipnis","Cle - 2B,OF",190,"78/336","43","12","35","6",".232"]
["Aaron Hicks","NYY - OF",213,"80/301","54","15","52","10",".266"]
["Shin-soo Choo","Tex - OF",214,"142/544","96","22","78","12",".261"]
["Max Kepler","Min - OF",234,"124/511","67","19","69","6",".243"]
["Stephen Piscotty","Oak - OF",239,"80/341","40","9","39","3",".235"]
["Michael Brantley","Cle - OF",241,"101/338","47","9","52","11",".299"]
["Kole Calhoun","LAA - OF",247,"139/569","77","19","71","5",".244"]
["Mallex Smith","TB - OF",258,"69/256","33","2","12","16",".270"]
["Willie Calhoun","Tex - OF",266,"9/34","3","1","4","0",".265"]
["José Bautista","Tor - OF",304,"119/587","92","23","65","6",".203"]
["Teoscar Hernández","Tor - OF",319,"23/88","16","8","20","0",".261"]
["Carlos Gómez","TB - OF",326,"94/368","51","17","51","13",".255"]
["Melky Cabrera","KC - OF",341,"177/620","78","17","85","1",".285"]
["Randal Grichuk","Tor - OF",346,"98/412","53","22","59","6",".238"]
["Matt Joyce","Oak - OF",402,"114/469","78","25","68","4",".243"]
["Denard Span","TB - OF",407,"135/497","73","12","43","12",".272"]
["Jacoby Ellsbury","NYY - OF",412,"94/356","65","7","39","22",".264"]
["Curtis Granderson","Tor - OF",415,"95/449","74","26","64","6",".212"]
["Danny Valencia","Bal - 1B,OF",468,"115/450","54","15","66","2",".256"]
["Rajai Davis","Cle - OF",483,"79/336","56","5","20","29",".235"]
["Adam Lind","NYY - 1B,OF",506,"81/267","39","14","59","1",".303"]
["Ben Gamel","Sea - OF",552,"140/509","68","11","59","4",".275"]
["Jon Jay","KC - OF",600,"12/379","65","2","34","6",".296"]
["Lonnie Chisenhall","Cle - OF",639,"68/236","34","12","53","2",".288"]
["Robbie Grossman","Min - OF",1005,"94/382","62","9","45","3",".246"]
["Jake Marisnick","Hou - OF",1042,"56/230","50","16","35","9",".243"]
["Seth Smith","Bal - OF",1053,"85/330","50","13","32","2",".258"]
["Mikie Mahtook","Det - OF",1131,"96/348","50","12","38","6",".276"]
["Ezequiel Carrera","Tor - OF",1184,"81/287","38","8","20","10",".282"]
["Jorge Bonifacio","KC - OF",1185,"98/384","55","17","40","1",".255"]
["Steve Pearce","Tor - 1B,OF",1214,"79/313","38","13","37","0",".252"]
["Leury García","CWS - OF",1225,"81/300","41","9","33","8",".270"]
["Alex Gordon","KC - OF",1246,"99/476","52","9","45","7",".208"]
["Chad Pinder","Oak - 2B,SS,OF",1256,"67/282","36","15","42","2",".238"]
["Alex Presley","Bal - OF",1271,"77/245","30","3","20","5",".314"]
["Colby Rasmus","Bal - OF",1286,"34/121","17","9","23","1",".281"]
["Andrew Romine","Sea - 1B,2B,3B,SS,OF",1289,"74/318","45","4","25","6",".233"]
["Chris Young","LAA - OF",1291,"57/243","30","7","25","3",".235"]
["Ehire Adrianza","Min - 3B,SS,OF",1300,"43/162","30","2","24","8",".265"]
["Joey Rickard","Bal - OF",1301,"63/261","29","4","19","8",".241"]
["Eric Young Jr.","LAA - OF",1304,"29/110","24","4","16","12",".264"]
["Guillermo Heredia","Sea - OF",1307,"96/386","43","6","24","1",".249"]
["Michael Saunders","KC - OF",1310,"44/218","26","6","21","0",".202"]
["Nicky Delmonico","CWS - OF",1313,"37/141","25","9","23","2",".262"]
["Brandon Guyer","Cle - OF",1329,"39/165","23","2","20","2",".236"]
["Taylor Motter","Sea - 1B,2B,SS,OF",1330,"51/258","29","7","26","12",".198"]
["Leonys Martin","Det - OF",1332,"22/128","14","3","9","7",".172"]
["Abraham Almonte","Cle - OF",1348,"40/172","26","3","14","2",".233"]
["Ryan Rua","Tex - 1B,OF",1362,"28/129","17","3","12","2",".217"]
["Alexi Amarista","Det - 2B,SS,OF",1364,"40/168","22","3","19","1",".238"]
["Paulo Orlando","KC - OF",1366,"17/86","9","2","6","1",".198"]
["Boog Powell","Oak - OF",1367,"33/117","24","3","12","0",".282"]
["Melvin Upton Jr.","Cle - OF",1369,"-/-","-","-","-","-","-"]
["Jace Peterson","NYY - 1B,2B,3B,OF",1374,"40/186","15","2","17","3",".215"]
["Craig Gentry","Bal - OF",1381,"26/101","17","2","11","5",".257"]
["Derek Fisher","Hou - OF",1384,"31/146","21","5","17","3",".212"]
["Jabari Blash","LAA - OF",1391,"35/164","24","5","16","1",".213"]
["Tyler Naquin","Cle - OF",1392,"8/37","4","0","1","0",".216"]
["Brock Holt","Bos - 2B,3B,OF",1396,"28/140","20","0","7","2",".200"]
["Jaycob Brugman","Bal - OF",1411,"38/143","12","3","12","1",".266"]
["Michael Bourn","Bal - OF",1415,"-/-","-","-","-","-","-"]
["Tyler Collins","KC - OF",1416,"29/150","18","5","14","0",".193"]
["Zack Granite","Min - OF",1419,"22/93","14","1","13","2",".237"]
["Adam Engel","CWS - OF",1422,"50/301","34","6","21","8",".166"]
["Drew Robinson","Tex - 3B,OF",1423,"24/107","11","6","13","0",".224"]
["Mark Canha","Oak - OF",1426,"36/173","16","5","14","2",".208"]
["Willy García","CWS - OF",1430,"25/105","15","2","12","0",".238"]
["Jim Adduci","Det - OF",1436,"20/83","14","1","10","1",".241"]
["JaCoby Jones","Det - OF",1448,"24/141","14","3","13","6",".170"]
["Kirk Nieuwenhuis","Sea - OF",1454,"3/26","3","1","1","0",".115"]
["Jurickson Profar","Tex - OF",1461,"10/58","8","0","5","1",".172"]
["Billy Burns","KC - OF",1470,"1/6","1","0","0","0",".167"]
["Greg Allen","Cle - OF",1476,"8/35","7","1","6","1",".229"]
["Brett Eibner","Tex - OF",1478,"6/33","3","2","6","0",".182"]
["Chris Coghlan","Tor - 3B,OF",1480,"15/75","7","1","5","0",".200"]
["Jorge Soler","KC - OF",1482,"14/97","7","2","6","0",".144"]
["Jake Smolinski","Oak - OF",1486,"7/27","1","0","0","0",".259"]
["Tony Kemp","Hou - OF",1487,"8/37","6","0","4","1",".216"]
["Shane Robinson","NYY - OF",1488,"6/31","7","0","1","2",".194"]
["Rymer Liriano","LAA - OF",1500,"9/41","4","1","6","1",".220"]
["Chris Heisey","Min - OF",1502,"12/74","8","1","5","0",".162"]
["Dwight Smith Jr.","Tor - OF",1505,"10/27","2","0","1","1",".370"]
["Rob Refsnyder","Cle - 2B,OF",1515,"15/88","8","0","0","4",".170"]
["Darrell Ceciliani","Tor - OF",1532,"2/5","2","1","3","0",".400"]
["Cameron Perkins","Sea - OF",1543,"16/88","9","1","8","0",".182"]
["Chad Huffman","Det - OF",1551,"4/14","3","0","0","0",".286"]
["Renato Núñez","Oak - OF",1555,"3/15","1","1","3","0",".200"]
["Micah Johnson","TB - OF",1558,"2/10","2","0","0","1",".200"]
["Anthony Santander","Bal - OF",1565,"8/30","1","0","2","0",".267"]
["Jason Coats","TB - OF",1566,"-/-","-","-","-","-","-"]
["Drew Stubbs","Tex - OF",1580,"2/22","0","0","0","0",".091"]
["Dalton Pompey","Tor - OF",1582,"-/-","-","-","-","-","-"]
["Destin Hood","Tex - OF",1583,"-/-","-","-","-","-","-"]
["Rusney Castillo","Bos - OF",1590,"-/-","-","-","-","-","-"]
["Charlie Tilson","CWS - OF",1601,"-/-","-","-","-","-","-"]
["Dariel Álvarez","Bal - OF",1602,"-/-","-","-","-","-","-"]
["Michael Gigliotti","KC - OF",1607,"-/-","-","-","-","-","-"]
["Jose Azocar","Det - OF",1611,"-/-","-","-","-","-","-"]
["Justin Williams","TB - OF",1623,"-/-","-","-","-","-","-"]
["Lazaro Armenteros","Oak - OF",1626,"-/-","-","-","-","-","-"]
["Jo Adell","LAA - OF",1631,"-/-","-","-","-","-","-"]
["Victor Reyes","Det - OF",1635,"-/-","-","-","-","-","-"]
["Lourdes Gurriel","Tor - OF",1639,"-/-","-","-","-","-","-"]
["Bubba Thompson","Tex - OF",1640,"-/-","-","-","-","-","-"]
["Michael Hermosillo","LAA - OF",1642,"-/-","-","-","-","-","-"]
["Mike Gerber","Det - OF",1652,"-/-","-","-","-","-","-"]
["Blake Rutherford","NYY - OF",1674,"-/-","-","-","-","-","-"]
["Austin Beck","Oak - OF",1680,"-/-","-","-","-","-","-"]
["Daniel Palka","CWS - 1B,OF",1682,"-/-","-","-","-","-","-"]
["Travis Snider","Tex - OF",1685,"-/-","-","-","-","-","-"]
["Harold Ramírez","Tor - OF",1688,"-/-","-","-","-","-","-"]
["Akil Baddoo","Min - OF",1689,"-/-","-","-","-","-","-"]
["Donnie Dewees","KC - OF",1694,"-/-","-","-","-","-","-"]
["Jahmai Jones","LAA - OF",1698,"-/-","-","-","-","-","-"]
["Will Benson","Cle - OF",1709,"-/-","-","-","-","-","-"]
["Cedric Mullins","Bal - OF",1710,"-/-","-","-","-","-","-"]
["Eloy Jiménez","CWS - OF",1715,"-/-","-","-","-","-","-"]
["Mike Yastrzemski","Bal - OF",1716,"-/-","-","-","-","-","-"]
["Leody Taveras","Tex - OF",1718,"-/-","-","-","-","-","-"]
["Yordan Álvarez","Hou - OF",1719,"-/-","-","-","-","-","-"]
["Luis Robert","CWS - OF",1721,"-/-","-","-","-","-","-"]
["Miguel Aparicio","Tex - OF",1727,"-/-","-","-","-","-","-"]
["Kyle Lewis","Sea - OF",1732,"-/-","-","-","-","-","-"]
["James Ramsey","Min - OF",1743,"-/-","-","-","-","-","-"]
["Alex Kirilloff","Min - OF",1750,"-/-","-","-","-","-","-"]
["Khalil Lee","KC - OF",1753,"-/-","-","-","-","-","-"]
["Jesús Sánchez","TB - OF",1758,"-/-","-","-","-","-","-"]
["Luis Basabe","CWS - OF",1765,"-/-","-","-","-","-","-"]
["Garrett Whitley","TB - OF",1767,"-/-","-","-","-","-","-"]
["Ryan Cordell","CWS - OF",1770,"-/-","-","-","-","-","-"]
["Christin Stewart","Det - OF",1779,"-/-","-","-","-","-","-"]
["Bubba Starling","KC - OF",1780,"-/-","-","-","-","-","-"]
["Conner Capel","Cle - OF",1781,"-/-","-","-","-","-","-"]
["Brent Rooker","Min - OF",1782,"-/-","-","-","-","-","-"]
["Brandon Marsh","LAA - OF",1801,"-/-","-","-","-","-","-"]
["Estevan Florial","NYY - OF",1802,"-/-","-","-","-","-","-"]
["Elier Hernandez","KC - OF",1807,"-/-","-","-","-","-","-"]
["Billy McKinney","NYY - OF",1812,"-/-","-","-","-","-","-"]
["Seuly Matias","KC - OF",1819,"-/-","-","-","-","-","-"]
["Eric Jenkins","Tex - OF",1822,"-/-","-","-","-","-","-"]
["Daz Cameron","Det - OF",1826,"-/-","-","-","-","-","-"]
["Ian Parmley","Tor - OF",1840,"0/3","0","0","0","0",".000"]
["Anthony Alford","Tor - OF",1849,"1/8","0","0","0","0",".125"]
["David Washington","Bal - OF",1856,"0/6","0","0","0","0",".000"]
["Ryan LaMarre","Min - OF",1865,"0/7","0","0","0","0",".000"]
["Jacob May","CWS - OF",1873,"2/36","2","0","3","0",".056"]

{"sheet":"DH","index":9,"n_rows":2,"n_cols":9,"rows_kept":2}
["Player","Team","Rank","H/AB","R","HR","RBI","SB","Avg."]
["Victor Martinez","Det - Uti","342","100/392","38","10","47","0",".255"]

{"sheet":"Pitchers","index":10,"n_rows":214,"n_cols":9,"rows_kept":214}
["Player","Team","Rank","IP","W","S","K","ERA","WHIP"]
["Corey Kluber","Cle - SP",14,"203.2","18","0","265","2.25","0.87"]
["Luis Severino","NYY - SP",47,"193.1","14","0","230","2.98","1.04"]
["Chris Archer","TB - SP",67,"201.0","10","0","249","4.07","1.26"]
["Gerrit Cole","Hou - SP",78,"203.0","12","0","196","4.26","1.25"]
["Lance McCullers Jr.","Hou - SP",91,"118.2","7","0","132","4.25","1.30"]
["Masahiro Tanaka","NYY - SP",93,"178.1","13","0","194","4.74","1.24"]
["Shohei Ohtani (Pitcher)","LAA - SP",95,"-","-","-","-","-","-"]
["Marcus Stroman","Tor - SP",129,"201.0","13","0","164","3.09","1.31"]
["Danny Salazar","Cle - SP",161,"103.0","5","0","145","4.28","1.34"]
["Garrett Richards","LAA - SP",186,"27.2","0","0","27","2.28","0.90"]
["Drew Pomeranz","Bos - SP",192,"173.2","17","0","174","3.32","1.35"]
["Lance Lynn","Min - SP",233,"186.1","11","0","153","3.43","1.23"]
["Jake Odorizzi","Min - SP",248,"143.1","10","0","127","4.14","1.24"]
["Félix Hernández","Sea - SP",260,"86.2","6","0","78","4.36","1.29"]
["Matt Shoemaker","LAA - SP",286,"77.2","6","0","69","4.52","1.30"]
["Eduardo Rodríguez","Bos - SP",292,"137.1","6","0","150","4.19","1.28"]
["Marco Estrada","Tor - SP",299,"186.0","10","0","176","4.98","1.38"]
["Daniel Mengden","Oak - SP",331,"43.0","3","0","29","3.14","1.05"]
["Andrew Heaney","LAA - SP",354,"21.2","1","0","27","7.06","1.66"]
["Parker Bridwell","LAA - SP",398,"121.0","10","0","73","3.64","1.20"]
["Mike Leake","Sea - SP",434,"186.0","10","0","130","3.92","1.28"]
["Erasmo Ramírez","Sea - SP,RP",436,"131.1","5","1","109","4.39","1.17"]
["Jakob Junis","KC - SP",448,"98.1","9","0","80","4.30","1.28"]
["Andrew Cashner","Bal - SP",451,"166.2","11","0","86","3.40","1.32"]
["J.C. Ramírez","LAA - SP",455,"147.1","11","0","105","4.15","1.34"]
["Michael Pineda","Min - SP",459,"96.1","8","0","92","4.39","1.29"]
["Tyler Thornburg","Bos - SP,RP",465,"-","-","-","-","-","-"]
["Josh Tomlin","Cle - SP",488,"141.0","10","0","109","4.98","1.28"]
["Hector Velázquez","Bos - SP,RP",489,"24.2","3","0","19","2.92","1.14"]
["Alex Meyer","LAA - SP",497,"67.1","4","0","75","3.74","1.34"]
["Paul Blackburn","Oak - SP",521,"58.2","3","0","22","3.22","1.26"]
["Matt Andriese","TB - SP",523,"86.0","5","1","76","4.50","1.37"]
["Ryan Merritt","Cle - SP",524,"20.2","2","0","7","1.74","1.45"]
["Andrew Triggs","Oak - SP",526,"65.1","5","0","50","4.27","1.33"]
["Nate Karns","KC - SP",531,"45.1","2","0","51","4.17","1.19"]
["Troy Scribner","LAA - SP,RP",548,"23.2","2","0","18","4.18","1.14"]
["Carson Fulmer","CWS - SP",554,"23.1","3","0","19","3.86","1.24"]
["Ariel Miranda","Sea - SP",563,"160.0","8","0","137","5.12","1.27"]
["Dillon Gee","Min - SP,RP",566,"49.1","3","1","41","3.47","1.40"]
["Kendall Graveman","Oak - SP",583,"105.1","6","0","70","4.19","1.39"]
["Luke Hochevar","KC - SP,RP",598,"-","-","-","-","-","-"]
["Gavin Floyd","Tor - SP,RP",606,"-","-","-","-","-","-"]
["Hisashi Iwakuma","Sea - SP",607,"31.0","0","0","16","4.35","1.26"]
["Tyler Danish","CWS - SP",615,"5.0","1","0","6","0.00","1.80"]
["Eddie Gamboa","Bal - SP,RP",640,"-","-","-","-","-","-"]
["Carlos Frías","Cle - SP,RP",650,"-","-","-","-","-","-"]
["Nick Tropeano","LAA - SP,RP",654,"-","-","-","-","-","-"]
["Sam Gaviglio","KC - SP",655,"74.1","4","0","49","4.36","1.37"]
["Nathan Eovaldi","TB - SP",656,"-","-","-","-","-","-"]
["Brian Johnson","Bos - SP",662,"27.0","2","0","21","4.33","1.48"]
["Reynaldo López","CWS - SP",668,"47.2","3","0","30","4.72","1.32"]
["Gabriel Ynoa","Bal - SP,RP",670,"34.2","2","0","26","4.15","1.36"]
["Gregory Soto","Det - SP",671,"-","-","-","-","-","-"]
["Sean Reid-Foley ","Tor - SP",673,"-","-","-","-","-","-"]
["Clayton Blackburn","Tex - SP",677,"-","-","-","-","-","-"]
["Nate Pearson","Tor - SP",680,"-","-","-","-","-","-"]
["Ariel Jurado","Tex - SP",684,"-","-","-","-","-","-"]
["Bryan Mata","Bos - SP",687,"-","-","-","-","-","-"]
["Nolan Watson","KC - SP",690,"-","-","-","-","-","-"]
["Matthias Dietz","Bal - SP",693,"-","-","-","-","-","-"]
["Nate Smith","LAA - SP",695,"-","-","-","-","-","-"]
["Justus Sheffield","NYY - SP",696,"-","-","-","-","-","-"]
["Spencer Adams","CWS - SP",704,"-","-","-","-","-","-"]
["Austin Franklin","TB - SP",706,"-","-","-","-","-","-"]
["Grayson Long","LAA - SP",708,"-","-","-","-","-","-"]
["Brady Aiken","Cle - SP",711,"-","-","-","-","-","-"]
["Trey Ball","Bos - SP",712,"-","-","-","-","-","-"]
["Jake Thompson","Bos - SP",714,"-","-","-","-","-","-"]
["A.J. Puckett","KC - SP",718,"-","-","-","-","-","-"]
["Richard Lovelady","KC - SP",721,"-","-","-","-","-","-"]
["Darwinzon Hernandez","Bos - SP",722,"-","-","-","-","-","-"]
["Kyle Funkhouser","Det - SP",726,"-","-","-","-","-","-"]
["Jaime Barria","LAA - SP",727,"-","-","-","-","-","-"]
["Travis Lakins","Bos - SP",728,"-","-","-","-","-","-"]
["Scott Blewett","KC - SP",729,"-","-","-","-","-","-"]
["Connor Sadzeck","Tex - SP",730,"-","-","-","-","-","-"]
["Kohl Stewart","Min - SP",733,"-","-","-","-","-","-"]
["A.J. Puk","Oak - SP",734,"-","-","-","-","-","-"]
["Freicer Pérez","NYY - SP",735,"-","-","-","-","-","-"]
["J.B. Bukauskas","Hou - SP",737,"-","-","-","-","-","-"]
["Fernando Romero","Min - SP",742,"-","-","-","-","-","-"]
["Dane Dunning","CWS - SP",745,"-","-","-","-","-","-"]
["Cody Sedlock","Bal - SP",749,"-","-","-","-","-","-"]
["Ryan Borucki","Tor - SP",750,"-","-","-","-","-","-"]
["Tyler Alexander","Det - SP",754,"-","-","-","-","-","-"]
["Mike Shawaryn","Bos - SP",755,"-","-","-","-","-","-"]
["Brad Keller","KC - SP",756,"-","-","-","-","-","-"]
["Brett Martin","Tex - SP",757,"-","-","-","-","-","-"]
["Ryan Yarbrough","TB - SP",758,"-","-","-","-","-","-"]
["Chris Rodríguez","LAA - SP",760,"-","-","-","-","-","-"]
["Jason Groome","Bos - SP",761,"-","-","-","-","-","-"]
["Kyle Cody","Tex - SP",765,"-","-","-","-","-","-"]
["Ashe Russell","KC - SP",766,"-","-","-","-","-","-"]
["Hunter Harvey","Bal - SP",768,"-","-","-","-","-","-"]
["Joe Gatto","LAA - SP",769,"-","-","-","-","-","-"]
["Cionel Pérez","Hou - SP",772,"-","-","-","-","-","-"]
["Kevin Gadea","TB - SP",775,"-","-","-","-","-","-"]
["Tanner Houck","Bos - SP",776,"-","-","-","-","-","-"]
["Taylor Guerrieri","Tor - SP",777,"-","-","-","-","-","-"]
["Norge Ruiz","Oak - SP",778,"-","-","-","-","-","-"]
["Hans Crouse","Tex - SP",782,"-","-","-","-","-","-"]
["Chance Adams","NYY - SP",784,"-","-","-","-","-","-"]
["Shane Bieber","Cle - SP",786,"-","-","-","-","-","-"]
["Jon Harris","Tor - SP",787,"-","-","-","-","-","-"]
["DL Hall","Bal - SP",789,"-","-","-","-","-","-"]
["Keegan Akin","Bal - SP",792,"-","-","-","-","-","-"]
["Albert Abreu","NYY - SP",793,"-","-","-","-","-","-"]
["Dylan Cease","CWS - SP",794,"-","-","-","-","-","-"]
["Rob Kaminsky","Cle - SP",797,"-","-","-","-","-","-"]
["Forrest Whitley","Hou - SP",798,"-","-","-","-","-","-"]
["Dillon Tate","NYY - SP",802,"-","-","-","-","-","-"]
["Matt Manning","Det - SP",803,"-","-","-","-","-","-"]
["Stephen Gonsalves","Min - SP",808,"-","-","-","-","-","-"]
["Aaron Civale","Cle - SP",817,"-","-","-","-","-","-"]
["Alec Hansen","CWS - SP",820,"-","-","-","-","-","-"]
["Triston McKenzie","Cle - SP",821,"-","-","-","-","-","-"]
["Jalen Beeks","Bos - SP",822,"-","-","-","-","-","-"]
["Dakota Chalmers","Oak - SP",824,"-","-","-","-","-","-"]
["Josh Staumont","KC - SP",826,"-","-","-","-","-","-"]
["Griffin Canning","LAA - SP",827,"-","-","-","-","-","-"]
["T.J. Zeuch","Tor - SP",832,"-","-","-","-","-","-"]
["Grant Holmes","Oak - SP",833,"-","-","-","-","-","-"]
["David Hess","Bal - SP",834,"-","-","-","-","-","-"]
["Alex Speas","Tex - SP",835,"-","-","-","-","-","-"]
["Burch Smith","KC - SP,RP",838,"-","-","-","-","-","-"]
["Kyle Zimmer","KC - SP",841,"-","-","-","-","-","-"]
["Brent Honeywell","TB - SP",844,"-","-","-","-","-","-"]
["Beau Burrows","Det - SP",849,"-","-","-","-","-","-"]
["Tim Cooney","Cle - SP",852,"-","-","-","-","-","-"]
["James Kaprielian","NYY - SP",854,"-","-","-","-","-","-"]
["Justin Masterson","Bos - SP",857,"-","-","-","-","-","-"]
["Foster Griffin","KC - SP",860,"-","-","-","-","-","-"]
["Rogelio Armenteros","Hou - SP",862,"-","-","-","-","-","-"]
["Spencer Turnbull","Det - SP",863,"-","-","-","-","-","-"]
["Nick Neidert","Sea - SP",865,"-","-","-","-","-","-"]
["Cole Ragans","Tex - SP",866,"-","-","-","-","-","-"]
["Ty Buttrey","Bos - SP",875,"-","-","-","-","-","-"]
["Roniel Raudes","Bos - SP",876,"-","-","-","-","-","-"]
["Jaime Schultz","TB - SP",877,"-","-","-","-","-","-"]
["Clarke Schmidt","NYY - SP",879,"-","-","-","-","-","-"]
["Franklin Perez","Hou - SP",880,"-","-","-","-","-","-"]
["Ian Clarkin","CWS - SP",883,"-","-","-","-","-","-"]
["Austin Bibens-Dirkx ","Tex - SP,RP",886,"69.1","5","0","38","4.67","1.36"]
["Ryan Weber","TB - SP",914,"3.2","0","0","0","2.45","0.82"]
["Jeremy Hellickson","Bal - SP",922,"164.0","8","0","96","5.43","1.26"]
["Anthony Banda","TB - SP",949,"25.2","2","0","25","5.96","1.40"]
["Francis Martes","Hou - SP,RP",959,"54.1","5","0","69","5.80","1.51"]
["James Russell","Det - SP,RP",975,"-","-","-","-","-","-"]
["Aaron Slegers","Min - SP",992,"15.1","0","0","9","6.46","1.17"]
["Chris Bassitt","Oak - SP,RP",994,"-","-","-","-","-","-"]
["Ian Kennedy","KC - SP",1002,"154.0","5","0","131","5.38","1.32"]
["Tyler Skaggs","LAA - SP",1003,"85.0","2","0","76","4.55","1.39"]
["Doug Fister","Tex - SP",1006,"90.1","5","0","83","4.88","1.38"]
["Luis Cessa","NYY - SP,RP",1008,"36.0","0","0","30","4.75","1.47"]
["Chi Chi González","Tex - SP",1010,"-","-","-","-","-","-"]
["Andrew Moore","Sea - SP",1024,"59.0","1","0","31","5.34","1.15"]
["Alec Asher","Bal - SP,RP",1027,"60.0","2","0","47","5.25","1.40"]
["Ross Detwiler","Oak - SP,RP",1041,"-","-","-","-","-","-"]
["David Paulino","Hou - SP",1049,"29.0","2","0","34","6.52","1.48"]
["Miguel González","CWS - SP",1055,"156.0","8","0","100","4.62","1.42"]
["Brett Oberholtzer","Tor - SP,RP",1062,"-","-","-","-","-","-"]
["Jaime García","Tor - SP",1072,"157.0","5","0","129","4.41","1.41"]
["Cody Anderson","Cle - SP",1077,"-","-","-","-","-","-"]
["Austin Pruitt","TB - SP,RP",1078,"83.0","7","1","66","5.31","1.51"]
["Christian Bergman","Sea - SP,RP",1085,"54.0","4","0","33","5.00","1.41"]
["Felix Jorge","Min - SP",1086,"7.2","1","0","4","10.57","2.09"]
["Trevor Cahill","KC - SP,RP",1088,"84.0","4","0","87","4.93","1.62"]
["Jonathon Niese","NYY - SP",1092,"-","-","-","-","-","-"]
["Nick Tepesch","Tor - SP",1097,"15.2","1","0","9","5.17","1.98"]
["Steven Wright","Bos - SP",1111,"24.0","1","0","13","8.25","1.88"]
["Jharel Cotton","Oak - SP",1120,"129.0","9","0","105","5.58","1.44"]
["Edinson Volquez","Tex - SP",1125,"92.1","4","0","81","4.19","1.42"]
["Chris Rowley","Tor - SP",1127,"18.2","1","0","11","6.75","1.82"]
["Mat Latos","Tor - SP",1138,"15.0","0","0","10","6.60","1.80"]
["Mike Fiers","Det - SP",1140,"153.1","8","0","146","5.22","1.43"]
["Tim Lincecum","LAA - SP",1143,"-","-","-","-","-","-"]
["Buck Farmer","Det - SP",1146,"48.0","5","0","49","6.75","1.56"]
["Héctor Santiago","CWS - SP",1148,"70.1","4","0","51","5.63","1.44"]
["Asher Wojciechowski","Bal - SP,RP",1153,"62.1","4","0","64","6.50","1.44"]
["Adalberto Mejía","Min - SP",1156,"98.0","4","0","85","4.50","1.57"]
["Raul Alcantara","Oak - SP",1158,"24.0","1","0","12","7.13","1.42"]
["Jesse Chávez","Tex - SP,RP",1163,"138.0","7","0","119","5.35","1.40"]
["Jason Hammel","KC - SP",1166,"180.1","8","0","145","5.29","1.43"]
["Chase De Jong","Sea - SP",1173,"28.1","0","0","13","6.35","1.55"]
["Joe Biagini","Tor - SP,RP",1174,"119.2","3","1","97","5.34","1.40"]
["Kyle Kendrick","Bos - SP",1189,"8.1","0","0","3","12.96","2.52"]
["David Holmberg","Bal - SP,RP",1197,"57.2","2","0","33","4.68","1.68"]
["Jesse Hahn","KC - SP",1210,"69.2","3","0","55","5.30","1.51"]
["Phil Hughes","Min - SP,RP",1218,"53.2","4","0","38","5.87","1.58"]
["César Valdez","Tor - SP,RP",1220,"30.2","1","0","21","7.63","1.70"]
["Daniel Norris","Det - SP",1227,"101.2","5","0","86","5.31","1.61"]
["Eric Skoglund","KC - SP",1229,"18.0","1","0","14","9.50","2.33"]
["Ricky Nolasco","LAA - SP",1231,"181.0","6","0","143","4.92","1.45"]
["Chris Smith","Oak - SP,RP",1244,"55.2","0","0","31","6.79","1.47"]
["Kyle Gibson","Min - SP",1247,"158.0","12","0","121","5.07","1.53"]
["Brett Anderson","Tor - SP",1248,"55.1","4","0","38","6.34","1.70"]
["Lisalverto Bonilla","Cle - SP,RP",1249,"36.2","1","0","28","8.10","1.75"]
["Matthew Boyd","Det - SP",1252,"135.0","6","0","110","5.27","1.56"]
["Francisco Liriano","Det - SP,RP",1253,"97.0","6","0","85","5.66","1.63"]
["Martín Pérez","Tex - SP",1254,"185.0","13","0","115","4.82","1.54"]
["James Shields","CWS - SP",1268,"117.0","5","0","103","5.23","1.44"]
["Daniel Gossett","Oak - SP",1269,"91.1","4","0","72","6.11","1.61"]
["Matt Moore","Tex - SP",1283,"174.1","6","0","148","5.52","1.53"]
["Wily Peralta","KC - SP,RP",1298,"57.1","5","0","52","7.85","1.83"]
["Chad Bell","Det - SP,RP",1302,"62.1","0","0","57","6.93","1.80"]
["Travis Wood","Det - SP,RP",1322,"94.0","4","0","65","6.80","1.73"]
["Bartolo Colón","Tex - SP",1333,"143.0","7","0","89","6.48","1.59"]
["Anibal Sanchez","Min - SP,RP",1340,"105.1","3","0","104","6.41","1.59"]
["Dylan Covey","CWS - SP,RP",1346,"70.0","0","0","41","7.71","1.67"]
["Jordan Zimmermann","Det - SP",1357,"160.0","8","0","103","6.08","1.55"]
["Mike Pelfrey","CWS - SP,RP",1385,"120.0","3","0","79","5.93","1.58"]
["Ubaldo Jiménez","Bal - SP,RP",1417,"142.2","6","0","139","6.81","1.59"]
["Chris Tillman","Bal - SP,RP",1453,"93.0","1","0","63","7.84","1.89"]

{"sheet":"Relief Pitchers","index":11,"n_rows":267,"n_cols":9,"rows_kept":267}
["Player","Team","Rank","IP","W","S","K","ERA","WHIP"]
["Craig Kimbrel","Bos - RP",68,"69.0","5","35","126","1.43","0.68"]
["Roberto Osuna","Tor - RP",88,"64.0","3","39","83","3.38","0.86"]
["Ken Giles","Hou - RP",111,"62.2","1","34","83","2.30","1.04"]
["Brad Brach","Bal - RP",204,"68.0","4","18","70","3.18","1.13"]
["Fernando Rodney","Min - RP",221,"55.1","5","39","65","4.23","1.19"]
["Zach Britton","Bal - RP",268,"37.1","2","15","29","2.89","1.53"]
["David Robertson","NYY - RP",303,"68.1","9","14","98","1.84","0.85"]
["Joakim Soria","CWS - RP",342,"56.0","4","1","64","3.70","1.23"]
["Juan Minaya","CWS - RP",348,"43.2","3","9","51","4.53","1.33"]
["Chad Green","NYY - RP",352,"69.0","5","0","103","1.83","0.74"]
["Mychal Givens","Bal - RP",360,"78.2","8","0","88","2.75","1.04"]
["Yusmeiro Petit","Oak - RP",361,"91.1","5","4","101","2.76","0.95"]
["Mike Minor","Tex - RP",364,"77.2","6","6","88","2.55","1.02"]
["Juan Nicasio","Sea - RP",367,"72.1","5","6","72","2.61","1.08"]
["Ryan Buchter","Oak - RP",373,"65.1","4","1","65","2.89","1.07"]
["Adam Warren","NYY - RP",374,"57.1","3","1","54","2.35","0.87"]
["Will Harris","Hou - RP",376,"45.1","3","2","52","2.98","0.97"]
["Seung Hwan Oh","Tor - RP",377,"59.1","1","20","54","4.10","1.40"]
["Tommy Kahnle","NYY - RP",391,"62.2","2","0","96","2.59","1.12"]
["Santiago Casilla","Oak - RP",394,"59.0","4","16","57","4.27","1.36"]
["Keone Kela","Tex - RP",396,"38.2","4","2","51","2.79","0.91"]
["Joe Smith","Hou - RP",400,"54.0","3","1","71","3.33","1.04"]
["Dan Otero","Cle - RP",401,"60.0","3","0","38","2.85","1.20"]
["Jim Johnson","LAA - RP",404,"56.2","6","22","61","5.56","1.48"]
["Matt Barnes","Bos - RP",406,"69.2","7","1","83","3.88","1.22"]
["Darren O'Day","Bal - RP",409,"60.1","2","2","76","3.43","1.08"]
["David Phelps","Sea - RP",410,"55.2","4","0","62","3.40","1.38"]
["Taylor Rogers","Min - RP",416,"55.2","7","0","49","3.07","1.31"]
["Emilio Pagán","Oak - RP",419,"50.1","2","0","56","3.22","0.93"]
["Zach McAllister","Cle - RP",420,"62.0","2","0","66","2.61","1.19"]
["Nick Vincent","Sea - RP",421,"64.2","3","0","50","3.20","1.16"]
["Sergio Romo","TB - RP",424,"55.2","3","0","59","3.56","1.10"]
["Héctor Rondón","Hou - RP",425,"57.1","4","0","69","4.24","1.22"]
["Matt Belisle","Cle - RP",427,"60.1","2","9","54","4.03","1.16"]
["Nick Goody","Cle - RP",432,"54.2","1","0","72","2.80","1.08"]
["Richard Bleier","Bal - RP",433,"63.1","2","0","26","1.99","1.18"]
["Erasmo Ramírez","Sea - SP,RP",436,"131.1","5","1","109","4.39","1.17"]
["Joe Kelly","Bos - RP",437,"58.0","4","0","52","2.79","1.19"]
["Danny Barnes","Tor - RP",438,"66.0","3","0","62","3.55","1.09"]
["Trevor Hildenberger","Min - RP",439,"42.0","3","1","44","3.21","1.05"]
["Keynan Middleton","LAA - RP",446,"58.1","6","3","63","3.86","1.34"]
["Wade LeBlanc","NYY - RP",456,"68.0","5","1","54","4.50","1.19"]
["Tyler Olson","Cle - RP",457,"20.0","1","1","18","0.00","0.95"]
["Liam Hendriks","Oak - RP",458,"64.0","4","1","78","4.22","1.25"]
["Alan Busenitz","Min - RP",464,"31.2","1","0","23","1.99","0.98"]
["Tyler Thornburg","Bos - SP,RP",465,"-","-","-","-","-","-"]
["Gregory Infante","CWS - RP",470,"54.2","2","0","49","3.13","1.19"]
["Chasen Shreve","NYY - RP",472,"45.1","4","0","58","3.77","1.32"]
["Robby Scott","Bos - RP",474,"35.2","2","0","31","3.79","0.98"]
["Ryan Dull","Oak - RP",475,"42.0","2","0","45","5.14","1.26"]
["Luis Avilán","CWS - RP",476,"46.0","2","0","52","2.93","1.39"]
["Dan Jennings","TB - RP",477,"62.2","3","0","51","3.45","1.34"]
["Dustin McGowan","TB - RP",480,"77.2","8","0","64","4.75","1.34"]
["Tyler Clippard","Hou - RP",485,"60.1","2","5","72","4.77","1.29"]
["Hector Velázquez","Bos - SP,RP",489,"24.2","3","0","19","2.92","1.14"]
["Austin Maddox","Bos - RP",495,"17.1","0","0","14","0.52","0.87"]
["Zach Putnam","CWS - RP",502,"8.2","0","0","9","1.04","0.35"]
["Carlos Ramírez","Tor - RP",504,"16.2","0","0","14","2.70","0.54"]
["Ryan Pressly","Min - RP",505,"61.1","2","0","61","4.70","1.16"]
["Zach Duke","Min - RP",507,"18.1","1","0","12","3.93","1.04"]
["James Pazos","Sea - RP",511,"53.2","4","0","65","3.86","1.40"]
["Andrew Bailey","LAA - RP",512,"4.0","2","0","2","0.00","0.25"]
["Brandon Workman","Bos - RP",514,"39.2","1","0","37","3.18","1.21"]
["Heath Hembree","Bos - RP",515,"62.0","2","0","70","3.63","1.45"]
["Miguel Castro","Bal - RP",516,"66.1","3","0","38","3.53","1.22"]
["José Leclerc","Tex - RP",517,"45.2","2","2","60","3.94","1.38"]
["Daniel Coulombe","Oak - RP",518,"51.2","2","0","39","3.48","1.32"]
["Jake Diekman","Tex - RP",520,"10.2","0","1","13","2.53","1.31"]
["Danny Farquhar","CWS - RP",522,"49.1","4","0","45","4.20","1.36"]
["Ben Heller","NYY - RP",532,"11.0","1","0","9","0.82","1.00"]
["Deolis Guerra","Tex - RP",538,"25.0","2","0","22","4.68","1.28"]
["Chih-Wei Hu","TB - RP",544,"10.0","1","0","9","2.70","0.90"]
["Al Alburquerque","Tor - RP",546,"18.0","0","0","14","2.50","1.00"]
["Troy Scribner","LAA - SP,RP",548,"23.2","2","0","18","4.18","1.14"]
["Chaz Roe","TB - RP",550,"10.2","0","0","13","2.53","1.13"]
["Chasen Bradford","Sea - RP",551,"33.2","2","0","27","3.74","1.28"]
["José Alvarado","TB - RP",555,"29.2","0","0","29","3.64","1.11"]
["James Hoyt","Hou - RP",558,"49.1","1","0","66","4.38","1.32"]
["Luis Santos","Tor - RP",560,"16.2","0","1","16","2.70","1.14"]
["Dillon Gee","Min - SP,RP",566,"49.1","3","1","41","3.47","1.40"]
["Andrew Kittredge","TB - RP",567,"15.1","0","0","14","1.76","1.24"]
["Donnie Hart","Bal - RP",570,"43.2","2","0","29","3.71","1.40"]
["Carlos Torres","Cle - RP",571,"72.2","4","1","56","4.21","1.53"]
["Noé Ramírez","LAA - RP",572,"13.0","0","0","14","2.77","0.85"]
["Brandon Maurer","KC - RP",573,"59.1","3","22","59","6.52","1.55"]
["Dan Altavilla","Sea - RP",578,"46.2","1","0","52","4.24","1.35"]
["Brian Flynn","KC - RP",580,"2.1","0","0","0","3.86","1.29"]
["Jean Machi","CWS - RP",582,"7.2","1","0","4","1.17","1.43"]
["Chris Hatcher","Oak - RP",585,"59.2","1","1","63","4.22","1.32"]
["Alex Wilson","Det - RP",588,"60.0","2","2","42","4.50","1.37"]
["José Álvarez","LAA - RP",590,"48.2","0","1","45","3.88","1.27"]
["Simon Castro","Oak - RP",594,"37.0","1","0","35","4.38","1.24"]
["Luke Hochevar","KC - SP,RP",598,"-","-","-","-","-","-"]
["Jonathan Holder","NYY - RP",602,"39.1","1","0","40","3.89","1.35"]
["Matt Dermody","Tor - RP",603,"22.1","2","0","15","4.43","1.25"]
["Gavin Floyd","Tor - SP,RP",606,"-","-","-","-","-","-"]
["Huston Street","LAA - RP",610,"4.0","0","0","3","0.00","0.75"]
["Domingo Germán","NYY - RP",618,"14.1","0","0","18","3.14","1.40"]
["Gabriel Moya","Min - RP",623,"6.1","0","1","5","4.26","1.11"]
["Tyler Wagner","Tex - RP",625,"-","-","-","-","-","-"]
["Thyago Vieira","CWS - RP",627,"1.0","0","0","1","0.00","0.00"]
["Aaron Bummer","CWS - RP",631,"22.0","1","0","17","4.50","1.27"]
["Kevin McCarthy","KC - RP",635,"45.0","1","0","27","3.20","1.40"]
["Aaron Loup","Tor - RP",636,"57.2","2","0","64","3.75","1.53"]
["Eddie Gamboa","Bal - SP,RP",640,"-","-","-","-","-","-"]
["Shawn Armstrong","Sea - RP",643,"24.2","1","0","20","4.38","1.34"]
["Eduardo Paredes","LAA - RP",644,"22.1","0","1","17","4.43","1.21"]
["Marc Rzepczynski","Sea - RP",649,"31.1","2","1","25","4.02","1.56"]
["Carlos Frías","Cle - SP,RP",650,"-","-","-","-","-","-"]
["Ryan O'Rourke","Bal - RP",651,"-","-","-","-","-","-"]
["José Ruiz","CWS - RP",653,"1.0","0","0","1","0.00","1.00"]
["Nick Tropeano","LAA - SP,RP",654,"-","-","-","-","-","-"]
["Hunter Wood","TB - RP",660,"0.1","0","0","0","0.00","0.00"]
["Trevor May","Min - RP",661,"-","-","-","-","-","-"]
["Vicente Campos","LAA - RP",665,"-","-","-","-","-","-"]
["Gabriel Ynoa","Bal - SP,RP",670,"34.2","2","0","26","4.15","1.36"]
["Ryne Harper","Sea - RP",679,"-","-","-","-","-","-"]
["Adam Ravenelle","Det - RP",698,"-","-","-","-","-","-"]
["Zack Burdi","CWS - RP",700,"-","-","-","-","-","-"]
["Alex Faedo","Det - RP",707,"-","-","-","-","-","-"]
["Nestor Cortes Jr.","Bal - RP",709,"-","-","-","-","-","-"]
["Jon Keller","Bal - RP",713,"-","-","-","-","-","-"]
["Jake Reed","Min - RP",717,"-","-","-","-","-","-"]
["Paul Fry","Bal - RP",741,"-","-","-","-","-","-"]
["Chris Lee","Bal - RP",779,"-","-","-","-","-","-"]
["Nick Rumbelow","Sea - RP",810,"-","-","-","-","-","-"]
["Jason García","Bal - RP",813,"-","-","-","-","-","-"]
["Chris Martin","Tex - RP",816,"-","-","-","-","-","-"]
["Tyler Jay","Min - RP",830,"-","-","-","-","-","-"]
["Burch Smith","KC - SP,RP",838,"-","-","-","-","-","-"]
["Giovanni Soto","CWS - RP",839,"-","-","-","-","-","-"]
["Anthony Gose","Hou - RP",842,"-","-","-","-","-","-"]
["Héctor Pérez","Hou - RP",843,"-","-","-","-","-","-"]
["Alex Scherff","Bos - RP",851,"-","-","-","-","-","-"]
["Domingo Acevedo","NYY - RP",864,"-","-","-","-","-","-"]
["Austin Bibens-Dirkx","Tex - SP,RP",886,"69.1","5","0","38","4.67","1.36"]
["Chad Girodo","Tor - RP",887,"-","-","-","-","-","-"]
["Ryan Garton","Sea - RP",888,"22.0","0","0","16","4.91","1.09"]
["Jeanmar Gómez","CWS - RP",893,"22.1","3","2","21","7.25","1.70"]
["Ashur Tolliver","Sea - RP",898,"5.0","0","0","5","3.60","1.60"]
["Buddy Boshers","Hou - RP",899,"35.0","1","0","28","4.89","1.34"]
["Ronald Herrera","Tex - RP",900,"3.0","0","0","3","6.00","1.33"]
["Tony Barnette","Tex - RP",902,"57.1","2","2","57","5.49","1.50"]
["Giovanny Gallegos","NYY - RP",903,"20.1","0","0","22","4.87","1.28"]
["Kyle Martin","Bos - RP",904,"2.1","0","0","1","3.86","1.71"]
["Seth Maness","KC - RP",905,"9.2","1","0","4","3.72","1.86"]
["Adam Plutko","Cle - RP",907,"-","-","-","-","-","-"]
["Perci Garner","Bal - RP",910,"-","-","-","-","-","-"]
["Rob Scahill","CWS - RP",912,"22.1","1","0","10","4.43","1.39"]
["Jimmy Yacabonis","Bal - RP",920,"20.2","2","0","8","4.35","1.55"]
["Andrew Faulkner","Bal - RP",927,"-","-","-","-","-","-"]
["TJ House","CWS - RP",930,"2.0","0","0","1","4.50","2.00"]
["Bobby Wahl","Oak - RP",932,"7.2","0","0","8","4.70","1.57"]
["Logan Ondrusek","Bal - RP",939,"-","-","-","-","-","-"]
["Greg Mahle","LAA - RP",940,"-","-","-","-","-","-"]
["Daniel Hudson","TB - RP",942,"61.2","2","0","66","4.38","1.46"]
["Adam Kolarek","TB - RP",946,"8.1","1","0","4","6.48","1.56"]
["Daniel Stumpf","Det - RP",951,"37.2","0","0","33","3.82","1.38"]
["Enrique Burgos","Det - RP",952,"-","-","-","-","-","-"]
["Shawn Morimando","Cle - RP",953,"-","-","-","-","-","-"]
["Tanner Scott","Bal - RP",955,"1.2","0","0","2","10.80","2.40"]
["Dan Runzler","TB - RP",956,"4.0","0","0","4","4.50","2.25"]
["Jairo Labourt","Oak - RP",958,"6.0","0","0","4","4.50","1.83"]
["Francis Martes","Hou - SP,RP",959,"54.1","5","0","69","5.80","1.51"]
["Xavier Cedeño","CWS - RP",961,"3.0","1","0","0","12.00","3.67"]
["Kevin Chapman","Min - RP",963,"-","-","-","-","-","-"]
["Erik Goeddel","Tex - RP",965,"29.0","0","0","33","5.28","1.34"]
["José De León","TB - RP",967,"2.2","1","0","2","10.13","2.63"]
["James Russell","Det - SP,RP",975,"-","-","-","-","-","-"]
["Jandel Gustave","Hou - RP",978,"5.0","0","0","2","5.40","2.40"]
["Josh Smith","Oak - RP",983,"35.0","2","0","25","4.89","1.43"]
["Shawn Tolleson","Tex - RP",984,"-","-","-","-","-","-"]
["Jason Gurka","Bal - RP",986,"0.2","0","0","0","0.00","4.50"]
["Josh Edgin","Bal - RP",987,"37.0","0","1","27","3.65","1.54"]
["Preston Claiborne","Cle - RP",988,"2.0","0","0","2","13.50","2.50"]
["John Curtiss","Min - RP",989,"8.2","0","0","10","8.31","1.27"]
["Roenis Elías","Bos - RP",993,"0.1","0","0","1","0.00","3.00"]
["Chris Bassitt","Oak - SP,RP",994,"-","-","-","-","-","-"]
["Kevin Jepsen","Tex - RP",998,"-","-","-","-","-","-"]
["Yohander Méndez","Tex - RP",1000,"12.1","0","0","7","5.11","1.30"]
["Luis Cessa","NYY - SP,RP",1008,"36.0","0","0","30","4.75","1.47"]
["Ian Krol","LAA - RP",1009,"49.0","2","0","44","5.33","1.45"]
["Jason Grilli","Tex - RP",1012,"40.0","2","1","48","6.30","1.60"]
["Johnny Barbato","Det - RP",1019,"28.2","0","0","23","4.08","1.50"]
["Tim Mayza","Tor - RP",1020,"17.0","1","0","27","6.88","1.65"]
["Ben Taylor","Cle - RP",1021,"17.1","0","1","18","5.19","1.67"]
["Evan Scribner","TB - RP",1022,"7.1","0","0","6","11.05","1.77"]
["Brady Rodgers","Hou - RP",1025,"-","-","-","-","-","-"]
["Austin Adams","LAA - RP",1026,"-","-","-","-","-","-"]
["Alec Asher","Bal - SP,RP",1027,"60.0","2","0","47","5.25","1.40"]
["Max Povse","Sea - RP",1028,"3.2","0","0","2","7.36","2.73"]
["Ricky Rodríguez","Tex - RP",1031,"13.0","0","1","11","6.23","1.62"]
["Felix Peña","LAA - RP",1032,"34.1","1","0","37","5.24","1.54"]
["Jeff Beliveau","Cle - RP",1033,"15.2","1","0","17","7.47","1.47"]
["Miguel Almonte","KC - RP",1040,"2.0","0","0","0","13.50","3.50"]
["Ross Detwiler","Oak - SP,RP",1041,"-","-","-","-","-","-"]
["Cody Martin","Sea - RP",1045,"2.0","0","0","0","13.50","3.50"]
["Jhan Maríñez","Bal - RP",1051,"58.1","0","0","45","3.70","1.54"]
["Pat Light","Sea - RP",1056,"-","-","-","-","-","-"]
["Nick Gardewine","Tex - RP",1058,"8.0","0","0","3","5.63","2.13"]
["Justin Haley","Bos - RP",1059,"18.0","0","1","14","6.00","1.56"]
["William Cuevas","Bos - RP",1060,"0.1","0","0","1","108.00","9.00"]
["Brett Oberholtzer","Tor - SP,RP",1062,"-","-","-","-","-","-"]
["Lucas Harrell","Tor - RP",1065,"6.1","0","0","6","7.11","2.21"]
["Paolo Espino","Tex - RP",1069,"24.0","0","0","20","6.00","1.38"]
["J.P. Howell","Tor - RP",1071,"11.0","1","0","6","7.36","1.82"]
["Austin Pruitt","TB - SP,RP",1078,"83.0","7","1","66","5.31","1.51"]
["Taylor Cole","Tor - RP",1080,"1.0","0","0","1","36.00","7.00"]
["Christian Bergman","Sea - SP,RP",1085,"54.0","4","0","33","5.00","1.41"]
["Trevor Cahill","KC - SP,RP",1088,"84.0","4","0","87","4.93","1.62"]
["Blaine Boyer","KC - RP",1089,"41.1","1","0","33","4.35","1.55"]
["Victor Alcántara","Det - RP",1094,"7.1","0","0","5","8.59","2.18"]
["Bruce Rondón","CWS - RP",1096,"15.2","1","1","22","10.91","1.98"]
["Glen Perkins","Min - RP",1098,"5.2","0","0","2","9.53","2.29"]
["Zac Reininger","Det - RP",1099,"9.2","0","0","5","7.45","1.97"]
["Tommy Layne","Bos - RP",1102,"13.0","0","0","9","7.62","1.85"]
["Dayan Diaz","LAA - RP",1103,"13.0","1","0","20","9.00","1.62"]
["Mike Wright Jr.","Bal - RP",1105,"25.0","0","0","28","5.76","1.32"]
["Ryne Stanek","TB - RP",1110,"20.0","0","0","29","5.85","1.90"]
["Jeff Ferrell","Bal - RP",1113,"9.1","0","0","6","6.75","2.36"]
["Sam Moll","Sea - RP",1116,"6.2","0","0","7","10.80","2.40"]
["Michael Ynoa","CWS - RP",1119,"29.0","1","0","23","5.90","1.72"]
["Mike Hauschild","Hou - RP",1124,"8.0","0","0","7","11.25","2.00"]
["Craig Breslow","Tor - RP",1126,"35.1","1","0","23","5.09","1.56"]
["Tony Sipp","Hou - RP",1132,"37.1","0","0","39","5.79","1.39"]
["Jace Fry","CWS - RP",1134,"6.2","0","0","3","10.80","2.55"]
["Warwick Saupold","Det - RP",1136,"62.2","3","0","44","4.88","1.52"]
["Mike Morin","Sea - RP",1139,"20.0","0","0","16","7.20","1.70"]
["Blake Wood","LAA - RP",1141,"74.1","3","0","84","5.45","1.57"]
["Tim Lincecum ","Tex - SP",1145,"-","-","-","-","-","-"]
["Asher Wojciechowski","Bal - SP,RP",1153,"62.1","4","0","64","6.50","1.44"]
["Glenn Sparkman","KC - RP",1155,"1.0","0","0","1","63.00","10.00"]
["Jesse Chávez","Tex - SP,RP",1163,"138.0","7","0","119","5.35","1.40"]
["Tyler Duffey","Min - RP",1164,"71.0","2","1","67","4.94","1.37"]
["Andres Machado","KC - RP",1165,"3.2","0","0","1","22.09","3.55"]
["John Axford","Tor - RP",1168,"21.0","0","0","21","6.43","2.10"]
["Jake Petricka","Tor - RP",1172,"25.2","1","0","26","7.01","1.75"]
["Joe Biagini","Tor - SP,RP",1174,"119.2","3","1","97","5.34","1.40"]
["Blaine Hardy","Det - RP",1176,"33.1","1","0","28","5.94","1.77"]
["Evan Marshall","Cle - RP",1177,"7.2","0","0","4","9.39","2.22"]
["Stefan Crichton","Bal - RP",1180,"12.1","0","0","8","8.03","2.43"]
["Drew VerHagen","Det - RP",1181,"34.1","0","0","25","5.77","1.49"]
["Brad Goldberg","CWS - RP",1182,"12.0","0","0","3","8.25","2.33"]
["Joely Rodríguez","Bal - RP",1194,"27.0","1","0","18","6.33","1.93"]
["Reymin Guduan","Hou - RP",1196,"16.0","0","0","16","7.88","2.25"]
["David Holmberg","Bal - SP,RP",1197,"57.2","2","0","33","4.68","1.68"]
["Frankie Montas","Oak - RP",1204,"32.0","1","0","36","7.03","1.84"]
["Vidal Nuño","TB - RP",1212,"14.2","0","0","13","10.43","2.25"]
["Phil Hughes","Min - SP,RP",1218,"53.2","4","0","38","5.87","1.58"]
["César Valdez","Tor - SP,RP",1220,"30.2","1","0","21","7.63","1.70"]
["Neil Ramírez","Cle - RP",1226,"31.1","0","0","44","7.18","1.79"]
["Chris Smith","Oak - SP,RP",1244,"55.2","0","0","31","6.79","1.47"]
["Lisalverto Bonilla","Cle - SP,RP",1249,"36.2","1","0","28","8.10","1.75"]
["Francisco Liriano","Det - SP,RP",1253,"97.0","6","0","85","5.66","1.63"]
["Casey Lawrence","Sea - RP",1255,"55.1","2","0","52","6.34","1.84"]
["Joe Jiménez","Det - RP",1257,"19.0","0","0","17","12.32","2.11"]
["Martín Pérez ","Tex - SP",1258,"185.0","13","0","115","4.82","1.54"]
["Chris Beck","CWS - RP",1276,"64.2","2","0","42","6.40","1.65"]
["Wily Peralta","KC - SP,RP",1298,"57.1","5","0","52","7.85","1.83"]
["Chad Bell","Det - SP,RP",1302,"62.1","0","0","57","6.93","1.80"]
["Travis Wood","Det - SP,RP",1322,"94.0","4","0","65","6.80","1.73"]
["Anibal Sanchez","Min - SP,RP",1340,"105.1","3","0","104","6.41","1.59"]
["Dylan Covey","CWS - SP,RP",1346,"70.0","0","0","41","7.71","1.67"]
["Mike Pelfrey","CWS - SP,RP",1385,"120.0","3","0","79","5.93","1.58"]
["Ubaldo Jiménez","Bal - SP,RP",1417,"142.2","6","0","139","6.81","1.59"]
["Chris Tillman","Bal - SP,RP",1453,"93.0","1","0","63","7.84","1.89"]

{"sheet":"Data","index":12,"n_rows":50,"n_cols":11,"rows_kept":50}
["Owners","Position"]
["Lightning (Mike Goodman)","Catcher"]
["Evolution (Bruce)","1st Base"]
["Miggy Pop (Colin)","2nd Base"]
["Woap (Mike)","3rd Base"]
["The Dominant Brand (Brandon)","Short Stop"]
["Guzzlers (Rhonda)","Outfield #1"]
["Moneyballers (Rob)","Outfield #2"]
["Booya's (Cathy)","Outfield #3"]
["Freebirds (Todd)","DH"]
["Numbats (Tom)","Starting Pitcher #1"]
["TheDunnShow (Dave)","Starting Pitcher #2"]
[null,"Starting Pitcher #3"]
[null,"Starting Pitcher #4"]
[null,"Starting Pitcher #5"]
[null,"Relief Pitcher #1"]
[null,"Relief Pitcher #2"]
[null,"Relief Pitcher #3"]
[null,"Relief Pitcher #4"]
[null,"Reserve Roster #1"]
[null,"Reserve Roster #2"]
[null,"Reserve Roster #3"]
[null,"Reserve Roster #4"]
[null,"Reserve Roster #5"]
[null,"Reserve Roster #6"]
[null,"Reserve Roster #7"]
[]
["Make sure every year to select all the players for each position and recreate the bookmark name (delete name first, then recreate name) to ensure all players get listed.",null,"catchers","first","second","third","ss","outfield","dh","pitchers","relief"]
["Ensure that all players are listed when clicking on the button."]
[]
[null,"Change Draft Order Yearly"]
[]
["Moneyballers (Rob)",1]
["Booya's (Cathy)",2]
["Freebirds (Todd)",3]
["Evolution (Bruce)",4]
["The Dominant Brand (Brandon)",5]
["Woap (Mike)",6]
["Miggy Pop (Colin)",7]
["Numbats (Tom)",8]
["TheDunnShow (Dave)",9]
["Guzzlers (Rhonda)",10]
["Lightning (Mike Goodman)",11]
[]
[]
[]
["Formulas to Retreive Name and Position"]
["=RIGHT(A1,LEN(A1)+ 5-FIND(\"-\",A1))","Position"]
["=LEFT(A1,FIND(\"-\",A1) -5)","Name"]
["=Trim(cell)","Trim the positions for extra space"]