{"text_format":"3","workbook":"xlsx","n_sheets":13,"sheets":["2017 Pre-Draft Rosters","Draft List","Summary","Catchers","1st Base","2nd Base","3rd Base","Short Stop","Outfield","DH","Pitchers","Relief Pitchers","Data"],"not_rendered":{"macros":1,"defined_names":49},"read":"whole","date_system":"1900"}

{"sheet":"2017 Pre-Draft Rosters","index":0,"n_rows":34,"n_cols":45,"rows_kept":34,"merged":[[0,1,0,4],[0,5,0,8],[0,9,0,12],[0,13,0,16],[0,17,0,20],[0,21,0,24],[0,25,0,28],[0,29,0,32],[0,33,0,36],[0,37,0,39],[0,41,0,43],[22,1,22,2],[22,5,22,6],[22,9,22,10],[22,13,22,14],[22,17,22,18],[22,21,22,22],[22,25,22,26],[22,29,22,30],[22,33,22,34],[22,37,22,38],[22,41,22,42],[23,1,23,2],[23,5,23,6],[23,9,23,10],[23,13,23,14],[23,17,23,18],[23,21,23,22],[23,25,23,26],[23,29,23,30],[23,33,23,34],[23,37,23,38],[23,41,23,42],[24,1,24,2],[24,5,24,6],[24,9,24,10],[24,13,24,14],[24,17,24,18],[24,21,24,22],[25,1,25,2],[25,5,25,6],[25,9,25,10],[25,13,25,14],[25,17,25,18],[25,21,25,22],[25,26,25,27],[25,30,25,31],[25,34,25,35],[25,38,25,39],[25,42,25,43]]}
[null,"Lightning (Mike Goodman)",{"$nulls":3},"Evolution (Bruce)",{"$nulls":3},"Miggy Pop (Colin)",{"$nulls":3},"Woap (Mike)",{"$nulls":3},"The Dominant Brand (Brandon)",{"$nulls":3},"Guzzlers (Rhonda)",{"$nulls":3},"Moneyballers (Rob)",{"$nulls":3}," Booya's (Cathy)",{"$nulls":3},"Freebirds (Todd)",{"$nulls":3},"Numbats (Tom)",{"$nulls":3},"TheDunnShow (Dave)"]
[null,"Pos.","Player","$","years","Pos.","Player","$","years","Pos.","Player","$","years","Pos.","Player","$","years","Pos.","Player","$","years","Pos.","Player","$","years","Pos.","Player","$","years","Pos.","Player","$","years","Pos.","Player","$","years","Pos.","Player","$","years","Pos.","Player","$","years"]
[{"$f":"11-COUNT(D3,H3,L3,P3,T3,X3,AB3,AF3,AJ3,AN3,AR3)","v":0},"C","Gary Sánchez\nNYY - C",15,3,"C","Wilson Ramos\nTB - C",10,null,"C","Salvador Pérez\nKC - C",19,1,"C","Stephen Vogt\nOak - C",3,null,"C","Brian McCann\nHou - C",11,null,"C","Sandy León\nBos - C",1,null,"C","Welington Castillo\nBal - C",6,null,"C","Russell Martin\nTor - C",24,1,"C","Zack Collins\nCWS - C",1,null,"C","Evan Gattis\nHou - C",20,1,"C","Mike Zunino\nSea - C",1]
[0,"1B","Mitch Moreland\nBos - 1B",1,null,"1B","Todd Frazier\nCWS - 1B,3B",37,null,"1B","Miguel Cabrera\nDet - 1B",50,1,"1B","Víctor Martínez\nDet - 1B",1,1,"1B","Eric Hosmer\nKC - 1B",11,1,"1B","Chris Davis\nBal - 1B",37,null,"1B","Edwin Encarnación\nCle - 1B",50,1,"1B","Chris Carter\nNYY - 1B",8,null,"1B","Casey Gillaspie\nTB - 1B",1,null,"1B","Carlos Santana\nCle - 1B",20,1,"1B","Hanley Ramírez\nBos - 1B",31,1]
[0,"2B","Rougned Odor\nTex - 2B",15,2,"2B","Starlin Castro\nNYY - 2B",15,1,"2B","José Altuve\nHou - 2B",51,null,"2B","Robinson Canó\nSea - 2B",26,2,"2B","Ian Kinsler\nDet - 2B",35,null,"2B","Brian Dozier\nMin - 2B",8,2,"2B","Jason Kipnis\nCle - 2B",15,null,"2B","Steve Pearce\nTor - 1B,2B,OF",1,null,"2B","Andy Ibanez\nTex - 2B",1,null,"2B","Devon Travis\nTor - 2B",3,null,"2B","Dustin Pedroia\nBos - 2B",6,1]
[0,"3B","Adrián Béltre\nTex - 3B",23,1,"3B","Miguel Sano\nMin - 3B,OF",15,2,"3B","Danny Valencia\nSea - 1B,3B,OF",3,null,"3B","Mike Moustakas\nKC - 3B",17,null,"3B","Nick Castellanos\nDet - 3B",23,null,"3B","Pablo Sandoval\nBos - 3B",12,null,"3B","Pedro Álvarez\nBal - 3B",1,null,"3B","Evan Longoria\nTB - 3B",25,2,"3B","Kyle Seager\nSea - 3B",30,1,"3B","Yoan Moncada\nCWS - 3B",11,3,"3B","Josh Donaldson\nTor - 3B",50,1]
[0,"SS","Francisco Lindor\nCle - SS",15,2,"SS","Tim Anderson\nCWS - SS",10,2,"SS","Marcus Semien\nOak - SS",5,null,"SS","Troy Tulowitzki\nTor - SS",5,1,"SS","Xander Bogaerts\nBos - SS",35,2,"SS","Brad Miller\nTB - 1B,SS",6,2,"SS","Elvis Andrus\nTex - SS",12,1,"SS","Didi Gregorius\nNYY - SS",1,null,"SS","Manny Machado\nBal - 3B,SS",64,null,"SS","Jean Segura\nSea - 2B,SS",33,null,"SS","Carlos Correa\nHou - SS",15,2]
[0,"OF#1","Charlie Tilson\nCWS - OF",1,null,"OF#1","Leonys Martín\nSea - OF",5,1,"OF#1","Lorenzo Cain\nKC - OF",21,null,"OF#1","Matt Holliday\nNYY - 1B,OF",25,null,"OF#1","Melky Cabrera\nCWS - OF",11,1,"OF#1","Nelson Cruz\nSea - OF",43,1,"OF#1","Jarrod Dyson\nSea - OF",5,1,"OF#1","Brett Gardner\nNYY - OF",1,null,"OF#1","Khris Davis\nOak - OF",10,1,"OF#1","Rajai Davis\nOak - OF",5,1,"OF#1","Cameron Maybin\nLAA - OF",5,1]
[0,"OF#2","Adam Jones\nBal - OF",41,null,"OF#2","George Springer\nHou - OF",15,1,"OF#2","Mark Trumbo\nBal - OF",10,2,"OF#2","Kevin Kiermaier\nTB - OF",2,null,"OF#2","Carlos Gómez\nTex - OF",5,1,"OF#2","Kole Calhoun\nLAA - OF",10,null,"OF#2","Brandon Moss\nKC - 1B,OF",6,null,"OF#2","Seth Smith\nBal - OF",1,null,"OF#2","Byron Buxton\nMin - OF",11,null,"OF#2","J.D. Martínez\nDet - OF",20,null,"OF#2","Rusney Castillo\nBos - OF",10,1]
[0,"OF#3","Nomar Mazara\nTex - OF",10,2,"OF#3","Corey Dickerson\nTB - OF",1,null,"OF#3","Jackie Bradley Jr.\nBos - OF",10,2,"OF#3","Mike Trout\nLAA - OF",63,2,"OF#3","Carlos Beltrán\nHou - OF",5,1,"OF#3","Mookie Betts\nBos - OF",15,2,"OF#3","Kevin Pillar\nTor - OF",15,2,"OF#3","José Ramírez\nCle - 3B,OF",15,3,"OF#3","Max Kepler\nMin - OF",5,null,"OF#3","Justin Upton\nDet - OF",42,null,"OF#3","José Bautista\nTor - OF",31]
[0,"DH","Josh Reddick\nHou - OF",1,null,"DH","Shin-soo Choo\nTex - OF",1,null,"DH","Jonathan Schoop\nBal - 2B",12,null,"DH","Mike Napoli\nTex - 1B",5,1,"DH","Kendrys Morales\nTor - 1B,OF",10,1,"DH","Jacoby Ellsbury\nNYY - OF",1,null,"DH","José Abreu\nCWS - 1B",37,null,"DH","Mitch Haniger\nSea - OF",2,null,"DH","Michael Brantley\nCle - OF",9,"","DH","Albert Pujols\nLAA - 1B",25,null,"DH","C.J. Cron\nLAA - 1B",11]
[0,"SP#1","Chris Archer\nTB - SP",41,null,"SP#1","Lucas Giolito\nCWS - SP",1,null,"SP#1","Tyler Skaggs\nLAA - SP",5,1,"SP#1","Michael Pineda\nNYY - SP",18,null,"SP#1","Carlos Carrasco\nCle - SP",32,null,"SP#1","Corey Kluber\nCle - SP",37,1,"SP#1","Jason Hammel\nKC - SP",6,null,"SP#1","Masahiro Tanaka\nNYY - SP",38,null,"SP#1","Marcus Stroman\nTor - SP",15,1,"SP#1","Jharel Cotton\nOak - SP",5,1,"SP#1","Drew Pomeranz\nBos - SP",5,1]
[0,"SP#2","James Paxton\nSea - SP",26,null,"SP#2","Lance McCullers Jr.\nHou - SP",10,1,"SP#2","Andrew Heaney\nLAA - SP",13,1,"SP#2","Matt Boyd\nDet - SP",2,null,"SP#2","Kevin Gausman\nBal - SP",24,null,"SP#2","Dallas Keuchel\nHou - SP",23,null,"SP#2","Marco Estrada\nTor - SP",10,1,"SP#2","David Price\nBos - SP",30,null,"SP#2","Eduardo Rodríguez\nBos - SP",10,1,"SP#2","Félix Hernández\nSea - SP",27,null,"SP#2","Steven Wright\nBos - SP",5,1]
[0,"SP#3","Joe Musgrove\nHou - SP",5,1,"SP#3","Danny Salazar\nCle - SP",33,1,"SP#3","José Quintana\nCWS - SP",29,null,"SP#3","Ian Kennedy\nKC - SP",6,null,"SP#3","Hisashi Iwakuma\nSea - SP",6,null,"SP#3","Kendall Graveman\nOak - SP",1,null,"SP#3","Garrett Richards\nLAA - SP",11,1,"SP#3","Jake Odorizzi\nTB - SP",13,null,"SP#3","Cole Hamels\nTex - SP",10,2,"SP#3","Drew Smyly\nSea - SP",1,null,"SP#3","Chris Sale\nBos - SP",47]
[0,"SP#4","Sean Manaea\nOak - SP",10,2,"SP#4","Chris Tillman\nBal - SP",5,1,"SP#4","Matt Shoemaker\nLAA - SP",5,null,"SP#4","J.A. Happ\nTor - SP",6,2,"SP#4","Daniel Norris\nDet - SP",3,null,"SP#4","CC Sabathia\nNYY - SP",1,null,"SP#4","Rick Porcello\nBos - SP",6,2,"SP#4","Josh Tomlin\nCle - SP",1,null,"SP#4","Jason Groome\nBos - SP",1,null,"SP#4","Tyson Ross\nTex - SP",1,null,"SP#4","Sonny Gray\nOak - SP",2]
[{"$f":"11-COUNT(D17,H16,L16,P16,T16,X16,AB16,AF16,AJ16,AN16,AR16)","v":0},"SP#5","Jordan Zimmermann\nDet - SP",1,null,"SP#5","José De León\nTB - SP",1,null,"SP#5","Collin McHugh\nHou - SP",6,null,"SP#5","Michael Fulmer\nDet - SP",15,3,"SP#5","Ervin Santana\nMin - SP",10,2,"SP#5","Justin Verlander\nDet - SP",27,2,"SP#5","Aarón Sánchez\nTor - SP",15,2,"SP#5","Trevor Bauer\nCle - SP,RP",13,2,"SP#5","Michael Kopech\nCWS - SP",1,null,"SP#5","Yu Darvish\nTex - SP",23,3,"SP#5","Carlos Rodon\nCWS - SP",11,2]
[{"$f":"11-COUNT(#REF!,H17,L17,P17,T17,X17,AB17,AF17,AJ17,AN17,AR17)","v":1},"RP#1","Dylan Bundy\nBal - SP,RP",10,2,"RP#1","Darren O'Day\nBal - RP",2,1,"RP#1","Brad Brach\nBal - RP",1,1,"RP#1","David Robertson\nCWS - RP",27,null,"RP#1","Jason Grilli\nTor - RP",3,null,"RP#1","Brandon Kintzler\nMin - RP",5,1,"RP#1","Ryan Madson\nOak - RP",15,null,"RP#1","Aroldis Chapman\nNYY - RP",48,null,"RP#1","Dellin Betances\nNYY - RP",20,null,"RP#1","Huston Street\nLAA - RP",1,null,"RP#1","Will Harris\nHou - RP",2,1]
[0,"RP#2","Ken Giles\nHou - RP",25,1,"RP#2","Francisco Rodríguez\nDet - RP",32,1,"RP#2","Matt Strahm\nKC - RP",3,null,"RP#2","Cody Allen\nCle - RP",32,null,"RP#2","Mychal Givens\nBal - RP",10,null,"RP#2","Craig Kimbrel\nBos - RP",27,1,"RP#2","Sean Doolittle\nOak - RP",10,null,"RP#2","Andrew Miller\nCle - RP",20,null,"RP#2","Chris Devenski\nHou - SP,RP",5,null,"RP#2","Luke Gregerson\nHou - RP",2,null,"RP#2","Roberto Osuna\nTor - RP",10,1]
[0,"RP#3","Cam Bedrosian\nLAA - RP",10,2,"RP#3","Zach Britton\nBal - RP",47,null,"RP#3","Tony Zych\nSea - RP",1,null,"RP#3","Steve Cishek\nSea - RP",1,null,"RP#3","Matt Bush\nTex - RP",6,null,"RP#3","Santiago Casilla\nOak - RP",1,null,"RP#3","Sam Dyson\nTex - RP",6,2,"RP#3","Matt Andriese\nTB - SP,RP",16,null,"RP#3","Tyler Thornburg\nBos - RP",5,null,"RP#3","Luis Severino\nNYY - SP,RP",10,1,"RP#3","Andrew Triggs\nOak - SP,RP",8]
[0,"RP#4","Nate Jones\nCWS - RP",10,2,"RP#4","Nathan Karns\nKC - SP,RP",10,1,"RP#4","Edwin Díaz\nSea - RP",15,3,"RP#4","Jeremy Jeffress\nTex - RP",1,null,"RP#4","Álex Colomé\nTB - RP",14,2,"RP#4","Dan Otero\nCle - RP",1,null,"RP#4","Kelvin Herrera\nKC - RP",6,2,"RP#4","Michael Feliz\nHou - RP",1,null,"RP#4","Francis Martes\nHou - RP",1,null,"RP#4","Danny Duffy\nKC - SP,RP",10,2,"RP#4","Ryan Dull\nOak - RP",5]
[null,null,"Current Used Points",{"$f":"SUM(D3:D20)","v":260},null,null,"Current Used Points",{"$f":"SUM(H3:H20)","v":250},null,null,"Current Used Points",{"$f":"SUM(L3:L20)","v":259},null,null,"Current Used Points",{"$f":"SUM(P3:P20)","v":255},null,null,"Current Used Points",{"$f":"SUM(T3:T20)","v":254},null,null,"Current Used Points",{"$f":"SUM(X3:X20)","v":256},null,null,"Current Used Points",{"$f":"SUM(AB3:AB20)","v":232},null,null,"Current Used Points",{"$f":"SUM(AF3:AF20)","v":258},null,null,"Current Used Points",{"$f":"SUM(AJ3:AJ20)","v":200},null,null,"Current Used Points",{"$f":"SUM(AN3:AN20)","v":259},null,null,"Current Used Points",{"$f":"SUM(AR3:AR20)","v":255}]
[null,null,"Remaining Points",{"$f":"SUM(260-D21)","v":0},null,null,"Remaining Points",{"$f":"SUM(260-H21)","v":10},null,null,"Remaining Points",{"$f":"SUM(260-L21)","v":1},null,null,"Remaining Points",{"$f":"SUM(260-P21)","v":5},null,null,"Remaining Points",{"$f":"SUM(260-T21)","v":6},null,null,"Remaining Points",{"$f":"SUM(260-X21)","v":4},null,null,"Remaining Points",{"$f":"SUM(260-AB21)","v":28},null,null,"Remaining Points",{"$f":"SUM(260-AF21)","v":2},null,null,"Remaining Points",{"$f":"SUM(260-AJ21)","v":60},null,null,"Remaining Points",{"$f":"SUM(260-AN21)","v":1},null,null,"Remaining Points",{"$f":"SUM(260-AR21)","v":5}]
[null,"Maximum Bidding Points",null,{"$f":"(D22-(18-COUNT(D3:D20))+(IF(COUNT(D3:D20)=18,0,1)))","v":0},null,"Maximum Bidding Points",null,{"$f":"(H22-(18-COUNT(H3:H20))+(IF(COUNT(H3:H20)=18,0,1)))","v":10},null,"Maximum Bidding Points",null,{"$f":"(L22-(18-COUNT(L3:L20))+(IF(COUNT(L3:L20)=18,0,1)))","v":1},null,"Maximum Bidding Points",null,{"$f":"(P22-(18-COUNT(P3:P20))+(IF(COUNT(P3:P20)=18,0,1)))","v":5},null,"Maximum Bidding Points",null,{"$f":"(T22-(18-COUNT(T3:T20))+(IF(COUNT(T3:T20)=18,0,1)))","v":6},null,"Maximum Bidding Points",null,{"$f":"(X22-(18-COUNT(X3:X20))+(IF(COUNT(X3:X20)=18,0,1)))","v":4},null,"Maximum Bidding Points",null,{"$f":"(AB22-(18-COUNT(AB3:AB20))+(IF(COUNT(AB3:AB20)=18,0,1)))","v":28},null,"Maximum Bidding Points",null,{"$f":"(AF22-(18-COUNT(AF3:AF20))+(IF(COUNT(AF3:AF20)=18,0,1)))","v":2},null,"Maximum Bidding Points",null,{"$f":"(AJ22-(18-COUNT(AJ3:AJ20))+(IF(COUNT(AJ3:AJ20)=18,0,1)))","v":60},null,"Maximum Bidding Points",null,{"$f":"(AN22-(18-COUNT(AN3:AN20))+(IF(COUNT(AN3:AN20)=18,0,1)))","v":1},null,"Maximum Bidding Points",null,{"$f":"(AR22-(18-COUNT(AR3:AR20))+(IF(COUNT(AR3:AR20)=18,0,1)))","v":5}]
[null,"Remaining # of Players to Draft",null,{"$f":"18-COUNT(D3:D20)","v":0},null,"Remaining # of Players to Draft",null,{"$f":"18-COUNT(H3:H20)","v":0},null,"Remaining # of Players to Draft",null,{"$f":"18-COUNT(L3:L20)","v":0},null,"Remaining # of Players to Draft",null,{"$f":"18-COUNT(P3:P20)","v":0},null,"Remaining # of Players to Draft",null,{"$f":"18-COUNT(T3:T20)","v":0},null,"Remaining # of Players to Draft",null,{"$f":"18-COUNT(X3:X20)","v":0},null,"Remaining # of Players to Draft",null,{"$f":"18-COUNT(AB3:AB20)","v":0},null,"Remaining # of Players to Draft",null,{"$f":"18-COUNT(AF3:AF20)","v":0},null,"Remaining # of Players to Draft",null,{"$f":"18-COUNT(AJ3:AJ20)","v":0},null,"Remaining # of Players to Draft",null,{"$f":"18-COUNT(AN3:AN20)","v":0},null,"Remaining # of Players to Draft",null,{"$f":"18-COUNT(AR3:AR20)","v":0}]
[]
[]
[null,null,"Daniel Vogelbach\nSea - 1B",5,"r2017",null,"James Shields\nCWS - SP",5,"r2017",null,"Joey Gallo\nTex - Util",5,"r2017",null,"Andrew Benintendi\nBos - OF",5,"r2017",null,"Jurickson Profar\nTex - 1B,2B,3B,SS,OF",5,"r2018",null,"Matt Duffy\nTB - 3B,SS",5,"r2017",null,"Francisco Liriano\nTor - SP",5,"r2017",null,"Steven Souza Jr.\nTB - OF",5,"r2018",null,"Brent Honeywell\nTB - SP",5,"r2018",null,"Alex Bregman\nHou - 3B",5,"r2017",null,"Jonathan Lucroy\nTex - C,1B",5,"r2017"]
[null,null,"Greg Bird\nNYY - 1B",5,"r2017",null,"Yuli Gurriel\nHou - 3B",5,"r2017",null,"Mike Fiers\nHou - SP",5,"r2018",null,"Blake Snell\nTB - SP",5,"r2017",null,"Alex Gordon\nKC - OF",5,"r2018",null,"Tyler Naquin\nCle - OF",5,"r2018",null,"Melvin Upton Jr.\nTor - OF",5,"r2017",null,"Derek Norris\nWas - C",5,"r2018",null,"Marwin González\nHou - 1B,2B,3B,SS,OF",5,"r2018",null,"Blake Swihart\nBos - C,OF",5,"r2018",null,"Aaron Judge\nNYY - OF",5,"r2017"]
[null,null,"Ryon Healy\nOak - 3B",5,"r2017",null,"Mallex Smith\nTB - OF",5,"r2018",null,"Delino DeShields\nTex - OF",5,"r2018",null,"Gleyber Torres\nNYY - SS",5,"r2018",null,"Jarrod Saltalamacchia\nTor - C,1B",5,"r2018",null,"Geovany Soto\nCWS - C",5,"r2018",null,"AJ Reed\nHou - 1B",5,"r2017",null,"Tyler Saladino\nCWS - 2B,3B,SS",5,"r2018",null,"Miguel González\nCWS - SP",5,"r2018",null,"Derek Holland\nCWS - SP",5,"r2018",null,"Alex Cobb\nTB - SP",5,"r2017"]
[null,null,"José Berrios\nMin - SP",5,"r2018",null,"Jason Castro\nMin - C",5,"r2018",null,"Ricky Nolasco\nLAA - SP",5,"r2018",null,"Yan Gomes\nCle - C",5,"r2018",null,"Ariel Miranda\nSea - SP",5,"r2018",null,"Tim Beckham\nTB - 1B,2B,SS",5,"r2018",{"$nulls":5},"Reynaldo López\nCWS - SP,RP",5,"r2018",null,"James McCann\nDet - C",5,"r2018",null,"Charlie Morton\nHou - SP",5,"r2018",null,"Jacob May",null,"r2018"]
[null,null,"Frankie Montás\nOak - RP",5,"r2018",null,"Jorge Soler\nKC - OF",5,"r2018",null,"Carson Fulmer\nCWS - RP",5,"r2018",null,"Rafael Devers\nBos - 3B",5,"r2018",null,"Tyler Clippard\nNYY - RP",5,"r2018",null,"Trevor Plouffe\nOak - 1B,3B",5,"r2018",{"$nulls":5},"Erasmo Ramírez\nTB - RP",5,"r2018",null,"Yonder Alonso\nOak - 1B",5,"r2018",null,"Glen Perkins\nMin - RP",5,"r2018",null,"James Kaprielian\nNYY - SP",5,"r2018"]
[null,null,"Rowdy Tellez\nTor - 1B",5,"r2018",null,"Bradley Zimmer\nCle - OF",5,"r2018",null,"Franklin Barreto\nOak - SS",5,"r2018",null,"Raúl Mondesí\nKC - 2B",5,"r2018",null,"Joe Kelly\nBos - SP,RP",5,"r2018",null,"Byung Ho Park\nMin - 1B",5,"r2018",{"$nulls":5},"Alcides Escobar\nKC - SS",5,"r2018",null,"Nick Tropeano\nLAA - SP",5,"r2018",null,"Willy Adames\nTB - SS",5,"r2018",null,"Danny Espinosa\nLAA - SS",5,"r2018"]
[null,null,"Joe Jimenez\nDet - RP",5,"r2018",null,"Travis Wood\nKC - RP",5,"r2018",null,"Clint Frazier\nNYY - OF",5,"r2018",null,"Kyle Gibson\nMin - SP",5,"r2018",null,"Matt Joyce\nOak - OF",5,"r2018",{"$nulls":9},"Tyler O'Neill\nSea - OF",5,"r2018",null,"Carson Smith\nBos - RP",5,"r2018",null,"Vladimir Guerrero Jr.\nTor - 3B",5,"r2018",null,"Steve Selsky\nBos - OF",5,"r2018"]
[null,null,{"$f":"\"Draft Order = \"&VLOOKUP(\"Lightning (Mike Goodman)\",draft_order,2,FALSE)","v":"Draft Order = 7"},{"$nulls":3},{"$f":"\"Draft Order = \"&VLOOKUP(\"Evolution (Bruce)\",draft_order,2,FALSE)","v":"Draft Order = 2"},{"$nulls":3},{"$f":"\"Draft Order = \"&VLOOKUP(\"Miggy Pop (Colin)\",draft_order,2,FALSE)","v":"Draft Order = 9"},{"$nulls":3},{"$f":"\"Draft Order = \"&VLOOKUP(\"Woap (Mike)\",draft_order,2,FALSE)","v":"Draft Order = 4"},{"$nulls":3},{"$f":"\"Draft Order = \"&VLOOKUP(\"The Dominant Brand (Brandon)\",draft_order,2,FALSE)","v":"Draft Order = 3"},{"$nulls":3},{"$f":"\"Draft Order = \"&VLOOKUP(\"Guzzlers (Rhonda)\",draft_order,2,FALSE)","v":"Draft Order = 10"},{"$nulls":3},{"$f":"\"Draft Order = \"&VLOOKUP(\"Moneyballers (Rob)\",draft_order,2,FALSE)","v":"Draft Order = 5"},{"$nulls":3},{"$f":"\"Draft Order = \"&VLOOKUP(\"Booya's (Cathy)\",draft_order,2,FALSE)","v":"Draft Order = 6"},{"$nulls":3},{"$f":"\"Draft Order = \"&VLOOKUP(\"Freebirds (Todd)\",draft_order,2,FALSE)","v":"Draft Order = 1"},{"$nulls":3},{"$f":"\"Draft Order = \"&VLOOKUP(\"Numbats (Tom)\",draft_order,2,FALSE)","v":"Draft Order = 8"},{"$nulls":3},{"$f":"\"Draft Order = \"&VLOOKUP(\"TheDunnShow (Dave)\",draft_order,2,FALSE)","v":"Draft Order = 11"}]

{"sheet":"Draft List","index":1,"n_rows":271,"n_cols":12,"rows_kept":271}
[270,"Owner","Player","Bid","Team/Position","Rank","AB/Innings","R/Wins","HR/Saves","RBI/SO","SB/ERA","Avg./WHIP"]
[1,"Lightning (Mike Goodman)","Gary Sánchez","15","NYY - C","62","60/201","34","20","42","1",".299"]
[2,"Lightning (Mike Goodman)","Rougned Odor","15","Tex - 2B","43","164/605","89","33","88","14",".271"]
[3,"Lightning (Mike Goodman)","Adrián Béltre","23","Tex - 3B","48","175/583","89","32","104","1",".300"]
[4,"Lightning (Mike Goodman)","Francisco Lindor","15","Cle - SS","25","182/604","99","15","78","19",".301"]
[5,"Lightning (Mike Goodman)","Nomar Mazara","10","Tex - OF","179","137/516","59","20","64","0",".266"]
[6,"Lightning (Mike Goodman)","Joe Musgrove","5","Hou - SP","469","62.0","4","0","55","4.06","1.21"]
[7,"Lightning (Mike Goodman)","Sean Manaea","10","Oak - SP","160","144.2","7","0","124","3.86","1.19"]
[8,"Lightning (Mike Goodman)","Dylan Bundy","10","Bal - SP,RP","417","109.2","10","0","104","4.02","1.38"]
[9,"Lightning (Mike Goodman)","Ken Giles","25","Hou - RP","155","65.2","2","15","102","4.11","1.29"]
[10,"Lightning (Mike Goodman)","Cam Bedrosian","10","LAA - RP","274","40.1","2","1","51","1.12","1.09"]
[11,"Lightning (Mike Goodman)","Nate Jones","10","CWS - RP","281","70.2","5","3","80","2.29","0.89"]
[12,"Lightning (Mike Goodman)","Daniel Vogelbach","5","Sea - 1B","1518","1/12","0","0","0","0",".083"]
[13,"Lightning (Mike Goodman)","Greg Bird","5","NYY - 1B","235","-/-","-","-","-","-","-"]
[14,"Lightning (Mike Goodman)","Ryon Healy","5","Oak - 3B","167","82/269","36","13","37","0",".305"]
[15,"Miggy Pop (Colin)","Salvador Pérez","19","KC - C","147","127/514","57","22","64","0",".247"]
[16,"Miggy Pop (Colin)","Miguel Cabrera","50","Det - 1B","13","188/595","92","38","108","0",".316"]
[17,"Miggy Pop (Colin)","Mark Trumbo","10","Bal - OF","89","157/613","94","47","108","2",".256"]
[18,"Miggy Pop (Colin)","Jackie Bradley Jr.","10","Bos - OF","108","149/558","94","26","87","9",".267"]
[19,"Miggy Pop (Colin)","Tyler Skaggs","5","LAA - SP","282","49.2","3","0","50","4.17","1.49"]
[20,"Miggy Pop (Colin)","Andrew Heaney","13","LAA - SP","570","6.0","0","0","7","6.00","1.17"]
[21,"Miggy Pop (Colin)","Brad Brach","1","Bal - RP","332","79.0","10","2","92","2.05","1.04"]
[22,"Miggy Pop (Colin)","Edwin Díaz","15","Sea - RP","98","51.2","0","18","88","2.79","1.16"]
["23","Miggy Pop (Colin)","Joey Gallo","5","Tex - Util","563","1/125","2","1","1","1",".040"]
[24,"The Dominant Brand (Brandon)","Eric Hosmer","11","KC - 1B","79","161/605","80","25","104","5",".266"]
[25,"The Dominant Brand (Brandon)","Xander Bogaerts","35","Bos - SS","22","192/652","115","21","89","13",".294"]
[26,"The Dominant Brand (Brandon)","Melky Cabrera","11","CWS - OF","220","175/591","70","14","86","2",".296"]
[27,"The Dominant Brand (Brandon)","Carlos Gómez","5","Tex - OF","227","95/411","45","13","53","18",".231"]
[28,"The Dominant Brand (Brandon)","Carlos Beltrán","5","Hou - OF","178","163/552","73","29","93","1",".295"]
[29,"The Dominant Brand (Brandon)","Kendrys Morales","10","Tor - 1B,OF","152","147/558","65","30","93","0",".263"]
[30,"The Dominant Brand (Brandon)","Ervin Santana","10","Min - SP","242","181.1","7","0","149","3.38","1.22"]
[31,"The Dominant Brand (Brandon)","Álex Colomé","14","TB - RP","220","56.2","2","37","71","1.91","1.02"]
[32,"Guzzlers (Rhonda)","Brian Dozier","8","Min - 2B","33","165/615","104","42","99","18",".268"]
[33,"Guzzlers (Rhonda)","Brad Miller","6","TB - 1B,SS","154","133/548","73","30","81","6",".243"]
[34,"Guzzlers (Rhonda)","Nelson Cruz","43","Sea - OF","30","169/589","96","43","105","2",".287"]
[35,"Guzzlers (Rhonda)","Mookie Betts","15","Bos - OF","2","214/672","122","31","113","26",".318"]
[36,"Guzzlers (Rhonda)","Corey Kluber","37","Cle - SP","31","215.0","18","0","227","3.14","1.06"]
[37,"Guzzlers (Rhonda)","Justin Verlander","27","Det - SP","47","227.2","16","0","254","3.04","1.00"]
[38,"Guzzlers (Rhonda)","Craig Kimbrel","27","Bos - RP","108","53.0","2","31","83","3.40","1.09"]
[39,"Guzzlers (Rhonda)","Brandon Kintzler","5","Min - RP","283","54.1","0","17","35","3.15","1.23"]
[40,"Guzzlers (Rhonda)","Matt Duffy","5","TB - 3B,SS","611","86/333","41","5","28","8",".258"]
[41,"Numbats (Tom)","Evan Gattis","20","Hou - C","148","112/447","58","32","72","2",".251"]
[42,"Numbats (Tom)","Carlos Santana","20","Cle - 1B","87","151/582","89","34","87","5",".259"]
[43,"Numbats (Tom)","Yoan Moncada","11","CWS - 3B","310","4/19","3","0","1","0",".211"]
[44,"Numbats (Tom)","Rajai Davis","5","Oak - OF","236","113/454","74","12","48","43",".249"]
[45,"Numbats (Tom)","Jharel Cotton","5","Oak - SP","211","29.1","2","0","23","2.15","0.82"]
[46,"Numbats (Tom)","Yu Darvish","23","Tex - SP","34","100.1","7","0","132","3.41","1.12"]
[47,"Numbats (Tom)","Luis Severino","10","NYY - SP,RP","948","71.0","3","0","66","5.83","1.45"]
[48,"Numbats (Tom)","Danny Duffy","10","KC - SP,RP","105","179.2","12","0","188","3.51","1.14"]
[49,"Numbats (Tom)","Alex Bregman","5","Hou - 3B","92","53/201","31","8","34","2",".264"]
[50,"Woap (Mike)","Víctor Martínez","1","Det - 1B","165","160/553","65","27","86","0",".289"]
[51,"Woap (Mike)","Robinson Canó","26","Sea - 2B","26","195/655","107","39","103","0",".298"]
[52,"Woap (Mike)","Troy Tulowitzki","5","Tor - SS","141","125/492","54","24","79","1",".254"]
[53,"Woap (Mike)","Mike Trout","63","LAA - OF","1","173/549","123","29","100","30",".315"]
[54,"Woap (Mike)","Mike Napoli","5","Tex - 1B","177","133/557","92","34","101","5",".239"]
[55,"Woap (Mike)","J.A. Happ","6","Tor - SP","185","195.0","20","0","163","3.18","1.17"]
[56,"Woap (Mike)","Michael Fulmer","15","Det - SP","116","159.0","11","0","132","3.06","1.12"]
[57,"Woap (Mike)","Andrew Benintendi","5","Bos - OF","117","31/105","16","2","14","1",".295"]
[58,"Woap (Mike)","Blake Snell","5","TB - SP","231","89.0","6","0","98","3.54","1.62"]
[59,"Evolution (Bruce)","Starlin Castro","15","NYY - 2B","248","156/577","63","21","70","4",".270"]
[60,"Evolution (Bruce)","Miguel Sano","15","Min - 3B,OF","144","103/437","57","25","66","1",".236"]
[61,"Evolution (Bruce)","Tim Anderson","10","CWS - SS","203","116/410","57","9","30","10",".283"]
[62,"Evolution (Bruce)","Leonys Martín","5","Sea - OF","308","128/518","72","15","47","24",".247"]
[63,"Evolution (Bruce)","George Springer","15","Hou - OF","28","168/644","116","29","82","9",".261"]
[64,"Evolution (Bruce)","Nathan Karns","10","KC - SP,RP","860","94.1","6","1","101","5.15","1.48"]
[65,"Evolution (Bruce)","Lance McCullers Jr.","10","Hou - SP","136","81.0","6","0","106","3.22","1.54"]
[66,"Evolution (Bruce)","Danny Salazar","33","Cle - SP","112","137.1","11","0","161","3.87","1.34"]
[67,"Evolution (Bruce)","Chris Tillman","5","Bal - SP","262","172.0","16","0","140","3.77","1.28"]
[68,"Evolution (Bruce)","Darren O'Day","2","Bal - RP","376","31.0","3","3","38","3.77","1.23"]
[69,"Evolution (Bruce)","Francisco Rodríguez","32","Det - RP","193","58.1","3","44","52","3.24","1.13"]
[70,"Evolution (Bruce)","James Shields","5","CWS - SP","1237","181.2","6","0","135","5.85","1.60"]
[71,"Evolution (Bruce)","Yuli Gurriel","5","Hou - 3B","234","34/130","13","3","15","1",".262"]
[72,"Moneyballers (Rob)","Edwin Encarnación","50","Cle - 1B","29","158/601","99","42","127","2",".263"]
[73,"Moneyballers (Rob)","Elvis Andrus","12","Tex - SS","159","153/506","75","8","69","24",".302"]
[74,"Moneyballers (Rob)","Jarrod Dyson","5","Sea - OF","285","83/299","46","1","25","30",".278"]
[75,"Moneyballers (Rob)","Kevin Pillar","15","Tor - OF","261","146/548","59","7","53","14",".266"]
[76,"Moneyballers (Rob)","Marco Estrada","10","Tor - SP","189","176.0","9","0","165","3.48","1.12"]
[77,"Moneyballers (Rob)","Garrett Richards","11","LAA - SP","180","34.2","1","0","34","2.34","1.33"]
[78,"Moneyballers (Rob)","Rick Porcello","6","Bos - SP","102","223.0","22","0","189","3.15","1.01"]
[79,"Moneyballers (Rob)","Aarón Sánchez","15","Tor - SP","106","192.0","15","0","161","3.00","1.17"]
[80,"Moneyballers (Rob)","Sam Dyson","6","Tex - RP","243","70.1","3","38","55","2.43","1.22"]
[81,"Moneyballers (Rob)","Kelvin Herrera","6","KC - RP","177","72.0","2","12","86","2.75","0.96"]
[82,"Moneyballers (Rob)","Francisco Liriano","5","Tor - SP","290","163.0","8","0","168","4.69","1.48"]
[83,"Moneyballers (Rob)","Melvin Upton Jr.","5","Tor - OF","369","117/492","64","20","61","27",".238"]
[84,"Moneyballers (Rob)","AJ Reed","5","Hou - 1B","1299","20/122","11","3","8","0",".164"]
[85,"TheDunnShow (Dave)","Hanley Ramírez","31","Bos - 1B","59","157/549","81","30","111","9",".286"]
[86,"TheDunnShow (Dave)","Dustin Pedroia","6","Bos - 2B","110","201/633","105","15","74","7",".318"]
[87,"TheDunnShow (Dave)","Josh Donaldson","50","Tor - 3B","10","164/577","122","37","99","7",".284"]
[88,"TheDunnShow (Dave)","Carlos Correa","15","Hou - SS","20","158/577","76","20","96","13",".274"]
[89,"TheDunnShow (Dave)","Cameron Maybin","5","LAA - OF","281","110/349","65","4","43","15",".315"]
[90,"TheDunnShow (Dave)","Rusney Castillo","10","Bos - OF","1216","2/8","4","0","0","0",".250"]
[91,"TheDunnShow (Dave)","Carlos Rodon","11","CWS - SP","186","165.0","9","0","168","4.04","1.39"]
[92,"TheDunnShow (Dave)","Drew Pomeranz","5","Bos - SP","237","170.2","11","0","186","3.32","1.18"]
[93,"TheDunnShow (Dave)","Steven Wright","5","Bos - SP","348","156.2","13","0","127","3.33","1.24"]
[94,"TheDunnShow (Dave)","Will Harris","2","Hou - RP","342","64.0","1","12","69","2.25","1.05"]
[95,"TheDunnShow (Dave)","Roberto Osuna","10","Tor - RP","107","74.0","4","36","82","2.68","0.93"]
[96,"TheDunnShow (Dave)","Jonathan Lucroy","5","Tex - C,1B","82","143/490","67","24","81","5",".292"]
[97,"TheDunnShow (Dave)","Aaron Judge","5","NYY - OF","1245","15/84","10","4","10","0",".179"]
[98,"TheDunnShow (Dave)","Alex Cobb","5","TB - SP","194","22.0","1","0","16","8.59","1.77"]
[99,"Booya's (Cathy)","Russell Martin","24","Tor - C","189","105/455","62","20","74","2",".231"]
[100,"Booya's (Cathy)","Evan Longoria","25","TB - 3B","75","173/633","81","36","98","0",".273"]
[101,"Booya's (Cathy)","José Ramírez","15","Cle - 3B,OF","176","176/565","84","11","76","22",".312"]
[102,"Booya's (Cathy)","Trevor Bauer","13","Cle - SP,RP","303","190.0","12","0","168","4.26","1.31"]
[103,"Freebirds (Todd)","Kyle Seager","30","Sea - 3B","44","166/597","89","30","99","3",".278"]
[104,"Freebirds (Todd)","Khris Davis","10","Oak - OF","67","137/555","85","42","102","1",".247"]
[105,"Freebirds (Todd)","Cole Hamels","10","Tex - SP","85","200.2","15","0","200","3.32","1.31"]
[106,"Freebirds (Todd)","Marcus Stroman","15","Tor - SP","145","204.0","9","0","166","4.37","1.29"]
[107,"Freebirds (Todd)","Eduardo Rodríguez","10","Bos - SP","597","107.0","3","0","100","4.71","1.30"]
[108,"TheDunnShow (Dave)","Chris Sale","47","Bos - SP","25","226.2","17","0","233","3.34","1.04"]
[109,"The Dominant Brand (Brandon)","Brian McCann","11","Hou - C","166","104/429","56","20","58","1",".242"]
[110,"Numbats (Tom)","J.D. Martínez","20","Det - OF","35","141/460","69","22","68","1",".307"]
[111,"Lightning (Mike Goodman)","Chris Archer","41","TB - SP","60","201.1","9","0","233","4.02","1.24"]
[112,"Miggy Pop (Colin)","José Altuve","51","Hou - 2B","7","216/640","108","24","96","30",".338"]
[113,"Moneyballers (Rob)","Welington Castillo","6","Bal - C","184","110/416","41","14","68","2",".264"]
[114,"Booya's (Cathy)","Aroldis Chapman","48","NYY - RP","65","58.0","4","36","90","1.55","0.86"]
[115,"Evolution (Bruce)","Zach Britton","47","Bal - RP","84","67.0","2","47","74","0.54","0.84"]
[116,"Numbats (Tom)","Justin Upton","42","Det - OF","57","140/570","81","31","87","9",".246"]
[117,"Freebirds (Todd)","Manny Machado","64","Bal - 3B,SS","8","188/640","105","37","96","0",".294"]
[118,"Booya's (Cathy)","Masahiro Tanaka","38","NYY - SP","71","199.2","14","0","165","3.07","1.08"]
[119,"The Dominant Brand (Brandon)","Carlos Carrasco","32","Cle - SP","74","146.1","11","0","150","3.32","1.15"]
[120,"Miggy Pop (Colin)","José Quintana","29","CWS - SP","93","208.0","13","0","181","3.20","1.16"]
[121,"Booya's (Cathy)","Andrew Miller","20","Cle - RP","122","74.1","10","12","123","1.45","0.69"]
[122,"Lightning (Mike Goodman)","Adam Jones","41","Bal - OF","73","164/619","86","29","83","2",".265"]
[123,"Evolution (Bruce)","Todd Frazier","37","CWS - 1B,3B","69","133/590","89","40","98","15",".225"]
[124,"Woap (Mike)","David Robertson","27","CWS - RP","139","62.1","5","37","75","3.47","1.36"]
[125,"Moneyballers (Rob)","José Abreu","37","CWS - 1B","43","183/624","67","25","100","0",".293"]
[126,"Woap (Mike)","Cody Allen","32","Cle - RP","165","68.0","3","32","87","2.51","1.00"]
[127,"Guzzlers (Rhonda)","Chris Davis","37","Bal - 1B","58","125/566","99","38","84","1",".221"]
[128,"The Dominant Brand (Brandon)","Ian Kinsler","35","Det - 2B","69","178/618","117","28","83","14",".288"]
[129,"Woap (Mike)","Mike Moustakas","17","KC - 3B","204","25/104","12","7","13","0",".240"]
[130,"Numbats (Tom)","Albert Pujols","25","LAA - 1B","98","159/593","71","31","119","4",".268"]
[131,"Booya's (Cathy)","David Price","30","Bos - SP","101","230.0","17","0","228","3.99","1.20"]
[132,"TheDunnShow (Dave)","José Bautista","31","Tor - OF","84","99/423","68","22","69","2",".234"]
[133,"Freebirds (Todd)","Dellin Betances","20","NYY - RP","214","73.0","3","12","126","3.08","1.12"]
[134,"Moneyballers (Rob)","Ryan Madson","15","Oak - RP","271","64.2","6","30","49","3.62","1.28"]
[135,"Moneyballers (Rob)","Jason Kipnis","15","Cle - 2B","83","168/610","91","23","82","15",".275"]
[136,"Numbats (Tom)","Félix Hernández","27","Sea - SP","115","153.1","11","0","122","3.82","1.32"]
[137,"Woap (Mike)","Matt Holliday","25","NYY - 1B,OF","169","94/382","48","20","62","0",".246"]
[138,"Guzzlers (Rhonda)","Dallas Keuchel","23","Hou - SP","128","168.0","9","0","144","4.55","1.29"]
[139,"Lightning (Mike Goodman)","James Paxton","26","Sea - SP","134","121.0","6","0","117","3.79","1.31"]
[140,"The Dominant Brand (Brandon)","Kevin Gausman","24","Bal - SP","135","179.2","9","0","174","3.61","1.28"]
[141,"The Dominant Brand (Brandon)","Nick Castellanos","23","Det - 3B","228","117/411","54","18","58","1",".285"]
[142,"TheDunnShow (Dave)","C.J. Cron","11","LAA - 1B","253","113/407","51","16","69","2",".278"]
[143,"TheDunnShow (Dave)","Andrew Triggs","8","Oak - SP,RP","295","56.1","1","0","55","4.31","1.22"]
[144,"Numbats (Tom)","Jean Segura","33","Sea - 2B,SS","85","203/637","102","20","64","33",".319"]
[145,"Miggy Pop (Colin)","Jonathan Schoop","12","Bal - 2B","185","164/615","82","25","82","1",".267"]
[146,"Woap (Mike)","Stephen Vogt","3","Oak - C","278","123/490","54","14","56","0",".251"]
[147,"Booya's (Cathy)","Jake Odorizzi","13","TB - SP","168","187.2","10","0","166","3.69","1.19"]
[148,"Miggy Pop (Colin)","Lorenzo Cain","21","KC - OF","109","114/397","56","9","56","14",".287"]
[149,"Booya's (Cathy)","Matt Andriese","16","TB - SP,RP","317","127.2","8","1","109","4.37","1.22"]
[150,"Moneyballers (Rob)","Brandon Moss","6","KC - 1B,OF","258","93/413","66","28","67","1",".225"]
[151,"Numbats (Tom)","Devon Travis","3","Tor - 2B","192","123/410","54","11","50","4",".300"]
[152,"Guzzlers (Rhonda)","Kole Calhoun","10","LAA - OF","123","161/594","91","18","75","2",".271"]
[153,"Freebirds (Todd)","Chris Devenski","5","Hou - SP,RP","329","108.1","4","1","104","2.16","0.91"]
[154,"Woap (Mike)","Michael Pineda","18","NYY - SP","197","175.2","6","0","207","4.82","1.35"]
[155,"Booya's (Cathy)","Chris Carter","8","NYY - 1B","296","122/549","84","41","94","3",".222"]
[156,"Evolution (Bruce)","Wilson Ramos","10","TB - C","309","148/482","58","22","80","0",".307"]
[157,"Miggy Pop (Colin)","Marcus Semien","5","Oak - SS","226","135/568","72","27","75","10",".238"]
[158,"Freebirds (Todd)","Tyler Thornburg","5","Bos - RP","333","67.0","8","13","90","2.15","0.94"]
[159,"The Dominant Brand (Brandon)","Hisashi Iwakuma","6","Sea - SP","223","199.0","16","0","147","4.12","1.33"]
[160,"Booya's (Cathy)","Steve Pearce","1","Tor - 1B,2B,OF","305","76/264","35","13","35","0",".288"]
[161,"The Dominant Brand (Brandon)","Daniel Norris","3","Det - SP","455","69.1","4","0","71","3.38","1.40"]
[162,"Guzzlers (Rhonda)","Pablo Sandoval","12","Bos - 3B","321","0/6","0","0","0","0",".000"]
[163,"Woap (Mike)","Steve Cishek","1","Sea - RP","337","64.0","4","25","76","2.81","1.02"]
[164,"Woap (Mike)","Matt Boyd","2","Det - SP","876","97.1","6","0","82","4.53","1.29"]
[165,"The Dominant Brand (Brandon)","Matt Bush","6","Tex - RP","350","61.2","7","1","61","2.48","0.94"]
[166,"The Dominant Brand (Brandon)","Mychal Givens","10","Bal - RP","354","74.2","8","0","96","3.13","1.27"]
[167,"Miggy Pop (Colin)","Matt Shoemaker","5","LAA - SP","201","160.0","9","0","143","3.88","1.23"]
[168,"Freebirds (Todd)","Byron Buxton","11","Min - OF","172","67/298","44","10","38","10",".225"]
[169,"The Dominant Brand (Brandon)","Jason Grilli","3","Tor - RP","362","59.0","7","4","81","4.12","1.29"]
[170,"Booya's (Cathy)","Didi Gregorius","1","NYY - SS","302","155/562","68","20","70","7",".276"]
[171,"TheDunnShow (Dave)","Sonny Gray","2","Oak - SP","217","117.0","5","0","94","5.69","1.50"]
[172,"Woap (Mike)","Ian Kennedy","6","KC - SP","226","195.2","11","0","184","3.68","1.22"]
[173,"Woap (Mike)","Jeremy Jeffress","1","Tex - RP","347","58.0","3","27","42","2.33","1.26"]
[174,"Numbats (Tom)","Drew Smyly","1","Sea - SP","198","175.1","7","0","167","4.88","1.27"]
[175,"Miggy Pop (Colin)","Collin McHugh","6","Hou - SP","295","184.2","13","0","177","4.34","1.41"]
[176,"Moneyballers (Rob)","Sean Doolittle","10","Oak - RP","393","39.0","2","4","45","3.23","1.05"]
[177,"Miggy Pop (Colin)","Danny Valencia","3","Sea - 1B,3B,OF","318","135/471","72","17","51","1",".287"]
[178,"Freebirds (Todd)","Max Kepler","5","Min - OF","255","93/396","52","17","63","6",".235"]
[179,"Booya's (Cathy)","Brett Gardner","1","NYY - OF","216","143/547","80","7","41","16",".261"]
[180,"Moneyballers (Rob)","Jason Hammel","6","KC - SP","338","166.2","15","0","144","3.83","1.21"]
[181,"Guzzlers (Rhonda)","Kendall Graveman","1","Oak - SP","574","186.0","10","0","108","4.11","1.31"]
[182,"Freebirds (Todd)","Michael Brantley","9","Cle - OF","151","9/39","5","0","7","1",".231"]
[183,"Numbats (Tom)","Tyson Ross","1","Tex - SP","210","5.1","0","0","5","11.81","1.88"]
[184,"Numbats (Tom)","Luke Gregerson","2","Hou - RP","335","57.2","4","15","67","3.28","0.97"]
[185,"TheDunnShow (Dave)","Ryan Dull","5","Oak - RP","341","74.1","5","3","73","2.42","0.87"]
[186,"Miggy Pop (Colin)","Matt Strahm","3","KC - RP","418","22.0","2","0","30","1.23","1.09"]
[187,"Freebirds (Todd)","Francis Martes","1","Hou - RP","794","-","-","-","-","-","-"]
[188,"Booya's (Cathy)","Josh Tomlin","1","Cle - SP","360","174.0","13","0","118","4.40","1.19"]
[189,"Woap (Mike)","Kevin Kiermaier","2","TB - OF","252","90/366","55","12","37","21",".246"]
[190,"Guzzlers (Rhonda)","Jacoby Ellsbury","1","NYY - OF","199","145/551","71","9","56","20",".263"]
[191,"Numbats (Tom)","Huston Street","1","LAA - RP","492","22.1","3","9","14","6.45","1.93"]
[192,"Lightning (Mike Goodman)","Jordan Zimmermann","1","Det - SP","264","105.1","9","0","66","4.87","1.37"]
[193,"TheDunnShow (Dave)","Mike Zunino","1","Sea - C","1139","34/164","16","12","31","0",".207"]
[194,"Miggy Pop (Colin)","Tony Zych","1","Sea - RP","533","13.2","1","0","21","3.29","1.46"]
[195,"Freebirds (Todd)","Zack Collins","1","CWS - C","1350","-/-","-","-","-","-","-"]
[196,"Booya's (Cathy)","Seth Smith","1","Bal - OF","467","94/378","62","16","63","0",".249"]
[197,"Evolution (Bruce)","Corey Dickerson","1","TB - OF","243","125/510","57","24","70","0",".245"]
[198,"Guzzlers (Rhonda)","CC Sabathia","1","NYY - SP","490","179.2","9","0","152","3.91","1.32"]
[199,"Lightning (Mike Goodman)","Mitch Moreland","1","Bos - 1B","298","107/460","49","22","60","1",".233"]
[200,"Freebirds (Todd)","Casey Gillaspie","1","TB - 1B","1495","-/-","-","-","-","-","-"]
[201,"Booya's (Cathy)","Michael Feliz","1","Hou - RP","383","65.0","8","0","95","4.43","1.18"]
[202,"Evolution (Bruce)","Shin-soo Choo","1","Tex - OF","257","43/178","27","7","17","6",".242"]
[203,"Guzzlers (Rhonda)","Santiago Casilla","1","Oak - RP","340","58.0","2","31","65","3.57","1.19"]
[204,"Booya's (Cathy)","Mitch Haniger","2","Sea - OF","1200","25/109","9","5","17","0",".229"]
[205,"Freebirds (Todd)","Andy Ibanez","1","Tex - 2B","1469","-/-","-","-","-","-","-"]
[206,"Evolution (Bruce)","José De León","1","TB - SP","856","17.0","2","0","15","6.35","1.53"]
[207,"Guzzlers (Rhonda)","Sandy León","1","Bos - C","1041","78/252","36","7","35","0",".310"]
[208,"Lightning (Mike Goodman)","Charlie Tilson","1","CWS - OF","1303","1/2","0","0","0","0",".500"]
[209,"Freebirds (Todd)","Jason Groome","1","Bos - SP","704","-","-","-","-","-","-"]
[210,"Evolution (Bruce)","Lucas Giolito","1","CWS - SP","987","21.1","0","0","11","6.75","1.78"]
[211,"Guzzlers (Rhonda)","Dan Otero","1","Cle - RP","349","70.2","5","1","57","1.53","0.91"]
["212","Moneyballers (Rob)","Pedro Álvarez","1","Bal - 3B","459","84/337","43","22","49","1",".249"]
[213,"Freebirds (Todd)","Michael Kopech","1","CWS - SP","779","-","-","-","-","-","-"]
[214,"Freebirds (Todd)","Brent Honeywell","5","TB - SP","773","-","-","-","-","-","-"]
[215,"Evolution (Bruce)","Mallex Smith","5","TB - OF","1096","45/189","28","3","22","16",".238"]
[216,"Lightning (Mike Goodman)","Josh Reddick","1","Hou - OF","260","112/398","53","10","37","8",".281"]
[217,"The Dominant Brand (Brandon)","Jurickson Profar","5","Tex - 1B,2B,3B,SS,OF","1141","65/272","35","5","20","2",".239"]
[218,"Woap (Mike)","Gleyber Torres","5","NYY - SS","1397","-/-","-","-","-","-","-"]
[219,"Booya's (Cathy)","Steven Souza Jr.","5","TB - OF","466","106/430","58","17","49","7",".247"]
[220,"Lightning (Mike Goodman)","José Berrios","5","Min - SP","1135","58.1","3","0","49","8.02","1.87"]
[221,"Numbats (Tom)","Blake Swihart","5","Bos - C,OF","1179","16/62","9","0","5","0",".258"]
[222,"Miggy Pop (Colin)","Mike Fiers","5","Hou - SP","501","168.2","11","0","134","4.48","1.36"]
[223,"Guzzlers (Rhonda)","Tyler Naquin","5","Cle - OF","259","95/321","52","14","43","6",".296"]
[224,"Freebirds (Todd)","Marwin González","5","Hou - 1B,2B,3B,SS,OF","462","123/484","55","13","51","12",".254"]
[225,"Evolution (Bruce)","Jason Castro","5","Min - C","1089","69/329","41","11","32","2",".210"]
[226,"The Dominant Brand (Brandon)","Alex Gordon","5","KC - OF","329","98/445","62","17","40","8",".220"]
[227,"Woap (Mike)","Yan Gomes","5","Cle - C","1158","42/251","22","9","34","0",".167"]
[228,"Booya's (Cathy)","Derek Norris","5","Was - C","992","77/415","50","14","42","9",".186"]
[229,"Lightning (Mike Goodman)","Frankie Montás","5","Oak - RP","825","-","-","-","-","-","-"]
[230,"Numbats (Tom)","Derek Holland","5","CWS - SP","961","107.1","7","0","67","4.95","1.41"]
[231,"Miggy Pop (Colin)","Delino DeShields","5","Tex - OF","1036","38/182","36","4","13","8",".209"]
[232,"Guzzlers (Rhonda)","Geovany Soto","5","CWS - C","1180","21/78","11","4","9","0",".269"]
[233,"TheDunnShow (Dave)","James Kaprielian","5","NYY - SP","783","-","-","-","-","-","-"]
[234,"Freebirds (Todd)","Miguel González","5","CWS - SP","487","135.0","5","0","95","3.73","1.24"]
[235,"Woap (Mike)","Bradley Zimmer","5","Cle - OF","1319","-/-","-","-","-","-","-"]
[236,"The Dominant Brand (Brandon)","Jarrod Saltalamacchia","5","Tor - C,1B","1129","42/246","30","12","38","0",".171"]
[237,"Woap (Mike)","Rafael Devers","5","Bos - 3B","1346","-/-","-","-","-","-","-"]
[238,"Booya's (Cathy)","Tyler Saladino","5","CWS - 2B,3B,SS","927","84/298","33","8","38","11",".282"]
[239,"Lightning (Mike Goodman)","Rowdy Tellez","5","Tor - 1B","1427","-/-","-","-","-","-","-"]
[240,"Numbats (Tom)","Charlie Morton","5","Hou - SP","839","17.1","1","0","19","4.15","1.33"]
[241,"Miggy Pop (Colin)","Ricky Nolasco","5","LAA - SP","556","197.2","8","0","144","4.42","1.24"]
[242,"Guzzlers (Rhonda)","Tim Beckham","5","TB - 1B,2B,SS","1124","49/198","25","5","16","2",".247"]
[243,"TheDunnShow (Dave)","Danny Espinosa","5","LAA - SS","425","108/516","66","24","72","9",".209"]
[244,"Freebirds (Todd)","James McCann","5","Det - C","1068","76/344","31","12","48","0",".221"]
[245,"Evolution (Bruce)","Jorge Soler","5","KC - OF","245","54/227","37","12","31","0",".238"]
[246,"The Dominant Brand (Brandon)","Ariel Miranda","5","Sea - SP","422","58.0","5","0","44","3.88","1.12"]
[247,"Woap (Mike)","Raúl Mondesí","5","KC - 2B","1195","25/135","16","2","13","9",".185"]
[248,"Booya's (Cathy)","Reynaldo López","5","CWS - SP,RP","830","44.0","5","0","42","4.91","1.57"]
[249,"Lightning (Mike Goodman)","Joe Jimenez","5","Det - RP","781","-","-","-","-","-","-"]
[250,"Numbats (Tom)","Glen Perkins","5","Min - RP","523","2.0","0","0","3","9.00","3.00"]
[251,"Miggy Pop (Colin)","Carson Fulmer","5","CWS - RP","930","11.2","0","0","10","8.49","1.63"]
[252,"Guzzlers (Rhonda)","Trevor Plouffe","5","Oak - 1B,3B","602","83/319","35","12","47","1",".260"]
[253,"TheDunnShow (Dave)","Steve Selsky","5","Bos - OF","1209","16/51","9","2","7","1",".314"]
[254,"Freebirds (Todd)","Yonder Alonso","5","Oak - 1B","875","122/482","52","7","56","3",".253"]
[255,"Evolution (Bruce)","Travis Wood","5","KC - RP","380","61.0","4","0","47","2.95","1.13"]
[256,"The Dominant Brand (Brandon)","Tyler Clippard","5","NYY - RP","372","63.0","4","3","72","3.57","1.27"]
[257,"Woap (Mike)","Kyle Gibson","5","Min - SP","1093","147.1","6","0","104","5.07","1.56"]
[258,"Booya's (Cathy)","Erasmo Ramírez","5","TB - RP","384","90.2","7","2","63","3.77","1.28"]
[259,"Numbats (Tom)","Willy Adames","5","TB - SS","1366","-/-","-","-","-","-","-"]
[260,"Miggy Pop (Colin)","Franklin Barreto","5","Oak - SS","1310","-/-","-","-","-","-","-"]
[261,"Guzzlers (Rhonda)","Byung Ho Park","5","Min - 1B","1157","41/215","28","12","24","1",".191"]
[262,"Freebirds (Todd)","Nick Tropeano","5","LAA - SP","545","68.1","3","0","68","3.56","1.48"]
[263,"The Dominant Brand (Brandon)","Joe Kelly","5","Bos - SP,RP","939","40.0","4","0","48","5.18","1.70"]
[264,"Booya's (Cathy)","Alcides Escobar","5","KC - SS","397","166/637","57","7","55","17",".261"]
[265,"Numbats (Tom)","Vladimir Guerrero Jr.","5","Tor - 3B","1345","-/-","-","-","-","-","-"]
[266,"Miggy Pop (Colin)","Clint Frazier","5","NYY - OF","1454","-/-","-","-","-","-","-"]
[267,"Freebirds (Todd)","Carson Smith","5","Bos - RP","460","2.2","0","0","2","0.00","1.13"]
[268,"The Dominant Brand (Brandon)","Matt Joyce","5","Oak - OF","1024","56/231","45","13","42","1",".242"]
[269,"Booya's (Cathy)","Tyler O'Neill","5","Sea - OF","1378","-/-","-","-","-","-","-"]
["270","TheDunnShow (Dave)","Jacob May","5","CWS - OF","1449","-/-","-","-","-","-","-"]

{"sheet":"Summary","index":2,"n_rows":13,"n_cols":15,"rows_kept":13}
["Owners","Current Used Points","Remaining Points","Max Bidding Points","Players Left to Draft","C","1B","2B","3B","SS","OF","DH","SP","RP","Reserve"]
["Lightning (Mike Goodman)",{"$f":"used1","v":260},{"$f":"'2017 Pre-Draft Rosters'!D22","v":0},{"$f":"'2017 Pre-Draft Rosters'!D23","v":0},{"$f":"'2017 Pre-Draft Rosters'!D24","v":0},{"$f":"1-COUNT('2017 Pre-Draft Rosters'!D3)","v":0},{"$f":"1-COUNT('2017 Pre-Draft Rosters'!D4)","v":0},{"$f":"1-COUNT('2017 Pre-Draft Rosters'!D5)","v":0},{"$f":"1-COUNT('2017 Pre-Draft Rosters'!D6)","v":0},{"$f":"1-COUNT('2017 Pre-Draft Rosters'!D7)","v":0},{"$f":"3-COUNT('2017 Pre-Draft Rosters'!D8:D10)","v":0},{"$f":"1-COUNT('2017 Pre-Draft Rosters'!D11)","v":0},{"$f":"5-COUNT('2017 Pre-Draft Rosters'!D12:D16)","v":0},{"$f":"4-COUNT('2017 Pre-Draft Rosters'!D17:D20)","v":0},{"$f":"7-COUNT('2017 Pre-Draft Rosters'!D27:D33)","v":0}]
["Evolution (Bruce)",{"$f":"used2","v":250},{"$f":"'2017 Pre-Draft Rosters'!H22","v":10},{"$f":"'2017 Pre-Draft Rosters'!H23","v":10},{"$f":"'2017 Pre-Draft Rosters'!H24","v":0},{"$f":"1-COUNT('2017 Pre-Draft Rosters'!H3)","v":0},{"$f":"1-COUNT('2017 Pre-Draft Rosters'!H4)","v":0},{"$f":"1-COUNT('2017 Pre-Draft Rosters'!H5)","v":0},{"$f":"1-COUNT('2017 Pre-Draft Rosters'!H6)","v":0},{"$f":"1-COUNT('2017 Pre-Draft Rosters'!H7)","v":0},{"$f":"3-COUNT('2017 Pre-Draft Rosters'!H8:H10)","v":0},{"$f":"1-COUNT('2017 Pre-Draft Rosters'!H11)","v":0},{"$f":"5-COUNT('2017 Pre-Draft Rosters'!H12:H16)","v":0},{"$f":"4-COUNT('2017 Pre-Draft Rosters'!H17:H20)","v":0},{"$f":"7-COUNT('2017 Pre-Draft Rosters'!H27:H33)","v":0}]
["The Soylent Knights (Colin)",{"$f":"used3","v":259},{"$f":"'2017 Pre-Draft Rosters'!L22","v":1},{"$f":"'2017 Pre-Draft Rosters'!L23","v":1},{"$f":"'2017 Pre-Draft Rosters'!L24","v":0},{"$f":"1-COUNT('2017 Pre-Draft Rosters'!L3)","v":0},{"$f":"1-COUNT('2017 Pre-Draft Rosters'!L4)","v":0},{"$f":"1-COUNT('2017 Pre-Draft Rosters'!L5)","v":0},{"$f":"1-COUNT('2017 Pre-Draft Rosters'!L6)","v":0},{"$f":"1-COUNT('2017 Pre-Draft Rosters'!L7)","v":0},{"$f":"3-COUNT('2017 Pre-Draft Rosters'!L8:L10)","v":0},{"$f":"1-COUNT('2017 Pre-Draft Rosters'!L11)","v":0},{"$f":"5-COUNT('2017 Pre-Draft Rosters'!L12:L16)","v":0},{"$f":"4-COUNT('2017 Pre-Draft Rosters'!L17:L20)","v":0},{"$f":"7-COUNT('2017 Pre-Draft Rosters'!L27:L33)","v":0}]
["Woap (Mike)",{"$f":"used4","v":255},{"$f":"'2017 Pre-Draft Rosters'!P22","v":5},{"$f":"'2017 Pre-Draft Rosters'!P23","v":5},{"$f":"'2017 Pre-Draft Rosters'!P24","v":0},{"$f":"1-COUNT('2017 Pre-Draft Rosters'!P3)","v":0},{"$f":"1-COUNT('2017 Pre-Draft Rosters'!P4)","v":0},{"$f":"1-COUNT('2017 Pre-Draft Rosters'!P5)","v":0},{"$f":"1-COUNT('2017 Pre-Draft Rosters'!P6)","v":0},{"$f":"1-COUNT('2017 Pre-Draft Rosters'!P7)","v":0},{"$f":"3-COUNT('2017 Pre-Draft Rosters'!P8:P10)","v":0},{"$f":"1-COUNT('2017 Pre-Draft Rosters'!P11)","v":0},{"$f":"5-COUNT('2017 Pre-Draft Rosters'!P12:P16)","v":0},{"$f":"4-COUNT('2017 Pre-Draft Rosters'!P17:P20)","v":0},{"$f":"7-COUNT('2017 Pre-Draft Rosters'!P27:P33)","v":0}]
["The Dominant Brand (Brandon)",{"$f":"used5","v":254},{"$f":"'2017 Pre-Draft Rosters'!T22","v":6},{"$f":"'2017 Pre-Draft Rosters'!T23","v":6},{"$f":"'2017 Pre-Draft Rosters'!T24","v":0},{"$f":"1-COUNT('2017 Pre-Draft Rosters'!T3)","v":0},{"$f":"1-COUNT('2017 Pre-Draft Rosters'!T4)","v":0},{"$f":"1-COUNT('2017 Pre-Draft Rosters'!T5)","v":0},{"$f":"1-COUNT('2017 Pre-Draft Rosters'!T6)","v":0},{"$f":"1-COUNT('2017 Pre-Draft Rosters'!T7)","v":0},{"$f":"3-COUNT('2017 Pre-Draft Rosters'!T8:T10)","v":0},{"$f":"1-COUNT('2017 Pre-Draft Rosters'!T11)","v":0},{"$f":"5-COUNT('2017 Pre-Draft Rosters'!T12:T16)","v":0},{"$f":"4-COUNT('2017 Pre-Draft Rosters'!T17:T20)","v":0},{"$f":"7-COUNT('2017 Pre-Draft Rosters'!T27:T33)","v":0}]
["Guzzlers (Rhonda)",{"$f":"used6","v":256},{"$f":"'2017 Pre-Draft Rosters'!X22","v":4},{"$f":"'2017 Pre-Draft Rosters'!X23","v":4},{"$f":"'2017 Pre-Draft Rosters'!X24","v":0},{"$f":"1-COUNT('2017 Pre-Draft Rosters'!X3)","v":0},{"$f":"1-COUNT('2017 Pre-Draft Rosters'!X4)","v":0},{"$f":"1-COUNT('2017 Pre-Draft Rosters'!X5)","v":0},{"$f":"1-COUNT('2017 Pre-Draft Rosters'!X6)","v":0},{"$f":"1-COUNT('2017 Pre-Draft Rosters'!X7)","v":0},{"$f":"3-COUNT('2017 Pre-Draft Rosters'!X8:X10)","v":0},{"$f":"1-COUNT('2017 Pre-Draft Rosters'!X11)","v":0},{"$f":"5-COUNT('2017 Pre-Draft Rosters'!X12:X16)","v":0},{"$f":"4-COUNT('2017 Pre-Draft Rosters'!X17:X20)","v":0},{"$f":"7-COUNT('2017 Pre-Draft Rosters'!X27:X33)","v":1}]
["Moneyballers (Rob)",{"$f":"used7","v":232},{"$f":"'2017 Pre-Draft Rosters'!AB22","v":28},{"$f":"'2017 Pre-Draft Rosters'!AB23","v":28},{"$f":"'2017 Pre-Draft Rosters'!AB24","v":0},{"$f":"1-COUNT('2017 Pre-Draft Rosters'!AB3)","v":0},{"$f":"1-COUNT('2017 Pre-Draft Rosters'!AB4)","v":0},{"$f":"1-COUNT('2017 Pre-Draft Rosters'!AB5)","v":0},{"$f":"1-COUNT('2017 Pre-Draft Rosters'!AB6)","v":0},{"$f":"1-COUNT('2017 Pre-Draft Rosters'!AB7)","v":0},{"$f":"3-COUNT('2017 Pre-Draft Rosters'!AB8:AB10)","v":0},{"$f":"1-COUNT('2017 Pre-Draft Rosters'!AB11)","v":0},{"$f":"5-COUNT('2017 Pre-Draft Rosters'!AB12:AB16)","v":0},{"$f":"4-COUNT('2017 Pre-Draft Rosters'!AB17:AB20)","v":0},{"$f":"7-COUNT('2017 Pre-Draft Rosters'!AB27:AB33)","v":4}]
["Booya's (Cathy)",{"$f":"used8","v":258},{"$f":"'2017 Pre-Draft Rosters'!AF22","v":2},{"$f":"'2017 Pre-Draft Rosters'!AF23","v":2},{"$f":"'2017 Pre-Draft Rosters'!AF24","v":0},{"$f":"1-COUNT('2017 Pre-Draft Rosters'!AF3)","v":0},{"$f":"1-COUNT('2017 Pre-Draft Rosters'!AF4)","v":0},{"$f":"1-COUNT('2017 Pre-Draft Rosters'!AF5)","v":0},{"$f":"1-COUNT('2017 Pre-Draft Rosters'!AF6)","v":0},{"$f":"1-COUNT('2017 Pre-Draft Rosters'!AF7)","v":0},{"$f":"3-COUNT('2017 Pre-Draft Rosters'!AF8:AF10)","v":0},{"$f":"1-COUNT('2017 Pre-Draft Rosters'!AF11)","v":0},{"$f":"5-COUNT('2017 Pre-Draft Rosters'!AF12:AF16)","v":0},{"$f":"4-COUNT('2017 Pre-Draft Rosters'!AF17:AF20)","v":0},{"$f":"7-COUNT('2017 Pre-Draft Rosters'!AF27:AF33)","v":0}]
["Freebirds (Todd)",{"$f":"used9","v":200},{"$f":"'2017 Pre-Draft Rosters'!AJ22","v":60},{"$f":"'2017 Pre-Draft Rosters'!AJ23","v":60},{"$f":"'2017 Pre-Draft Rosters'!AJ24","v":0},{"$f":"1-COUNT('2017 Pre-Draft Rosters'!AJ3)","v":0},{"$f":"1-COUNT('2017 Pre-Draft Rosters'!AJ4)","v":0},{"$f":"1-COUNT('2017 Pre-Draft Rosters'!AJ5)","v":0},{"$f":"1-COUNT('2017 Pre-Draft Rosters'!AJ6)","v":0},{"$f":"1-COUNT('2017 Pre-Draft Rosters'!AJ7)","v":0},{"$f":"3-COUNT('2017 Pre-Draft Rosters'!AJ8:AJ10)","v":0},{"$f":"1-COUNT('2017 Pre-Draft Rosters'!AJ11)","v":0},{"$f":"5-COUNT('2017 Pre-Draft Rosters'!AJ12:AJ16)","v":0},{"$f":"4-COUNT('2017 Pre-Draft Rosters'!AJ17:AJ20)","v":0},{"$f":"7-COUNT('2017 Pre-Draft Rosters'!AJ27:AJ33)","v":0}]
["Numbats (Tom)",{"$f":"used10","v":259},{"$f":"'2017 Pre-Draft Rosters'!AN22","v":1},{"$f":"'2017 Pre-Draft Rosters'!AN23","v":1},{"$f":"'2017 Pre-Draft Rosters'!AN24","v":0},{"$f":"1-COUNT('2017 Pre-Draft Rosters'!AN3)","v":0},{"$f":"1-COUNT('2017 Pre-Draft Rosters'!AN4)","v":0},{"$f":"1-COUNT('2017 Pre-Draft Rosters'!AN5)","v":0},{"$f":"1-COUNT('2017 Pre-Draft Rosters'!AN6)","v":0},{"$f":"1-COUNT('2017 Pre-Draft Rosters'!AN7)","v":0},{"$f":"3-COUNT('2017 Pre-Draft Rosters'!AN8:AN10)","v":0},{"$f":"1-COUNT('2017 Pre-Draft Rosters'!AN11)","v":0},{"$f":"5-COUNT('2017 Pre-Draft Rosters'!AN12:AN16)","v":0},{"$f":"4-COUNT('2017 Pre-Draft Rosters'!AN17:AN20)","v":0},{"$f":"7-COUNT('2017 Pre-Draft Rosters'!AN27:AN33)","v":0}]
["TheDunnShow (Dave)",{"$f":"used11","v":255},{"$f":"'2017 Pre-Draft Rosters'!AR22","v":5},{"$f":"'2017 Pre-Draft Rosters'!AR23","v":5},{"$f":"'2017 Pre-Draft Rosters'!AR24","v":0},{"$f":"1-COUNT('2017 Pre-Draft Rosters'!AR3)","v":0},{"$f":"1-COUNT('2017 Pre-Draft Rosters'!AR4)","v":0},{"$f":"1-COUNT('2017 Pre-Draft Rosters'!AR5)","v":0},{"$f":"1-COUNT('2017 Pre-Draft Rosters'!AR6)","v":0},{"$f":"1-COUNT('2017 Pre-Draft Rosters'!AR7)","v":0},{"$f":"3-COUNT('2017 Pre-Draft Rosters'!AR8:AR10)","v":0},{"$f":"1-COUNT('2017 Pre-Draft Rosters'!AR11)","v":0},{"$f":"5-COUNT('2017 Pre-Draft Rosters'!AR12:AR16)","v":0},{"$f":"4-COUNT('2017 Pre-Draft Rosters'!AR17:AR20)","v":0},{"$f":"7-COUNT('2017 Pre-Draft Rosters'!AR27:AR33)","v":1}]
[{"$nulls":4},{"$f":"SUM(E2:E12)","v":0},{"$f":"SUM(F2:F12)","v":0},0,0,0,0,0,0,0,0,6]

{"sheet":"Catchers","index":3,"n_rows":49,"n_cols":9,"rows_kept":49}
["Player","Team","Rank","H/AB","R","HR","RBI","SB","Avg."]
{"$rows_empty":8}
["Robinson Chirinos","Tex - C","1118","33/147","21","9","20","0",".224"]
[]
[]
["Carlos Ruiz","Sea - C","1151","53/201","21","3","15","3",".264"]
["Dioner Navarro","Tor - C","1155","63/304","26","6","35","1",".207"]
["Carlos Pérez","LAA - C","1156","56/268","25","5","31","1",".209"]
[]
["Drew Butera","KC - C","1163","35/123","18","4","16","0",".285"]
["Austin Romine","NYY - C","1168","40/165","17","4","26","1",".242"]
["Curt Casali","TB - C","1174","42/226","23","8","25","0",".186"]
["Martín Maldonado","LAA - C","1175","42/208","21","8","21","1",".202"]
["Josh Phegley","Oak - C","1178","20/78","11","1","10","0",".256"]
[]
[]
["Álex Ávila","Det - C","1192","36/169","19","7","11","0",".213"]
["Roberto Pérez","Cle - C","1205","28/153","14","3","17","0",".183"]
["Bruce Maxwell","Oak - C","1212","26/92","8","1","14","0",".283"]
["Omar Narváez","CWS - C","1215","27/101","13","1","10","0",".267"]
["Christian Vázquez","Bos - C","1224","39/172","21","1","12","0",".227"]
["Luke Maile","TB - C","1227","27/119","10","3","15","0",".227"]
["Steve Clevenger","Sea - C","1231","15/68","7","1","7","0",".221"]
["Jesús Sucre","TB - C","1232","12/25","4","1","5","0",".480"]
["Brett Nicholas","Tex - C","1250","11/40","5","2","4","0",".275"]
["Caleb Joseph","Bal - C","1271","23/132","7","0","0","0",".174"]
["Tuffy Gosewisch","Sea - C","1281","14/90","8","3","7","0",".156"]
["Juan Graterol","Tor - C","1285","4/14","2","0","3","0",".286"]
["Francisco Peña","Bal - C","1288","8/40","5","1","3","0",".200"]
["John Ryan Murphy","Min - C","1295","12/82","4","1","3","0",".146"]
["Miguel Gonzalez","Det - C","1340","-/-","-","-","-","-","-"]
["Garrett Stubbs","Hou - C","1344","-/-","-","-","-","-","-"]
[]
["Ben Rortvedt","Min - C","1351","-/-","-","-","-","-","-"]
["Justin O'Conner","TB - C","1369","-/-","-","-","-","-","-"]
["Chance Sisco","Bal - C","1374","-/-","-","-","-","-","-"]
["Max Pentecost","Tor - C","1387","-/-","-","-","-","-","-"]
["Taylor Ward","LAA - C","1396","-/-","-","-","-","-","-"]
["Chase Vallot","KC - C","1425","-/-","-","-","-","-","-"]
["Francisco Mejia","Cle - C","1453","-/-","-","-","-","-","-"]
["Max Stassi","Hou - C","1497","1/13","1","0","0","0",".077"]
["Kevan Smith","CWS - C","1512","2/16","2","0","0","0",".125"]

{"sheet":"1st Base","index":4,"n_rows":49,"n_cols":9,"rows_kept":49}
["Player","Team","Rank","H/AB","R","HR","RBI","SB","Avg."]
{"$rows_empty":11}
["Joe Mauer","Min - 1B","439","129/494","68","11","49","2",".261"]
[]
[]
[]
["Luis Valbuena","LAA - 1B,3B","884","76/292","38","13","40","1",".260"]
["Logan Morrison","TB - 1B","901","84/353","45","14","43","4",".238"]
["Prince Fielder","Tex - 1B","959","69/326","29","8","44","0",".212"]
["Billy Butler","NYY - 1B","997","71/250","27","5","35","0",".284"]
["Jefry Marte","LAA - 1B,3B,OF","999","65/258","38","15","44","2",".252"]
["Dae-Ho Lee","Sea - 1B","1043","74/292","33","14","49","0",".253"]
["Justin Smoak","Tor - 1B","1044","65/299","33","14","34","1",".217"]
["James Loney","Tex - 1B","1057","91/343","30","9","34","0",".265"]
["Ryan Rua","Tex - 1B,OF","1061","62/240","40","8","22","9",".258"]
["Nick Franklin","TB - 1B,2B,SS,OF","1112","47/174","18","6","26","6",".270"]
["Kennys Vargas","Min - 1B","1117","35/152","27","10","20","0",".230"]
[]
[]
["Andrew Romine","Det - 1B,2B,3B,SS,OF","1132","41/174","21","2","16","8",".236"]
[]
[]
["Tyler White","Hou - 1B","1164","54/249","24","8","28","1",".217"]
["Chris Johnson","Bal - 1B,3B","1173","54/243","20","5","24","0",".222"]
["Rob Refsnyder","NYY - 1B,2B,OF","1176","38/152","25","0","12","2",".250"]
["Tyler Austin","NYY - 1B","1207","20/83","7","5","12","1",".241"]
["Richie Shaffer","Cle - 1B","1251","12/48","5","1","4","0",".250"]
["Daniel Palka","Min - 1B,OF","1372","-/-","-","-","-","-","-"]
["Casey Kotchman","Tor - 1B","1384","-/-","-","-","-","-","-"]
["Bobby Bradley","Cle - 1B","1410","-/-","-","-","-","-","-"]
["Sam Travis","Bos - 1B","1423","-/-","-","-","-","-","-"]
[]
["Ryan O'Hearn","KC - 1B","1433","-/-","-","-","-","-","-"]
["Ronald Guzman","Tex - 1B","1447","-/-","-","-","-","-","-"]
["Josh Ockimey","Bos - 1B","1475","-/-","-","-","-","-","-"]
["Jake Bauers","TB - 1B","1481","-/-","-","-","-","-","-"]
["Matt Thaiss","LAA - 1B","1490","-/-","-","-","-","-","-"]
[]
["John Hicks","Det - 1B","1499","1/2","1","0","0","0",".500"]

{"sheet":"2nd Base","index":5,"n_rows":38,"n_cols":9,"rows_kept":38}
["Player","Team","Rank","H/AB","R","HR","RBI","SB","Avg."]
{"$rows_empty":8}
["Brett Lawrie","CWS - 2B","888","87/351","35","12","36","7",".248"]
[]
["Whit Merrifield","KC - 2B,OF","1047","88/311","44","2","29","8",".283"]
["Adam Rosales","Oak - 2B,3B,SS","1048","49/214","37","13","35","4",".229"]
["Jed Lowrie","Oak - 2B","1107","89/338","30","2","27","0",".263"]
["Jorge Polanco","Min - 2B,3B,SS","1108","69/245","24","4","27","4",".282"]
["Nick Franklin","TB - 1B,2B,SS,OF","1112","47/174","18","6","26","6",".270"]
["Darwin Barney","Tor - 2B,3B,SS","1113","75/279","35","4","19","2",".269"]
[]
["Andrew Romine","Det - 1B,2B,3B,SS,OF","1132","41/174","21","2","16","8",".236"]
[]
["Shawn O'Malley","Sea - 2B,SS,OF","1160","48/210","24","2","17","6",".229"]
["Rob Refsnyder","NYY - 1B,2B,OF","1176","38/152","25","0","12","2",".250"]
["Yolmer Sánchez","CWS - 2B","1177","32/154","15","4","21","0",".208"]
["Ronald Torreyes","NYY - 2B,3B,SS","1188","40/155","20","1","12","2",".258"]
["Ryan Goins","Tor - 2B,SS","1193","34/183","13","3","12","1",".186"]
[]
["Cliff Pennington","LAA - 2B,SS","1207","36/172","18","3","10","1",".209"]
["Joey Wendle","Oak - 2B","1210","25/96","11","1","11","2",".260"]
["Christian Colón","KC - 2B,3B","1216","34/147","13","1","13","0",".231"]
["Marco Hernández","Bos - 2B,3B","1219","15/51","11","1","5","1",".294"]
["Dónovan Solano","NYY - 2B","1268","5/22","5","1","2","0",".227"]
["Chad Pinder","Oak - 2B","1275","12/51","4","1","4","0",".235"]
["Kaleb Cowart","LAA - 2B,3B","1282","15/85","8","1","8","0",".176"]
["Travis Blankenhorn","Min - 2B","1330","-/-","-","-","-","-","-"]
["Wendell Rijo","Bos - 2B","1439","-/-","-","-","-","-","-"]
["Jonathan Arauz","Hou - 2B,SS","1467","-/-","-","-","-","-","-"]
[]
["Max Schrock","Oak - 2B","1473","-/-","-","-","-","-","-"]

{"sheet":"3rd Base","index":6,"n_rows":51,"n_cols":9,"rows_kept":51}
["Player","Team","Rank","H/AB","R","HR","RBI","SB","Avg."]
[]
[]
[]
[]
[]
[]
["Yunel Escobar","LAA - 3B","379","157/517","68","5","39","0",".304"]
["Chase Headley","NYY - 3B","435","118/467","58","14","51","8",".253"]
[]
[]
[]
["Luis Valbuena","LAA - 1B,3B","884","76/292","38","13","40","1",".260"]
[]
["Brock Holt","Bos - 3B,OF","936","74/290","45","7","34","4",".255"]
["Cheslor Cuthbert","KC - 3B","943","130/475","49","12","46","2",".274"]
["Jefry Marte","LAA - 1B,3B,OF","999","65/258","38","15","44","2",".252"]
["Adam Rosales","Oak - 2B,3B,SS","1048","49/214","37","13","35","4",".229"]
["Eduardo Escobar","Min - 3B,SS","1066","83/352","32","6","37","1",".236"]
["Jorge Polanco","Min - 2B,3B,SS","1108","69/245","24","4","27","4",".282"]
["Darwin Barney","Tor - 2B,3B,SS","1113","75/279","35","4","19","2",".269"]
["Andrew Romine","Det - 1B,2B,3B,SS,OF","1132","41/174","21","2","16","8",".236"]
[]
["Chris Johnson","Bal - 1B,3B","1173","54/243","20","5","24","0",".222"]
["Ryan Flaherty","Bal - 3B,SS","1181","34/157","16","3","15","2",".217"]
["Ronald Torreyes","NYY - 2B,3B,SS","1189","40/155","20","1","12","2",".258"]
["Christian Colón","KC - 2B,3B","1217","34/147","13","1","13","0",".231"]
["Marco Hernández","Bos - 2B,3B","1220","15/51","11","1","5","1",".294"]
["Josh Rutledge","Bos - 3B","1221","13/49","9","0","3","2",".265"]
["Rubén Tejada","NYY - 3B","1229","11/66","9","0","5","0",".167"]
["Giovanny Urshela","Cle - 3B","1262","-/-","-","-","-","-","-"]
["Kaleb Cowart","LAA - 2B,3B","1283","15/85","8","1","8","0",".176"]
["JaCoby Jones","Det - 3B","1297","6/28","3","0","2","0",".214"]
["Josh Lowe","TB - 3B","1316","-/-","-","-","-","-","-"]
["Jomar Reyes","Bal - 3B","1334","-/-","-","-","-","-","-"]
[]
[]
["Nolan Jones","Cle - 3B","1352","-/-","-","-","-","-","-"]
["Yairo Munoz","Oak - 3B","1353","-/-","-","-","-","-","-"]
["Miguel Andujar","NYY - 3B","1357","-/-","-","-","-","-","-"]
["Mitch Nay","Tor - 3B","1370","-/-","-","-","-","-","-"]
["D.J. Peterson","Sea - 3B","1388","-/-","-","-","-","-","-"]
["Matt Chapman","Oak - 3B","1395","-/-","-","-","-","-","-"]
["J.D. Davis","Hou - 3B","1404","-/-","-","-","-","-","-"]
["Joe Rizzo","Sea - 3B","1408","-/-","-","-","-","-","-"]
["Michael Chavis","Bos - 3B","1420","-/-","-","-","-","-","-"]
["Trey Michalczewski","CWS - 3B","1466","-/-","-","-","-","-","-"]
["Yandy Diaz","Cle - 3B","1479","-/-","-","-","-","-","-"]
["Casey McGehee","Det - 3B","1503","21/92","4","0","1","0",".228"]
["Hanser Alberto","Tex - 3B,SS","1510","8/56","2","0","5","1",".143"]
["Colin Moran","Hou - 3B","1514","3/23","1","0","2","0",".130"]

{"sheet":"Short Stop","index":7,"n_rows":49,"n_cols":9,"rows_kept":49}
["Player","Team","Rank","H/AB","R","HR","RBI","SB","Avg."]
{"$rows_empty":7}
["Andrelton Simmons","LAA - SS","539","126/448","48","4","44","10",".281"]
[]
["José Iglesias","Det - SS","932","119/467","57","4","32","7",".255"]
["Alexei Ramírez","TB - SS","952","115/478","38","6","48","8",".241"]
["J.J. Hardy","Bal - SS","963","109/405","43","9","48","0",".269"]
["Adam Rosales","Oak - 2B,3B,SS","1048","49/214","37","13","35","4",".229"]
["Eduardo Escobar","Min - 3B,SS","1066","83/352","32","6","37","1",".236"]
["Jorge Polanco","Min - 2B,3B,SS","1108","69/245","24","4","27","4",".282"]
["Nick Franklin","TB - 1B,2B,SS,OF","1112","47/174","18","6","26","6",".270"]
["Darwin Barney","Tor - 2B,3B,SS","1113","75/279","35","4","19","2",".269"]
[]
["Andrew Romine","Det - 1B,2B,3B,SS,OF","1132","41/174","21","2","16","8",".236"]
[]
["Shawn O'Malley","Sea - 2B,SS,OF","1160","48/210","24","2","17","6",".229"]
["Ryan Flaherty","Bal - 3B,SS","1181","34/157","16","3","15","2",".217"]
["Ronald Torreyes","NYY - 2B,3B,SS","1189","40/155","20","1","12","2",".258"]
["Ryan Goins","Tor - 2B,SS","1194","34/183","13","3","12","1",".186"]
["Cliff Pennington","LAA - 2B,SS","1208","36/172","18","3","10","1",".209"]
["Ehire Adrianza","Min - SS","1247","16/63","3","2","7","0",".254"]
["Taylor Motter","Sea - SS,OF","1253","15/80","11","2","9","0",".188"]
[]
["Lucius Fox","TB - SS","1321","-/-","-","-","-","-","-"]
["Andrew Velazquez","TB - SS","1324","-/-","-","-","-","-","-"]
["Richie Martin","Oak - SS","1363","-/-","-","-","-","-","-"]
["Miguelangel Sierra","Hou - SS","1365","-/-","-","-","-","-","-"]
[]
["Roberto Baldoquín","LAA - SS","1393","-/-","-","-","-","-","-"]
["Nonie Williams","LAA - SS","1394","-/-","-","-","-","-","-"]
[]
["Ryan Mountcastle","Bal - SS","1402","-/-","-","-","-","-","-"]
["Tyler Wade","NYY - SS","1413","-/-","-","-","-","-","-"]
["Richard Urena","Tor - SS","1419","-/-","-","-","-","-","-"]
["Nick Gordon","Min - SS","1432","-/-","-","-","-","-","-"]
["Carlos Vargas","TB - SS","1464","-/-","-","-","-","-","-"]
["Jonathan Arauz","Hou - 2B,SS","1468","-/-","-","-","-","-","-"]
["Yu-Cheng Chang","Cle - SS","1473","-/-","-","-","-","-","-"]
["Jorge Mateo","NYY - SS","1484","-/-","-","-","-","-","-"]
["David Fletcher","LAA - SS","1485","-/-","-","-","-","-","-"]
["Daniel Robertson","TB - SS","1486","-/-","-","-","-","-","-"]
["Brendan Ryan","Det - SS","1502","1/13","1","0","0","0",".077"]
["Hanser Alberto","Tex - 3B,SS","1510","8/56","2","0","5","1",".143"]

{"sheet":"Outfield","index":8,"n_rows":128,"n_cols":9,"rows_kept":128}
["Player","Team","Rank","H/AB","R","HR","RBI","SB","Avg."]
{"$rows_empty":22}
["Paulo Orlando","KC - OF","445","138/457","52","5","43","14",".302"]
[]
[]
[]
["Avisail García","CWS - OF","492","101/413","59","12","51","4",".245"]
["Lonnie Chisenhall","Cle - OF","523","110/385","43","8","57","6",".286"]
["Eddie Rosario","Min - OF","549","90/335","52","10","32","5",".269"]
["Norichika Aoki","Hou - OF","566","118/417","63","4","28","7",".283"]
["Michael Bourn","Bal - OF","851","99/375","48","5","38","15",".264"]
[]
["Colby Rasmus","TB - OF","927","76/369","38","15","54","4",".206"]
["Brock Holt","Bos - 3B,OF","936","74/290","45","7","34","4",".255"]
["Brandon Guyer","Cle - OF","956","78/293","39","9","32","3",".266"]
["Coco Crisp","Cle - OF","960","103/446","54","13","55","10",".231"]
["Billy Burns","KC - OF","974","73/311","39","0","13","17",".235"]
["Robbie Grossman","Min - OF","975","93/332","49","11","37","2",".280"]
["Chris Young","Bos - OF","996","56/203","29","9","24","4",".276"]
["Jefry Marte","LAA - 1B,3B,OF","999","65/258","38","15","44","2",".252"]
[]
["Ezequiel Carrera","Tor - OF","1031","67/270","47","6","23","7",".248"]
[]
["Whit Merrifield","KC - 2B,OF","1047","88/311","44","2","29","8",".283"]
["Ryan Rua","Tex - 1B,OF","1061","62/240","40","8","22","9",".258"]
["Jake Marisnick","Hou - OF","1063","60/287","40","5","21","10",".209"]
["Hyun Soo Kim","Bal - OF","1072","92/305","36","6","22","1",".302"]
["Aaron Hicks","NYY - OF","1079","71/327","32","8","31","3",".217"]
["Peter Bourjos","CWS - OF","1082","89/355","40","5","23","6",".251"]
["Marlon Byrd","Cle - OF","1084","31/115","11","5","19","0",".270"]
["Abraham Almonte","Cle - OF","1086","48/182","24","1","22","8",".264"]
["Austin Jackson","Cle - OF","1087","46/181","24","0","18","2",".254"]
["Alejandro De Aza","Oak - OF","1091","48/234","31","6","25","4",".205"]
[]
["Rickie Weeks Jr.","TB - OF","1098","43/180","29","9","27","5",".239"]
["Danny Santana","Min - OF","1111","56/233","29","2","14","12",".240"]
["Nick Franklin","TB - 1B,2B,SS,OF","1112","47/174","18","6","26","6",".270"]
["Joey Rickard","Bal - OF","1115","69/257","32","5","19","4",".268"]
["Jake Smolinski","Oak - OF","1126","69/290","28","7","27","1",".238"]
["Andrew Romine","Det - 1B,2B,3B,SS,OF","1132","41/174","21","2","16","8",".236"]
[]
["Anthony Gose","Det - OF","1148","19/91","11","2","7","0",".209"]
["Shawn O'Malley","Sea - 2B,SS,OF","1160","48/210","24","2","17","6",".229"]
["Drew Stubbs","Min - OF","1162","18/80","13","3","7","9",".225"]
["Tyler Collins","Det - OF","1166","32/136","14","4","15","1",".235"]
["Rob Refsnyder","NYY - 1B,2B,OF","1176","38/152","25","0","12","2",".250"]
[]
["Shane Robinson","LAA - OF","1195","17/98","16","1","10","3",".173"]
[]
["Mikie Mahtook","Det - OF","1201","36/185","16","3","11","0",".195"]
["Teoscar Hernández","Hou - OF","1202","23/100","15","4","11","0",".230"]
["Steven Moyà","Det - OF","1206","24/94","9","5","11","0",".255"]
[]
["Guillermo Heredia","Sea - OF","1214","23/92","12","1","12","1",".250"]
["Preston Tucker","Hou - OF","1218","22/134","11","4","8","0",".164"]
["Bryce Brentz","Bos - OF","1233","17/61","8","1","7","0",".279"]
["Tony Kemp","Hou - OF","1238","26/120","15","1","7","2",".217"]
["Leury García","CWS - OF","1249","11/48","6","1","5","2",".229"]
["Peter O'Brien","KC - OF","1252","9/64","6","5","9","0",".141"]
["Taylor Motter","Sea - SS,OF","1253","15/80","11","2","9","0",".188"]
["Travis Snider","Tex - OF","1255","-/-","-","-","-","-","-"]
["Jason Coats","TB - OF","1260","10/50","8","1","4","1",".200"]
["Mason Williams","NYY - OF","1263","8/27","4","0","2","0",".296"]
["Ben Gamel","Sea - OF","1264","9/48","9","1","5","0",".188"]
["Daniel Robertson","Cle - OF","1275","5/19","1","0","1","0",".263"]
["Hunter Dozier","KC - OF","1292","4/19","4","0","1","0",".211"]
["Dariel Álvarez","Bal - OF","1300","1/3","0","0","0","0",".333"]
[]
["Boog Powell","Sea - OF","1313","-/-","-","-","-","-","-"]
["Jose Azocar","Det - OF","1318","-/-","-","-","-","-","-"]
[]
["Kyle Tucker","Hou - OF","1322","-/-","-","-","-","-","-"]
["Lazaro Armenteros","Oak - OF","1330","-/-","-","-","-","-","-"]
["Lourdes Gurriel","Tor - OF","1336","-/-","-","-","-","-","-"]
["Mike Gerber","Det - OF","1347","-/-","-","-","-","-","-"]
["Jorge Bonifacio","KC - OF","1359","-/-","-","-","-","-","-"]
["Blake Rutherford","NYY - OF","1364","-/-","-","-","-","-","-"]
["Daniel Palka","Min - 1B,OF","1372","-/-","-","-","-","-","-"]
["Harold Ramírez","Tor - OF","1375","-/-","-","-","-","-","-"]
[]
["Donnie Dewees","KC - OF","1380","-/-","-","-","-","-","-"]
["Rymer Liriano","CWS - OF","1381","-/-","-","-","-","-","-"]
["Jahmai Jones","LAA - OF","1385","-/-","-","-","-","-","-"]
["Will Benson","Cle - OF","1392","-/-","-","-","-","-","-"]
["Derek Fisher","Hou - OF","1400","-/-","-","-","-","-","-"]
["Mike Yastrzemski","Bal - OF","1401","-/-","-","-","-","-","-"]
["Leody Taveras","Tex - OF","1403","-/-","-","-","-","-","-"]
["Dwight Smith","Tor - OF","1407","-/-","-","-","-","-","-"]
["Kyle Lewis","Sea - OF","1417","-/-","-","-","-","-","-"]
["James Ramsey","Sea - OF","1428","-/-","-","-","-","-","-"]
["Alex Kirilloff","Min - OF","1434","-/-","-","-","-","-","-"]
["Willy García","CWS - OF","1439","-/-","-","-","-","-","-"]
["Anthony Alford","Tor - OF","1441","-/-","-","-","-","-","-"]
["Luis Alexander Basabe","CWS - OF","1446","-/-","-","-","-","-","-"]
["Garrett Whitley","TB - OF","1448","-/-","-","-","-","-","-"]
[]
["Christin Stewart","Det - OF","1457","-/-","-","-","-","-","-"]
["Bubba Starling","KC - OF","1458","-/-","-","-","-","-","-"]
["Alex Jackson","Sea - OF","1469","-/-","-","-","-","-","-"]
["Brandon Marsh","LAA - OF","1476","-/-","-","-","-","-","-"]
["Elier Hernandez","KC - OF","1483","-/-","-","-","-","-","-"]
["Eric Jenkins","Tex - OF","1494","-/-","-","-","-","-","-"]
["Daz Cameron","Hou - OF","1496","-/-","-","-","-","-","-"]
["Darrell Ceciliani","Tor - OF","1509","3/27","2","0","1","0",".111"]
["Ryan LaMarre","LAA - OF","1515","0/5","1","0","0","0",".000"]
["Matt Olson","Oak - OF","1516","2/21","3","0","0","0",".095"]
["Craig Gentry","Bal - OF","1520","5/34","2","0","2","0",".147"]

{"sheet":"DH","index":9,"n_rows":1,"n_cols":9,"rows_kept":1}
["Player","Team","Rank","H/AB","R","HR","RBI","SB","Avg."]

{"sheet":"Pitchers","index":10,"n_rows":177,"n_cols":9,"rows_kept":177}
["Player","Team","Rank","IP","W","S","K","ERA","WHIP"]
{"$rows_empty":25}
["Colby Lewis","Tex - SP","387","116.1","6","0","73","3.71","1.13"]
[]
[]
["Luis Cessa","NYY - SP,RP","475","70.1","4","0","46","4.35","1.11"]
[]
[]
[]
["Jason Vargas","KC - SP","520","12.0","0","0","11","2.25","0.92"]
["Héctor Santiago","Min - SP","522","182.0","13","0","144","4.70","1.36"]
["Zach Neal","Oak - SP,RP","536","70.0","2","2","27","4.24","1.11"]
[]
["Brad Peacock","Hou - SP,RP","548","31.2","0","0","28","3.69","1.11"]
[]
["C.J. Wilson","LAA - SP","573","-","-","-","-","-","-"]
[]
["Nathan Eovaldi","TB - SP","576","124.2","9","0","97","4.76","1.31"]
["Tim Cooney","Cle - SP","600","-","-","-","-","-","-"]
["Chad Green","NYY - SP","613","45.2","2","1","52","4.73","1.40"]
["Chris Volstad","CWS - SP,RP","618","-","-","-","-","-","-"]
["Sean Reid-Foley","Tor - SP","625","-","-","-","-","-","-"]
["Kevin Ziomek","Det - SP","633","-","-","-","-","-","-"]
["Ariel Jurado","Tex - SP","636","-","-","-","-","-","-"]
["Conner Greene","Tor - SP","638","-","-","-","-","-","-"]
["Nolan Watson","KC - SP","639","-","-","-","-","-","-"]
["Matthias Dietz","Bal - SP","641","-","-","-","-","-","-"]
["Nate Smith","LAA - SP","644","-","-","-","-","-","-"]
["Justus Sheffield","NYY - SP","646","-","-","-","-","-","-"]
["Tanner Scott","Bal - SP","651","-","-","-","-","-","-"]
["Spencer Adams","CWS - SP","652","-","-","-","-","-","-"]
["Grayson Long","LAA - SP","655","-","-","-","-","-","-"]
["Brady Aiken","Cle - SP","656","-","-","-","-","-","-"]
["Trey Ball","Bos - SP","657","-","-","-","-","-","-"]
["A.J. Puckett","KC - SP","661","-","-","-","-","-","-"]
["Kyle Funkhouser","Det - SP","669","-","-","-","-","-","-"]
["Jaime Barria","LAA - SP","673","-","-","-","-","-","-"]
["Travis Lakins","Bos - SP","674","-","-","-","-","-","-"]
["Chase De Jong","Sea - SP","675","-","-","-","-","-","-"]
["Scott Blewett","KC - SP","676","-","-","-","-","-","-"]
["Connor Sadzeck","Tex - SP","677","-","-","-","-","-","-"]
["Kohl Stewart","Min - SP","681","-","-","-","-","-","-"]
["A.J. Puk","Oak - SP","682","-","-","-","-","-","-"]
["Brandon Workman","Bos - SP,RP","683","-","-","-","-","-","-"]
["Andrew Moore","Sea - SP","686","-","-","-","-","-","-"]
["Fernando Romero","Min - SP","687","-","-","-","-","-","-"]
["Dane Dunning","CWS - SP","690","-","-","-","-","-","-"]
["Cody Sedlock","Bal - SP","693","-","-","-","-","-","-"]
["Chih-Wei Hu","TB - SP","695","-","-","-","-","-","-"]
["Tyler Alexander","Det - SP","698","-","-","-","-","-","-"]
["Brett Martin","Tex - SP","701","-","-","-","-","-","-"]
["Ryan Yarbrough","TB - SP","702","-","-","-","-","-","-"]
["Mike Minor","KC - SP","703","-","-","-","-","-","-"]
[]
["Ashe Russell","KC - SP","708","-","-","-","-","-","-"]
["Hunter Harvey","Bal - SP","710","-","-","-","-","-","-"]
["Joe Gatto","LAA - SP","711","-","-","-","-","-","-"]
["Cionel Perez","Hou - SP","714","-","-","-","-","-","-"]
["Kevin Gadea","TB - SP","719","-","-","-","-","-","-"]
["Taylor Guerrieri","TB - SP","720","-","-","-","-","-","-"]
["Norge Ruiz","Oak - SP","721","-","-","-","-","-","-"]
["Austin Kubitza","Det - SP","723","-","-","-","-","-","-"]
["Eric Skoglund","KC - SP","724","-","-","-","-","-","-"]
["Chance Adams","NYY - SP","728","-","-","-","-","-","-"]
["Jon Harris","Tor - SP","730","-","-","-","-","-","-"]
["Jake Junis","KC - SP","732","-","-","-","-","-","-"]
["Keegan Akin","Bal - SP","734","-","-","-","-","-","-"]
["Albert Abreu","NYY - SP","735","-","-","-","-","-","-"]
["Rob Kaminsky","Cle - SP","737","-","-","-","-","-","-"]
["Forrest Whitley","Hou - SP","738","-","-","-","-","-","-"]
["Felix Jorge","Min - SP","739","-","-","-","-","-","-"]
["Dillon Tate","Tex - SP","741","-","-","-","-","-","-"]
["Matt Manning","Det - SP","742","-","-","-","-","-","-"]
["Ryne Stanek","TB - SP","743","-","-","-","-","-","-"]
["Stephen Gonsalves","Min - SP","748","-","-","-","-","-","-"]
["Max Povse","Sea - SP","754","-","-","-","-","-","-"]
["Triston McKenzie","Cle - SP","755","-","-","-","-","-","-"]
["Dakota Chalmers","Oak - SP","758","-","-","-","-","-","-"]
["Josh Staumont","KC - SP","760","-","-","-","-","-","-"]
["Jacob Faria","TB - SP","761","-","-","-","-","-","-"]
["Grant Holmes","Oak - SP","765","-","-","-","-","-","-"]
["T.J. Zeuch","Tor - SP","766","-","-","-","-","-","-"]
["Domingo Germán","NYY - SP","767","-","-","-","-","-","-"]
["David Hess","Bal - SP","768","-","-","-","-","-","-"]
["Alex Speas","Tex - SP","769","-","-","-","-","-","-"]
["Kyle Zimmer","KC - SP","771","-","-","-","-","-","-"]
[]
["Beau Burrows","Det - SP","777","-","-","-","-","-","-"]
["Victor Alcántara","Det - SP","778","-","-","-","-","-","-"]
[]
[]
["Foster Griffin","KC - SP","786","-","-","-","-","-","-"]
["Spencer Turnbull","Det - SP","788","-","-","-","-","-","-"]
["Nick Neidert","Sea - SP","790","-","-","-","-","-","-"]
["Cole Ragans","Tex - SP","791","-","-","-","-","-","-"]
["Ty Buttrey","Bos - SP","798","-","-","-","-","-","-"]
["Roniel Raudes","Bos - SP","800","-","-","-","-","-","-"]
["Jaime Schultz","TB - SP","801","-","-","-","-","-","-"]
["Franklin Perez","Hou - SP","805","-","-","-","-","-","-"]
["Ian Clarkin","NYY - SP","809","-","-","-","-","-","-"]
["Brian Johnson","Bos - SP","823","-","-","-","-","-","-"]
[]
[]
[]
["Henderson Álvarez","Oak - SP","868","-","-","-","-","-","-"]
[]
["A.J. Griffin","Tex - SP","880","119.0","7","0","107","5.07","1.36"]
["Rob Whalen","Sea - SP","883","24.2","1","0","25","6.57","1.30"]
["Justin Masterson","Bos - SP","888","-","-","-","-","-","-"]
["Bryan Mitchell","NYY - SP","902","25.0","1","0","11","3.24","1.52"]
["Mike Clevinger","Cle - SP,RP","914","53.0","3","0","50","5.26","1.49"]
["Gabriel Ynoa","Bal - SP,RP","929","18.1","1","0","17","6.38","1.80"]
["Alex Meyer","LAA - SP","934","25.1","1","0","29","5.68","1.66"]
[]
["Mat Latos","Tor - SP,RP","941","70.0","7","0","42","4.89","1.49"]
["Mike Bolsinger","Tor - SP","945","27.2","1","0","25","6.83","1.52"]
["Raúl Alcántara","Oak - SP","957","22.1","1","0","14","7.25","1.57"]
[]
["Shane Greene","Det - SP,RP","972","60.1","5","2","59","5.82","1.33"]
[]
["Chris Bassitt","Oak - SP","989","28.0","0","0","23","6.11","1.75"]
["Doug Fister","Hou - SP","990","180.1","12","0","115","4.64","1.43"]
["Chi Chi González","Tex - SP","995","10.1","0","0","7","8.71","2.90"]
["Jesse Hahn","Oak - SP","998","46.1","2","0","23","6.02","1.64"]
["Dillon Gee","Tex - SP,RP","1001","125.0","8","0","89","4.68","1.46"]
["Kyle Kendrick","Bos - SP","1004","-","-","-","-","-","-"]
["Henry Owens","Bos - SP","1008","22.0","0","0","21","6.95","1.95"]
["Ryan Vogelsong","Min - SP,RP","1014","82.1","3","0","61","4.81","1.47"]
["Nick Martínez","Tex - SP,RP","1017","38.2","2","0","16","5.59","1.66"]
["Daniel Wright","LAA - SP","1020","39.2","1","0","21","6.13","1.64"]
["Tyler Wilson","Bal - SP,RP","1023","94.0","4","0","55","5.27","1.43"]
["Martín Pérez","Tex - SP","1028","198.2","10","0","103","4.39","1.41"]
["Cody Anderson","Cle - SP,RP","1032","60.2","2","0","54","6.68","1.62"]
["Logan Verrett","Bal - SP,RP","1038","91.2","3","0","66","5.20","1.56"]
["Chris Young","KC - SP,RP","1040","88.2","3","1","94","6.19","1.66"]
["Mike Wright","Bal - SP,RP","1052","74.2","3","0","50","5.79","1.43"]
["Phil Hughes","Min - SP","1053","59.0","1","0","34","5.95","1.51"]
["Bud Norris","LAA - SP,RP","1060","113.0","6","0","102","5.10","1.46"]
["Wade Miley","Bal - SP","1069","166.0","9","0","137","5.37","1.42"]
["Daniel Mengden","Oak - SP","1078","72.0","2","0","71","6.50","1.61"]
["Ubaldo Jiménez","Bal - SP","1080","142.1","8","1","125","5.44","1.56"]
["Kyle Lohse","Tex - SP","1081","9.1","0","0","3","12.54","2.14"]
["Yovani Gallardo","Sea - SP","1083","118.0","6","0","85","5.42","1.58"]
[]
["Tyler Duffey","Min - SP","1095","133.0","9","0","114","6.43","1.50"]
["Ross Detwiler","Oak - SP,RP","1100","48.2","2","0","26","6.10","1.60"]
["Dillon Overton","Sea - SP","1101","24.1","1","0","17","11.47","2.26"]
["Jonathon Niese","NYY - SP,RP","1103","121.0","8","0","88","5.50","1.59"]
["Andrew Cashner","Tex - SP","1106","132.0","5","0","112","5.25","1.53"]
["Anibal Sánchez","Det - SP,RP","1110","153.1","7","0","135","5.87","1.46"]
[]
["Tim Lincecum","LAA - SP","1146","38.1","2","0","32","9.16","2.37"]
["Mike Pelfrey","Det - SP","1203","119.0","4","0","56","5.07","1.73"]

{"sheet":"Relief Pitchers","index":11,"n_rows":199,"n_cols":9,"rows_kept":199}
["Player","Team","Rank","IP","W","S","K","ERA","WHIP"]
{"$rows_empty":19}
["Tony Barnette","Tex - RP","361","60.1","7","0","49","2.09","1.16"]
[]
[]
[]
["Alex Wilson","Det - RP","381","73.0","4","0","49","2.96","1.22"]
[]
[]
["Bruce Rondon","Det - RP","390","36.1","5","0","45","2.97","0.96"]
["Nick Vincent","Sea - RP","391","60.1","4","3","65","3.73","1.13"]
["Jake Diekman","Tex - RP","392","53.0","4","4","59","3.40","1.17"]
[]
["Bryan Shaw","Cle - RP","401","66.2","2","1","69","3.24","1.26"]
["Brian Flynn","KC - RP","408","55.1","1","0","44","2.60","1.10"]
["Joe Biagini","Tor - RP","409","67.2","4","1","62","3.06","1.30"]
["Xavier Cedeño","TB - RP","410","41.1","3","0","43","3.70","1.19"]
["Matt Belisle","Min - RP","412","46.0","0","0","32","1.76","1.09"]
["Joakim Soria","KC - RP","414","66.2","5","1","68","4.05","1.46"]
["Evan Scribner","Sea - RP","416","14.0","0","0","15","0.00","0.50"]
[]
["Dan Jennings","CWS - RP","420","60.2","4","1","46","2.08","1.40"]
["Heath Hembree","Bos - RP","421","51.0","4","0","47","2.65","1.33"]
["Joe Smith","Tor - RP","424","52.0","2","6","40","3.46","1.25"]
["Boone Logan","Cle - RP","426","46.1","2","1","57","3.69","1.01"]
["Álex Cláudio","Tex - RP","427","51.2","4","0","34","2.79","1.26"]
["Justin Wilson","Det - RP","431","58.2","4","1","65","4.14","1.33"]
["Ryan Pressly","Min - RP","434","75.1","6","1","67","3.70","1.35"]
["Kyle Ryan","Det - RP","437","55.2","4","0","35","3.07","1.13"]
["Robbie Ross Jr.","Bos - RP","440","55.1","3","0","56","3.25","1.27"]
["Deolis Guerra","LAA - RP","441","53.1","3","0","36","3.21","1.11"]
["Adam Warren","NYY - RP","451","65.1","7","0","52","4.68","1.35"]
["John Axford","Oak - RP","452","65.2","6","3","60","3.97","1.45"]
[]
["Liam Hendriks","Oak - RP","462","64.2","0","0","71","3.76","1.28"]
["Luke Hochevar","KC - RP","464","37.1","2","0","40","3.86","1.07"]
["Keone Kela","Tex - RP","472","34.0","5","0","45","6.09","1.38"]
["Gavin Floyd","Tor - RP","473","31.0","2","0","30","4.06","1.00"]
["Luis Cessa","NYY - SP,RP","475","70.1","4","0","46","4.35","1.11"]
["Donnie Hart","Bal - RP","477","18.1","0","0","12","0.49","0.98"]
["Zach McAllister","Cle - RP","478","52.1","3","0","54","3.44","1.45"]
["Zach Putnam","CWS - RP","481","27.1","1","0","30","2.30","1.32"]
["Brad Boxberger","TB - RP","485","24.1","4","0","22","4.81","1.73"]
["Taylor Rogers","Min - RP","486","61.1","3","0","64","3.96","1.29"]
["Daniel Coulombe","Oak - RP","488","47.2","3","0","54","4.53","1.13"]
[]
["Tommy Hunter","TB - RP","499","34.0","2","0","23","3.18","1.26"]
["Richard Bleier","Bal - RP","500","23.0","0","0","13","1.96","1.04"]
["Michael Ynoa","CWS - RP","503","30.0","1","0","30","3.00","1.23"]
["Jumbo Diaz","TB - RP","505","43.0","1","0","37","3.14","1.28"]
["Dan Altavilla","Sea - RP","510","12.1","0","0","10","0.73","0.97"]
["Buddy Boshers","Min - RP","511","36.0","2","0","37","4.25","1.17"]
["Peter Moylan","KC - RP","513","44.2","2","0","34","3.43","1.30"]
["Oliver Drake","Bal - RP","522","18.0","1","0","21","4.00","1.00"]
[]
["Tommy Layne","NYY - RP","524","44.2","2","1","38","3.63","1.30"]
["Darío Álvarez","Tex - RP","528","26.2","3","0","41","5.06","1.31"]
["Jandel Gustave","Hou - RP","532","15.1","1","0","16","3.52","1.11"]
[]
["Zach Neal","Oak - SP,RP","534","70.0","2","2","27","4.24","1.11"]
["Danny Farquhar","TB - RP","537","35.1","1","0","46","3.06","1.36"]
["Chasen Shreve","NYY - RP","540","33.0","2","1","33","5.18","1.27"]
["Robby Scott","Bos - RP","541","6.0","1","0","5","0.00","1.33"]
["James Hoyt","Hou - RP","542","22.0","1","0","28","4.50","1.14"]
["Mike Morin","LAA - RP","544","55.2","2","0","49","4.37","1.20"]
["Brad Peacock","Hou - SP,RP","546","31.2","0","0","28","3.69","1.11"]
["Ryan Tepera","Tor - RP","550","18.1","0","0","18","2.95","1.36"]
["Eddie Gamboa","Tex - RP","551","13.1","0","0","11","1.35","1.28"]
["Vidal Nuño","Bal - RP","553","58.2","1","0","51","3.53","1.33"]
["J.P. Howell","Tor - RP","559","50.2","1","0","44","4.09","1.40"]
["Trevor May","Min - RP","564","42.2","2","0","60","5.27","1.31"]
["Blaine Hardy","Det - RP","565","25.2","1","0","20","3.51","1.44"]
["Fernando Abad","Bos - RP","567","46.2","1","1","41","3.66","1.33"]
["Matt Barnes","Bos - RP","571","66.2","4","1","71","4.05","1.40"]
["Shae Simmons","Sea - RP","572","6.2","0","0","3","1.35","0.90"]
["Jayson Aquino","Bal - RP","577","2.1","0","0","3","0.00","0.43"]
["Yusmeiro Petit","LAA - RP","578","62.0","3","1","49","4.50","1.32"]
["J.C. Ramírez","LAA - RP","579","78.2","3","2","59","4.35","1.26"]
["Shawn Armstrong","Cle - RP","581","10.2","0","0","7","2.53","1.31"]
["Chien-Ming Wang","KC - RP","582","53.1","6","0","30","4.22","1.46"]
["Tyler Wagner","Tex - RP","593","10.0","1","0","7","1.80","1.10"]
["Andrew Bailey","LAA - RP","594","43.2","3","6","41","5.36","1.33"]
["José Álvarez","LAA - RP","595","57.1","1","0","51","3.45","1.50"]
["José Leclerc","Tex - RP","596","15.0","0","0","15","1.80","1.60"]
["Vicente Campos","LAA - RP","601","5.2","0","0","4","3.18","1.06"]
["Ryan O'Rourke","Min - RP","604","25.0","0","0","24","3.96","1.12"]
["Tanner Scheppers","Tex - RP","606","8.2","1","1","5","4.15","1.04"]
["Carlos Frías","Cle - RP","610","4.0","0","0","3","0.00","0.75"]
["Giovanni Soto","CWS - RP","615","-","-","-","-","-","-"]
["Chris Volstad","CWS - SP,RP","618","-","-","-","-","-","-"]
["Ashur Tolliver","Hou - RP","621","4.2","1","0","5","5.79","1.71"]
["Juan Minaya","CWS - RP","622","10.1","1","0","6","4.35","1.45"]
["Chris Smith","Tor - RP","626","-","-","-","-","-","-"]
["Adam Ravenelle","Det - RP","647","-","-","-","-","-","-"]
["Zack Burdi","CWS - RP","648","-","-","-","-","-","-"]
["Jon Keller","Bal - RP","658","-","-","-","-","-","-"]
["Jake Reed","Min - RP","660","-","-","-","-","-","-"]
["Brandon Workman","Bos - SP,RP","683","-","-","-","-","-","-"]
["Chris Lee","Bal - RP","722","-","-","-","-","-","-"]
["Tyler Jay","Min - RP","764","-","-","-","-","-","-"]
[]
["Domingo Acevedo","NYY - RP","789","-","-","-","-","-","-"]
[]
["Marc Rzepczynski","Sea - RP","810","47.2","1","0","46","2.64","1.57"]
["Shawn Tolleson","TB - RP","811","36.1","2","11","29","7.68","1.73"]
["Danny Barnes","Tor - RP","815","13.2","0","0","14","3.95","1.39"]
["Blake Parker","LAA - RP","821","17.1","1","1","15","4.67","1.50"]
["Chad Girodo","Tor - RP","824","10.1","0","0","5","4.35","1.26"]
[]
["Jason García","Bal - RP","827","-","-","-","-","-","-"]
["Joe Beimel","Sea - RP","828","-","-","-","-","-","-"]
[]
["Miguel Almonte","KC - RP","831","-","-","-","-","-","-"]
["Tommy Kahnle","CWS - RP","834","27.1","0","1","25","2.63","1.50"]
["Aaron Loup","Tor - RP","835","14.1","0","0","15","5.02","1.33"]
["Ryan Garton","TB - RP","837","39.1","1","1","33","4.35","1.40"]
["Jesse Chávez","LAA - RP","838","67.0","2","0","63","4.43","1.33"]
["Jed Bradley","Bal - RP","842","7.0","1","0","4","5.14","1.86"]
["Bo Schultz","Tor - RP","843","16.1","0","0","10","5.51","1.22"]
["Jonathan Holder","NYY - RP","849","8.1","0","0","5","5.40","1.44"]
["Jonathan Aro","Sea - RP","850","0.2","0","0","0","0.00","3.00"]
["Scott Alexander","KC - RP","853","19.0","0","0","16","3.32","1.63"]
["Tony Sipp","Hou - RP","854","43.2","1","1","40","4.95","1.60"]
["Adam Plutko","Cle - RP","855","3.2","0","0","3","7.36","1.91"]
["Perci Garner","Cle - RP","857","9.1","0","0","12","4.82","1.82"]
["Al Alburquerque","KC - RP","858","2.0","0","0","1","4.50","2.00"]
["Adalberto Mejía","Min - RP","859","2.1","0","0","0","7.71","2.57"]
["James Pazos","Sea - RP","861","3.1","1","0","3","13.50","2.40"]
["Johnny Barbato","NYY - RP","862","13.0","1","0","15","7.62","1.38"]
["Kyle Crockett","Cle - RP","863","16.0","0","0","17","5.06","1.44"]
["Jake Petricka","CWS - RP","864","8.0","0","0","7","4.50","2.00"]
["Ben Heller","NYY - RP","865","7.0","1","0","6","6.43","2.14"]
["Kevin McCarthy","KC - RP","866","8.1","1","0","7","6.48","1.92"]
["Matt Dermody","Tor - RP","867","3.0","0","0","5","12.00","2.00"]
["Leonel Campos","Tor - RP","869","22.0","1","0","24","5.73","1.45"]
["Nick Goody","Cle - RP","870","29.0","0","0","34","4.66","1.45"]
["Casey Fien","Sea - RP","874","39.1","1","0","35","5.49","1.40"]
["Andrew Faulkner","Tex - RP","881","6.2","0","0","1","6.75","1.80"]
["Parker Bridwell","Bal - RP","882","3.1","0","0","3","13.50","1.80"]
["J.T. Chargois","Min - RP","885","23.0","1","0","17","4.70","1.61"]
["Joe Colon","Cle - RP","887","10.0","1","0","10","7.20","1.90"]
["Chris Heston","Sea - RP","893","5.0","1","0","3","10.80","3.00"]
["Tyler Danish","CWS - RP","895","1.2","0","0","0","10.80","5.40"]
["Michael Tonkin","Min - RP","896","71.2","3","0","80","5.02","1.45"]
["Kirby Yates","LAA - RP","897","41.1","2","0","50","5.23","1.45"]
["Warwick Saupold","Det - RP","900","9.2","1","0","10","7.45","2.07"]
["Cody Martin","Sea - RP","908","25.2","1","0","15","3.86","1.44"]
["Brooks Pounders","LAA - RP","909","12.2","2","0","13","9.24","1.74"]
["Logan Ondrusek","Bal - RP","910","6.1","0","0","4","9.95","1.89"]
["Greg Mahle","LAA - RP","911","18.1","1","0","14","5.40","1.80"]
["Daniel Stumpf","Det - RP","913","5.0","0","0","2","10.80","2.20"]
["Mike Clevinger","Cle - SP,RP","914","53.0","3","0","50","5.26","1.49"]
["Yohander Méndez","Tex - RP","917","3.0","0","0","0","18.00","2.33"]
["Noé Ramírez","Bos - RP","921","13.0","0","0","15","6.23","1.85"]
["Gabriel Ynoa","Bal - SP,RP","929","18.1","1","0","17","6.38","1.80"]
[]
["Shawn Morimando","Cle - RP","932","4.2","0","0","5","11.57","3.00"]
[]
["Mat Latos","Tor - SP,RP","941","70.0","7","0","42","4.89","1.49"]
["Zac Curtis","Sea - RP","946","13.1","0","0","10","6.75","1.95"]
["Drew VerHagen","Det - RP","949","19.0","1","0","10","7.11","1.84"]
["Shane Greene","Det - SP,RP","972","60.1","5","2","59","5.82","1.33"]
["Cory Luebke","CWS - RP","979","8.2","0","0","9","9.35","3.00"]
["Chris Beck","CWS - RP","981","25.1","2","0","20","6.39","1.89"]
["Buck Farmer","Det - RP","985","29.1","0","0","27","4.60","1.53"]
["James Russell","Cle - RP","1000","4.1","0","0","4","18.69","3.23"]
["Dillon Gee","Tex - SP,RP","1001","125.0","8","0","89","4.68","1.46"]
["Mark Lowe","Det - RP","1007","49.1","1","0","49","7.11","1.58"]
["Ryan Vogelsong","Min - SP,RP","1014","82.1","3","0","61","4.81","1.47"]
["Nick Martínez","Tex - SP,RP","1017","38.2","2","0","16","5.59","1.66"]
["Austin Adams","LAA - RP","1022","18.1","0","0","17","9.82","1.85"]
["Tyler Wilson","Bal - SP,RP","1023","94.0","4","0","55","5.27","1.43"]
["Cody Anderson","Cle - SP,RP","1032","60.2","2","0","54","6.68","1.62"]
["Logan Verrett","Bal - SP,RP","1038","91.2","3","0","66","5.20","1.56"]
["Chris Young","KC - SP,RP","1040","88.2","3","1","94","6.19","1.66"]
["Mike Wright","Bal - SP,RP","1052","74.2","3","0","50","5.79","1.43"]
["Bud Norris","LAA - SP,RP","1060","113.0","6","0","102","5.10","1.46"]
["Dominic Leone","Tor - RP","1064","27.0","0","0","23","6.33","2.11"]
["Ross Detwiler","Oak - SP,RP","1100","48.2","2","0","26","6.10","1.60"]
["Jonathon Niese","NYY - SP,RP","1103","121.0","8","0","88","5.50","1.59"]
["Anibal Sánchez","Det - SP,RP","1110","153.1","7","0","135","5.87","1.46"]

{"sheet":"Data","index":12,"n_rows":50,"n_cols":11,"rows_kept":50}
["Owners","Position"]
["Lightning (Mike Goodman)","Catcher"]
["Evolution (Bruce)","1st Base"]
["Miggy Pop (Colin)","2nd Base"]
["Woap (Mike)","3rd Base"]
["The Dominant Brand (Brandon)","Short Stop"]
["Guzzlers (Rhonda)","Outfield #1"]
["Moneyballers (Rob)","Outfield #2"]
["Booya's (Cathy)","Outfield #3"]
["Freebirds (Todd)","DH"]
["Numbats (Tom)","Starting Pitcher #1"]
["TheDunnShow (Dave)","Starting Pitcher #2"]
[null,"Starting Pitcher #3"]
[null,"Starting Pitcher #4"]
[null,"Starting Pitcher #5"]
[null,"Relief Pitcher #1"]
[null,"Relief Pitcher #2"]
[null,"Relief Pitcher #3"]
[null,"Relief Pitcher #4"]
[null,"Reserve Roster #1"]
[null,"Reserve Roster #2"]
[null,"Reserve Roster #3"]
[null,"Reserve Roster #4"]
[null,"Reserve Roster #5"]
[null,"Reserve Roster #6"]
[null,"Reserve Roster #7"]
[]
["Make sure every year to select all the players for each position and recreate the bookmark name (delete name first, then recreate name) to ensure all players get listed.",null,"catchers","first","second","third","ss","outfield","dh","pitchers","relief"]
["Ensure that all players are listed when clicking on the button."]
[]
[null,"Change Draft Order Yearly"]
[]
["Freebirds (Todd)",1]
["Evolution (Bruce)",2]
["The Dominant Brand (Brandon)",3]
["Woap (Mike)",4]
["Moneyballers (Rob)",5]
["Booya's (Cathy)",6]
["Lightning (Mike Goodman)",7]
["Numbats (Tom)",8]
["Miggy Pop (Colin)",9]
["Guzzlers (Rhonda)",10]
["TheDunnShow (Dave)",11]
[]
[]
[]
["Formulas to Retreive Name and Position"]
["=RIGHT(A1,LEN(A1)+ 5-FIND(\"-\",A1))","Position"]
["=LEFT(A1,FIND(\"-\",A1) -5)","Name"]
["=Trim(cell)","Trim the positions for extra space"]