{"text_format":"3","workbook":"xlsx","n_sheets":14,"sheets":["2015 Pre-Draft Rosters","Draft List","Summary","Catchers","1st Base","2nd Base","3rd Base","Short Stop","Outfield","DH","Pitchers","Relief Pitchers","Data","Sheet1"],"not_rendered":{"macros":1,"defined_names":48},"read":"whole","date_system":"1900"}

{"sheet":"2015 Pre-Draft Rosters","index":0,"n_rows":37,"n_cols":45,"rows_kept":37,"merged":[[0,1,0,4],[0,5,0,8],[0,9,0,12],[0,13,0,16],[0,17,0,20],[0,21,0,24],[0,25,0,28],[0,29,0,32],[0,33,0,36],[0,37,0,39],[0,41,0,43],[22,1,22,2],[22,5,22,6],[22,9,22,10],[22,13,22,14],[22,17,22,18],[22,21,22,22],[22,25,22,26],[22,29,22,30],[22,33,22,34],[22,37,22,38],[22,41,22,42],[23,1,23,2],[23,5,23,6],[23,9,23,10],[23,13,23,14],[23,17,23,18],[23,21,23,22],[23,25,23,26],[23,29,23,30],[23,33,23,34],[23,37,23,38],[23,41,23,42],[24,1,24,2],[24,5,24,6],[24,9,24,10],[24,13,24,14],[24,17,24,18],[24,21,24,22],[25,1,25,2],[25,5,25,6],[25,9,25,10],[25,13,25,14],[25,17,25,18],[25,21,25,22],[25,26,25,27],[25,30,25,31],[25,34,25,35],[25,38,25,39],[25,42,25,43]]}
[null,"Lightning (Mike Goodman)",{"$nulls":3},"Evolution (Bruce)",{"$nulls":3},"The Soylent Knights (Colin)",{"$nulls":3},"Woap (Mike)",{"$nulls":3},"The Dominant Brand (Brandon)",{"$nulls":3},"Guzzlers (Rhonda)",{"$nulls":3},"The Macon Whoopees (Rob)",{"$nulls":3}," Booya's (Cathy)",{"$nulls":3},"Freebirds (Todd)",{"$nulls":3},"Numbats (Tom)",{"$nulls":3},"TheDunnShow (Dave)"]
[null,"Pos.","Player","$","years","Pos.","Player","$","years","Pos.","Player","$","years","Pos.","Player","$","years","Pos.","Player","$","years","Pos.","Player","$","years","Pos.","Player","$","years","Pos.","Player","$","years","Pos.","Player","$","years","Pos.","Player","$","years","Pos.","Player","$","years"]
[{"$f":"11-COUNT(D3,H3,L3,P3,T3,X3,AB3,AF3,AJ3,AN3,AR3)","v":2},"C",{"$nulls":3},"C","Yan Gomes\nCle - C",15,1,"C","Salvador Pérez\nKC - C",14,null,"C","Evan Gattis\nHou - C",36,null,"C",{"$nulls":3},"C","Tyler Flowers\nCWS - C",1,null,"C","Kurt Suzuki\nMin - C",1,null,"C","Russell Martin\nTor - C",19,null,"C","Dioner Navarro\nTor - C",5,null,"C","Carlos Pérez \nLAA - C",5,null,"C","J.P. Arencibia \nTB - C,1B",5]
[0,"1B","Edwin Encarnación\nTor - 1B",48,null,"1B","David Ortiz\nBos - 1B",45,null,"1B","Chase Headley \nNYY - 1B,3B",10,1,"1B","Mike Napoli\nBos - 1B",8,null,"1B","Eric Hosmer\nKC - 1B",6,null,"1B","Kennys Vargas\nMin - 1B",1,null,"1B","Víctor Martínez\nDet - 1B",32,null,"1B","Billy Butler\nOak - 1B",1,null,"1B","Prince Fielder\nTex - 1B",28,null,"1B","Delino DeShields \nTex - 2B,OF ",5,null,"1B","José Abreu\nCWS - 1B",22,1]
[0,"2B","Jurickson Profar\nTex - 2B,SS",15,1,"2B","Logan Forsythe \nTB - 1B,2B ",5,null,"2B","Ian Kinsler \nDet - 2B",25,1,"2B","Brian Dozier\nMin - 2B",36,null,"2B","Brett Lawrie\nOak - 2B,3B",16,null,"2B","Robinson Canó\nSea - 2B",49,null,"2B","Tim Beckham \nTB - 2B,SS",5,null,"2B","José Altuve\nHou - 2B",21,1,"2B","Luis Valbuena\nHou - 2B,3B",8,null,"2B","Jonathan Schoop\nBal - 2B,3B",5,null,"2B","Dustin Pedroia\nBos - 2B",32]
[1,"3B","Nick Castellanos\nDet - 3B",1,null,"3B","Miguel Sano\nMin - 3B,SS",5,null,"3B","Manny Machado\nBal - 3B",15,1,"3B",{"$nulls":3},"3B","Trevor Plouffe\nMin - 3B",1,null,"3B","Adrián Béltre\nTex - 3B",40,null,"3B","Danny Valencia \nOak - 1B,3B,OF",5,null,"3B","Jose Iglesias\nDet - 3B,SS",5,null,"3B","Evan Longoria\nTB - 3B",35,null,"3B","Kyle Seager\nSea - 3B",38,null,"3B","Jimmy Paredes \nBal - 2B,3B",5]
[1,"SS","Francisco Lindor\nCle - SS",5,null,"SS","Marcus Semien\nOak - 2B,3B,SS",5,null,"SS","Carlos Correa \nHou - SS",5,null,"SS","Elvis Andrus\nTex - SS",16,null,"SS","Didi Gregorius \nNYY - 2B,SS",5,null,"SS","Brock Holt\nBos - 1B,2B,3B,SS,OF",5,null,"SS","Alexei Ramírez\nCWS - SS",22,null,"SS","Ben Zobrist\nOak - 2B,SS,OF",28,null,"SS","Mike Avilés\nCle - 2B,3B,SS,OF",1,null,"SS","Brad Miller\nSea - 2B,SS",5,null,"SS"]
[2,"OF#1","Adam Eaton\nCWS - OF",4,null,"OF#1",{"$nulls":3},"OF#1","Shin-Soo Choo\nTex - OF",7,null,"OF#1","Ben Revere \nTor - OF",5,null,"OF#1","Rajai Davis\nDet - OF",7,null,"OF#1","Mookie Betts \nBos - 2B,OF",5,null,"OF#1","Melky Cabrera\nCWS - OF",32,null,"OF#1",{"$nulls":3},"OF#1","Chris Carter\nHou - 1B,OF",40,null,"OF#1","Kole Calhoun \nLAA - OF",10,1,"OF#1","Rusney Castillo \nBos - OF",5]
[1,"OF#2","Lonnie Chisenhall\nCle - 1B,3B",1,null,"OF#2",{"$nulls":3},"OF#2","David Murphy \nLAA - OF",5,null,"OF#2","Billy Burns\nOak - Util",5,null,"OF#2","Michael Brantley\nCle - OF",46,null,"OF#2","Steve Pearce\nBal - 1B,OF",21,null,"OF#2","Coco Crisp\nOak - OF",5,null,"OF#2","Eduardo Escobar \nMin - 2B,3B,SS,OF",5,null,"OF#2","Carlos Beltran\nNYY - OF",5,null,"OF#2","Mikie Mahtook \nTB - OF ",5,null,"OF#2","Anthony Gose\nDet - OF",6]
[0,"OF#3","Jackie Bradley Jr. \nBos - OF",5,null,"OF#3","George Springer\nHou - OF",15,2,"OF#3","Dalton Pompey \nTor - OF",5,null,"OF#3","Franklin Gutiérrez \nSea - OF ",5,null,"OF#3","Mark Canha\nOak - 1B,OF",5,null,"OF#3","Kevin Kiermaier\nTB - OF",5,null,"OF#3","Kevin Pillar\nTor - OF",5,null,"OF#3","J.D. Martínez\nDet - OF",10,1,"OF#3","Steven Souza\nTB - OF",17,null,"OF#3","Eddie Rosario \nMin - 2B,OF ",5,null,"OF#3","Colby Rasmus \nHou - OF",5]
[0,"DH","Rougned Odor\nTex - 2B",4,null,"DH","Chris Davis\nBal - 1B,3B",45,null,"DH","Joe Mauer\nMin - 1B",3,null,"DH","Chris Colabello \nTor - 1B,OF",5,null,"DH","Kendrys Morales\nKC - 1B",5,null,"DH","Pablo Sandoval\nBos - 3B",28,null,"DH","Mark Teixeira\nNYY - 1B",2,null,"DH","Justin Smoak\nTor - 1B",5,null,"DH","Michael Saunders\nTor - OF",1,"","DH","Abraham Almonte \nCle - OF ",5,null,"DH","Travis Shaw \nBos - 1B,3B",5]
[0,"SP#1","Daniel Norris\nTor - SP",5,null,"SP#1","Chris Sale\nCWS - SP",50,null,"SP#1","Ervin Santana\nMin - SP",20,null,"SP#1","Tyler Duffey \nMin - SP ",5,null,"SP#1","Edinson Vólquez\nKC - SP",11,null,"SP#1","Jeff Samardzija \nCWS - SP",5,null,"SP#1","Alfredo Simón\nDet - SP",10,null,"SP#1","Ricky Nolasco \nMin - SP",5,null,"SP#1","C.J. Wilson\nLAA - SP",2,null,"SP#1","Roenis Elías \nSea - SP",5,null,"SP#1","Henry Owens\nBos - SP",9]
[0,"SP#2","Nick Tropeano \nLAA - SP",5,null,"SP#2","Félix Hernández\nSea - SP",40,1,"SP#2","Cody Anderson\nCle - SP",5,null,"SP#2","Wei-Yin Chen\nBal - SP",7,null,"SP#2","Colby Lewis \nTex - SP",5,null,"SP#2","Ubaldo Jiminez \nBal - SP",5,null,"SP#2","José Quintana\nCWS - SP",18,null,"SP#2","Jason Vargas\nKC - SP",5,null,"SP#2","Miguel González\nBal - SP",1,null,"SP#2","Collin McHugh \nHou - SP",10,1,"SP#2","Andrew Heaney\nLAA - SP",8]
[0,"SP#3","Drew Smyly\nTB - SP",14,1,"SP#3","Iván Nova\nNYY - SP",5,null,"SP#3","Masahiro Tanaka\nNYY - SP",30,1,"SP#3","Matt Shoemaker\nLAA - SP,RP",10,1,"SP#3","Chris Young\nSea - SP",5,null,"SP#3","Johnny Cueto\nKC - SP",5,null,"SP#3","Justin Verlander\nDet - SP",31,null,"SP#3","Derek Holland\nTex - SP",7,1,"SP#3","Jake Odorizzi\nTB - SP",8,1,"SP#3","Carlos Carrasco\nCle - SP,RP",10,1,"SP#3","Nathan Karns\nTB - SP",5]
[0,"SP#4","Kevin Gausman\nBal - SP",15,1,"SP#4","Chris Archer\nTB - SP",6,1,"SP#4","Michael Pineda \nNYY - SP",17,1,"SP#4","Phil Hughes \nMin - SP",10,1,"SP#4","Franklin Morales\nKC- SP, RP",5,null,"SP#4","Drew Hutchison \nTor - SP",6,1,"SP#4","Scott Feldman \nHou - SP",5,null,"SP#4","Dallas Keuchel\nHou - SP",10,1,"SP#4","Eduardo Rodriguez\nBos - SP",5,null,"SP#4","Lance McCullers \nHou - SP",5,null,"SP#4","Jesse Hahn\nOak - SP",10]
[0,"SP#5","Yordano Ventura\nKC - SP",10,1,"SP#5","Wade Miley \nBos - SP",5,null,"SP#5","Taijuan Walker \nSea - SP",15,2,"SP#5","Kyle Gibson\nMin - SP",5,null,"SP#5","Anibal Sánchez \nDet - SP",15,1,"SP#5","Sonny Gray \nOak - SP",15,1,"SP#5","Garrett Richards\nLAA - SP",11,2,"SP#5","Vidal Nuno\nSea - SP,RP",5,null,"SP#5","Marcus Stroman\nTor - SP,RP",15,2,"SP#5","Luis Severino \nNYY - SP,RP ",5,null,"SP#5","James Paxton\nSea - SP",11]
[1,"RP#1","Chris Bassitt \nOak - SP,RP",5,null,"RP#1",{"$nulls":3},"RP#1","Carson Smith\nSea - RP",5,null,"RP#1","Alex Wilson \nDet - RP ",5,null,"RP#1","Chad Qualls\nHou - RP",7,null,"RP#1","Kevin Jepsen \nMin - RP ",5,null,"RP#1","Aarón Sánchez\nTor - RP",5,null,"RP#1","Rich Hill \nBos - SP,RP",5,null,"RP#1","Ryan O'Rourke \nMin - RP",5,null,"RP#1","Shawn Tolleson \nTex - RP\n",5,null,"RP#1","Carlos Rodon\nCWS - RP",1]
[0,"RP#2","Erasmo Ramirez \nTB - SP,RP",5,null,"RP#2","Darren O'Day\nBal - RP",2,null,"RP#2","Fernando Rodriguez\nOak - RP",5,null,"RP#2","Jeff Manship \nCle - RP ",5,null,"RP#2","Brett Cecil\nTor - RP",16,null,"RP#2","Bryan Shaw\nCle - RP",2,null,"RP#2","Tom Wilhelmsen\nSea - RP",2,null,"RP#2","Jake McGee\nTB - RP",20,null,"RP#2","Caesar Ramos\nLAA - SP,RP",5,null,"RP#2","Ryan Madson \nKC - RP\n",5,null,"RP#2","Roberto Osuna \nTor - RP",5]
[1,"RP#3","Vince Velasquez \nHou - SP,RP",5,null,"RP#3",{"$nulls":3},"RP#3","Kendall Graveman\nOak - SP,RP",5,null,"RP#3","Adam Warren\nNYY - RP",1,null,"RP#3","Al Alburquerque\nDet - RP",5,null,"RP#3","Andrew Miller \nNYY - RP",10,1,"RP#3","Huston Street\nLAA - RP",10,1,"RP#3","Koji Uehara\nBos - RP",26,1,"RP#3","Tommy Hunter\nBal - RP",5,null,"RP#3","Robbie Ross Jr. \nBos - SP,RP ",5,null,"RP#3","Josh Fields \nHou - RP",5]
[0,"RP#4","Kris Medlen \nKC - SP,RP",5,null,"RP#4","Zach Britton\nBal - RP",10,1,"RP#4","Mark Lowe\nTor - RP",5,null,"RP#4","Dellin Betances \nNYY - RP",10,1,"RP#4","Joe Smith\nLAA - RP",4,null,"RP#4","Cody Allen \nCle - RP",6,1,"RP#4","Marco Estrada\nTor - SP,RP",5,null,"RP#4","Glen Perkins\nMin - RP",31,1,"RP#4","Brad Brach \nBal - RP",5,null,"RP#4","Neftali Feliz\nTex - RP",5,null,"RP#4","Will Harris \nHou - RP",5]
[null,null,"Current Used Points",{"$f":"SUM(D3:D20)","v":152},null,null,"Current Used Points",{"$f":"SUM(H3:H20)","v":253},null,null,"Current Used Points",{"$f":"SUM(L3:L20)","v":196},null,null,"Current Used Points",{"$f":"SUM(P3:P20)","v":174},null,null,"Current Used Points",{"$f":"SUM(T3:T20)","v":164},null,null,"Current Used Points",{"$f":"SUM(X3:X20)","v":214},null,null,"Current Used Points",{"$f":"SUM(AB3:AB20)","v":206},null,null,"Current Used Points",{"$f":"SUM(AF3:AF20)","v":208},null,null,"Current Used Points",{"$f":"SUM(AJ3:AJ20)","v":191},null,null,"Current Used Points",{"$f":"SUM(AN3:AN20)","v":138},null,null,"Current Used Points",{"$f":"SUM(AR3:AR20)","v":144}]
[null,null,"Remaining Points",{"$f":"SUM(260-D21)","v":108},null,null,"Remaining Points",{"$f":"SUM(260-H21)","v":7},null,null,"Remaining Points",{"$f":"SUM(260-L21)","v":64},null,null,"Remaining Points",{"$f":"SUM(260-P21)","v":86},null,null,"Remaining Points",{"$f":"SUM(260-T21)","v":96},null,null,"Remaining Points",{"$f":"SUM(260-X21)","v":46},null,null,"Remaining Points",{"$f":"SUM(260-AB21)","v":54},null,null,"Remaining Points",{"$f":"SUM(260-AF21)","v":52},null,null,"Remaining Points",{"$f":"SUM(260-AJ21)","v":69},null,null,"Remaining Points",{"$f":"SUM(260-AN21)","v":122},null,null,"Remaining Points",{"$f":"SUM(260-AR21)","v":116}]
[null,"Maximum Bidding Points",null,{"$f":"(D22-(18-COUNT(D3:D20))+(IF(COUNT(D3:D20)=18,0,1)))","v":108},null,"Maximum Bidding Points",null,{"$f":"(H22-(18-COUNT(H3:H20))+(IF(COUNT(H3:H20)=18,0,1)))","v":4},null,"Maximum Bidding Points",null,{"$f":"(L22-(18-COUNT(L3:L20))+(IF(COUNT(L3:L20)=18,0,1)))","v":64},null,"Maximum Bidding Points",null,{"$f":"(P22-(18-COUNT(P3:P20))+(IF(COUNT(P3:P20)=18,0,1)))","v":86},null,"Maximum Bidding Points",null,{"$f":"(T22-(18-COUNT(T3:T20))+(IF(COUNT(T3:T20)=18,0,1)))","v":96},null,"Maximum Bidding Points",null,{"$f":"(X22-(18-COUNT(X3:X20))+(IF(COUNT(X3:X20)=18,0,1)))","v":46},null,"Maximum Bidding Points",null,{"$f":"(AB22-(18-COUNT(AB3:AB20))+(IF(COUNT(AB3:AB20)=18,0,1)))","v":54},null,"Maximum Bidding Points",null,{"$f":"(AF22-(18-COUNT(AF3:AF20))+(IF(COUNT(AF3:AF20)=18,0,1)))","v":52},null,"Maximum Bidding Points",null,{"$f":"(AJ22-(18-COUNT(AJ3:AJ20))+(IF(COUNT(AJ3:AJ20)=18,0,1)))","v":69},null,"Maximum Bidding Points",null,{"$f":"(AN22-(18-COUNT(AN3:AN20))+(IF(COUNT(AN3:AN20)=18,0,1)))","v":122},null,"Maximum Bidding Points",null,{"$f":"(AR22-(18-COUNT(AR3:AR20))+(IF(COUNT(AR3:AR20)=18,0,1)))","v":116}]
[null,"Remaining # of Players to Draft",null,{"$f":"18-COUNT(D3:D20)","v":1},null,"Remaining # of Players to Draft",null,{"$f":"18-COUNT(H3:H20)","v":4},null,"Remaining # of Players to Draft",null,{"$f":"18-COUNT(L3:L20)","v":0},null,"Remaining # of Players to Draft",null,{"$f":"18-COUNT(P3:P20)","v":1},null,"Remaining # of Players to Draft",null,{"$f":"18-COUNT(T3:T20)","v":1},null,"Remaining # of Players to Draft",null,{"$f":"18-COUNT(X3:X20)","v":0},null,"Remaining # of Players to Draft",null,{"$f":"18-COUNT(AB3:AB20)","v":0},null,"Remaining # of Players to Draft",null,{"$f":"18-COUNT(AF3:AF20)","v":1},null,"Remaining # of Players to Draft",null,{"$f":"18-COUNT(AJ3:AJ20)","v":0},null,"Remaining # of Players to Draft",null,{"$f":"18-COUNT(AN3:AN20)","v":0},null,"Remaining # of Players to Draft",null,{"$f":"18-COUNT(AR3:AR20)","v":1}]
[]
[]
[null,null,"Ketel Marte\nSea - 2B, SS",5,"r2016",null,"Richie Shaffer \nTB - 1B,3B ",5,"r2016",null,"Mark Trumbo \nSea - 1B,OF",5,"r2016",null,"Devon Travis\nTor - 2B",5,"r2016",null,"Carlos Gomez\nHou - OF",5,"r2016",null,"J.J. Hardy\nBal - SS",5,"r2016",null,"James McCann \nDet - C",5,"r2016",null,"Ryan Goins \nTor - 2B,SS",5,null,null,"Cole Hamels \nTex - SP",5,"r2016",null,"Yu Darvish\nTex - SP",13,"r2016",null,"Troy Tulowitzki \nTor - SS",5,"r2016"]
[null,null,"Bradley Zimmer\nCle - OF",5,"r2016",null,"Tim Anderson \nCWS - SS ",5,"r2016",null,"Gerardo Parra \nBal - OF",5,"r2016",null,"Gary Sánchez \nNYY - C ",5,2016,null,"Mike Fiers\nHou - SP",5,"r2016",null,"Rob Refsnyder \nNYY - 2B",5,"r2016",null,"Trayce Thompson \nCWS - OF",5,"r2016",null,"Josh Tomlin \nCle - SP,RP",5,null,null,"Andrew Bellatti \nTB - SP,RP",5,"r2016",null,"Mat Latos \nLAA - SP ",5,"r2016",null,"Blake Swihart\nBos - C",5,"r2016"]
[null,null,"Frankie Montas\nCWS - RP",5,"r2016",null,"Mitch Moreland \nTex - 1B ",5,null,null,"Max Kepler \nMin - 1B,OF",5,"r2016",null,"CC Sabathia\nNYY - SP",8,null,null,"Hector Santiago\nLAA - SP,RP",5,"r2016",null,"Chasen Shreve \nNYY - RP ",5,null,null,"Byron Buxton \nMin - OF",5,null,null,"Justin Wilson \nNYY - RP",5,null,null,"Jarrod Parker \nOak - SP ",5,"r2016",null,"Yoan Moncada \nBos - 2B",1,"r2016",null,"Greg Bird \nNYY - 1B",5,"r2016"]
[null,null,"Miguel Almonte\nKC - SP, RP",5,"r2016",null,"Hanley Ramírez\nBos - SS",51,null,null,"Josh Berrios\nMin - SP",5,"r2016",null,"Nathan Eovaldi \nNYY - SP",5,null,null,"Joe Nathan\nDet - RP",19,"r2016",null,"Keone Kela \nTex - RP\n",5,null,null,"Dayan Viciedo \nTor - OF",5,null,null,"Tommy Milone \nMin - SP",5,null,null,"Joey Gallo\nTex - 3B",5,"r2016",null,"Tyler Skaggs \nLAA - SP ",5,"r2016",null,"Aaron Judge\nNYY - OF\nHou - 1B",5,"r2016"]
[null,null,"Sean Manaea\nKC- SP",5,"r2016",null,"David Freese \nLAA - 3B ",5,null,null,"Charlie Furbush\nSea - RP",5,null,null,"Craig Breslow\nBos - RP",5,null,null,"Desmond Jennings\nTB - OF",4,null,null,"Alex Cobb\nTB - SP",20,null,null,"Logan Morrison\nSea - 1B,OF",5,null,null,"Liam Hendriks \nTor - SP,RP",5,null,null,"Oswaldo Arcia\nMin - OF",5,"r2016",null,"C.J. Cron\nLAA - 1B",5,null,null,"Micah Johnson\nCWS - 2B",1]
[null,null,"Erik Johnson \nCWS - SP",5,{"$nulls":6},"Kyle Blanks \nTex - 1B",5,{"$nulls":6},"Chris Young \nNYY - OF",5,{"$nulls":6},"Jesse Chavez\nOak - SP,RP",10,null,null,"Steven Wright \nBos - SP,RP",5,null,null,"Gavin Floyd\nCle - SP,RP",5,null,null,"A.J. Griffin\nOak - SP",5,null,null,"Sam Dyson \nTex - RP",5]
[null,null,"Martin Perez\nTex - SP",5,{"$nulls":14},"Jake Marisnick \nHou - OF",5,{"$nulls":6},"Johnny Giavotella\nLA - 2B",5,{"$nulls":6},"Josh Reddick\nOak - OF",5,{"$nulls":6},"Mark Appel\nHou - SP",5]
[null,null,{"$f":"\"Draft Order = \"&VLOOKUP(\"Lightning (Mike Goodman)\",draft_order,2,FALSE)","v":"Draft Order = 10"},{"$nulls":3},{"$f":"\"Draft Order = \"&VLOOKUP(\"Evolution (Bruce)\",draft_order,2,FALSE)","v":"Draft Order = 5"},{"$nulls":3},{"$f":"\"Draft Order = \"&VLOOKUP(\"The Soylent Knights (Colin)\",draft_order,2,FALSE)","v":"Draft Order = 7"},{"$nulls":3},{"$f":"\"Draft Order = \"&VLOOKUP(\"Woap (Mike)\",draft_order,2,FALSE)","v":"Draft Order = 9"},{"$nulls":3},{"$f":"\"Draft Order = \"&VLOOKUP(\"The Dominant Brand (Brandon)\",draft_order,2,FALSE)","v":"Draft Order = 2"},{"$nulls":3},{"$f":"\"Draft Order = \"&VLOOKUP(\"Guzzlers (Rhonda)\",draft_order,2,FALSE)","v":"Draft Order = 4"},{"$nulls":3},{"$f":"\"Draft Order = \"&VLOOKUP(\"The Macon Whoopees (Rob)\",draft_order,2,FALSE)","v":"Draft Order = 6"},{"$nulls":3},{"$f":"\"Draft Order = \"&VLOOKUP(\"Booya's (Cathy)\",draft_order,2,FALSE)","v":"Draft Order = 8"},{"$nulls":3},{"$f":"\"Draft Order = \"&VLOOKUP(\"Freebirds (Todd)\",draft_order,2,FALSE)","v":"Draft Order = 3"},{"$nulls":3},{"$f":"\"Draft Order = \"&VLOOKUP(\"Numbats (Tom)\",draft_order,2,FALSE)","v":"Draft Order = 11"},{"$nulls":3},{"$f":"\"Draft Order = \"&VLOOKUP(\"TheDunnShow (Dave)\",draft_order,2,FALSE)","v":"Draft Order = 1"}]
[null,null,"T.J. House\nCle -SP",5,{"$nulls":14},"Asdrubal Cabrera\nTB - 2B,SS",8,{"$nulls":6},"Tony Sipp \nHou - RP",5,{"$nulls":6},"Shane Robinson \nMin - OF",5,{"$nulls":6},"Joe Kelly \nBos - SP",5]
[null,null,"Josh Hamilton\nLAA - OF",5,{"$nulls":30},"Stephen Drew\nNYY - 2B,SS",5]
[null,null,"Álex Rodríguez\nNYY - 3B",5,{"$nulls":30},"Dustin Ackley\nSea - OF",5]

{"sheet":"Draft List","index":1,"n_rows":276,"n_cols":12,"rows_kept":276}
[274,"Owner","Player","Bid","Team/Position","Rank","AB/Innings","R/Wins","HR/Saves","RBI/SO","SB/ERA","Avg./WHIP"]
[1,"The Soylent Knights (Colin)","Ian Kinsler ","25","Det - 2B",58,"188/684",100,17,92,15,0.275]
[2,"The Soylent Knights (Colin)","Chase Headley ","10","NYY - 1B,3B",228,"114/470",55,13,49,7,0.243]
[3,"The Soylent Knights (Colin)","Erick Aybar ","1","LAA - SS",171,"164/589",77,7,68,16,0.278]
[4,"The Soylent Knights (Colin)","Torii Hunter ","10","Min - OF",149,"157/549",71,17,83,4,0.286]
[5,"The Soylent Knights (Colin)","Taijuan Walker ","15","Sea - SP",452,38,2,0,34,2.61,1.29]
[6,"The Soylent Knights (Colin)","Michael Pineda ","17","NYY - SP",232,76.1,5,0,59,1.89,0.83]
[7,"The Soylent Knights (Colin)","Trevor Bauer ","5","Cle - SP",953,153,5,0,143,4.18,1.38]
[8,"The Soylent Knights (Colin)","Clay Buchholz ","23","Bos - SP",1033,170.1,8,0,132,5.34,1.39]
[9,"The Soylent Knights (Colin)","Drew Pomeranz ","5","Oak - SP,RP",349,69,5,0,64,2.35,1.12]
[10,"The Soylent Knights (Colin)","Bruce Rondon ","1","Det - RP",604,"-","-","-","-","-","-"]
[11,"The Soylent Knights (Colin)","Greg Holland","15","KC - RP",73,62.1,1,46,90,1.44,0.91]
[12,"The Soylent Knights (Colin)","Carlos Correa ","5","Hou - SS",1479,"-/-","-","-","-","-","-"]
[13,"The Soylent Knights (Colin)","Dalton Pompey ","5","Tor - OF",1358,"9/39",5,1,4,1,0.231]
[14,"Woap (Mike)","Miguel Cabrera ","56","Det - 1B,3B",4,"191/611",101,25,109,1,0.313]
[15,"Woap (Mike)","Josh Donaldson ","10","Tor - 3B",32,"155/608",93,29,98,8,0.255]
[16,"Woap (Mike)","José Bautista ","46","Tor - 1B,OF",11,"158/553",101,35,103,6,0.286]
[17,"Woap (Mike)","Kole Calhoun ","10","LAA - OF",76,"134/493",90,17,58,5,0.272]
[18,"Woap (Mike)","David Price ","31","Det - SP",34,248.1,15,0,271,3.26,1.08]
[19,"Woap (Mike)","Phil Hughes ","10","Min - SP",139,209.2,16,0,186,3.52,1.13]
[20,"Woap (Mike)","Collin McHugh ","10","Hou - SP",221,154.2,11,0,157,2.73,1.02]
[21,"Woap (Mike)","Dellin Betances ","10","NYY - RP",114,90,5,1,135,1.4,0.78]
[22,"Woap (Mike)","Rusney Castillo ","5","Bos - OF",176,"12/36",6,2,6,3,0.333]
[23,"Woap (Mike)","Daniel Norris","5","Tor - SP","-","-","-","-","-","-",0.333]
["24","The Dominant Brand (Brandon)","Matt Wieters ","10","Bal - C",177,"32/104",13,5,18,0,0.308]
[25,"The Dominant Brand (Brandon)","Alex Gordon","21","KC - OF",68,"150/563",87,19,74,12,0.266]
[26,"The Dominant Brand (Brandon)","Anibal Sánchez ","15","Det - SP",106,126,8,0,102,3.43,1.1]
[27,"The Dominant Brand (Brandon)","Corey Kluber ","10","Cle - SP",37,235.2,18,0,269,2.44,1.09]
[28,"The Dominant Brand (Brandon)","Mark Buehrle ","5","Tor - SP",410,202,13,0,119,3.39,1.36]
[29,"The Dominant Brand (Brandon)","R.A. Dickey ","19","Tor - SP",253,215.2,14,0,173,3.71,1.23]
[30,"The Dominant Brand (Brandon)","Kendrys Morales","5","KC - 1B",995,"80/367",28,8,42,0,0.218]
[31,"Guzzlers (Rhonda)","Adam Jones ","46","Bal - OF",9,"181/644",88,29,96,7,0.281]
[32,"Guzzlers (Rhonda)","Sonny Gray ","15","Oak - SP",81,219,14,0,183,3.08,1.19]
[33,"Guzzlers (Rhonda)","Drew Hutchison ","6","Tor - SP",436,184.2,11,0,184,4.48,1.26]
[34,"Guzzlers (Rhonda)","Danny Salazar ","5","Cle - SP",236,110,6,0,120,4.25,1.38]
[35,"Guzzlers (Rhonda)","Jeff Samardzija ","5","CWS - SP",80,219.2,7,0,202,2.99,1.07]
[36,"Guzzlers (Rhonda)","Mookie Betts ","5","Bos - 2B,OF",93,"55/189",34,5,18,7,0.291]
[37,"Guzzlers (Rhonda)","Cody Allen ","6","Cle - RP",123,69.2,6,24,91,2.07,1.06]
[38,"Guzzlers (Rhonda)","Andrew Miller ","10","NYY - RP",287,62.1,5,1,103,2.02,0.8]
[39,"Guzzlers (Rhonda)","Xander Bogaerts ","5","Bos - 3B,SS",211,"129/538",60,12,46,2,0.24]
[40,"Numbats (Tom)","Stephen Vogt","5","Oak - C,1B,OF",270,"75/269",26,9,35,1,0.279]
[41,"Numbats (Tom)","Albert Pujols","31","LAA - 1B",40,"172/633",89,28,105,5,0.272]
[42,"Numbats (Tom)","Danny Santana","5","Min - SS,OF",182,"129/405",70,7,40,20,0.319]
[43,"Numbats (Tom)","Lorenzo Cain","5","KC - OF",144,"142/471",55,5,53,28,0.301]
[44,"Numbats (Tom)","Mike Trout","15","LAA - OF",1,"173/602",115,36,111,16,0.287]
[45,"Numbats (Tom)","Carlos Carrasco","10","Cle - SP,RP",125,134,8,1,140,2.55,0.99]
[46,"Numbats (Tom)","Matt Shoemaker","10","LAA - SP,RP",217,136,16,0,124,3.04,1.07]
[47,"Numbats (Tom)","Danny Duffy","5","KC - SP,RP",286,149.1,9,0,113,2.53,1.11]
[48,"Numbats (Tom)","Jered Weaver","21","LAA - SP",178,213.1,18,0,169,3.59,1.21]
[49,"Numbats (Tom)","Sean Doolittle","5","Oak - RP",262,62.2,2,22,89,2.73,0.73]
[50,"Numbats (Tom)","Fernando Rodney","21","Sea - RP",164,66.1,1,48,76,2.85,1.34]
[51,"Numbats (Tom)","Wade Davis","5","KC - RP",280,72,9,3,109,1,0.85]
[52,"Numbats (Tom)","Nick Franklin","5","TB - 2B,SS",1262,"13/81",7,1,6,2,0.16]
[53,"Numbats (Tom)","Allen Craig","5","Bos - 1B,OF",728,"99/461",41,8,46,2,0.215]
[54,"Numbats (Tom)","Mark Appel","5","Hou - SP",647,"-","-","-","-","-","-"]
[55,"Lightning (Mike Goodman)","Brian McCann","20","NYY - C,1B",167,"115/495",57,23,75,0,0.232]
[56,"Lightning (Mike Goodman)","Jurickson Profar","15","Tex - 2B,SS",1325,"-/-","-","-","-","-","-"]
[57,"Lightning (Mike Goodman)","Mike Moustakas","11","KC - 3B",931,"97/457",45,15,54,1,0.212]
[58,"Lightning (Mike Goodman)","Brett Gardner","18","NYY - OF",97,"142/555",87,17,58,21,0.256]
[59,"Lightning (Mike Goodman)","Avisail García","5","CWS - OF",227,"42/172",19,7,29,4,0.244]
[60,"Lightning (Mike Goodman)","Yordano Ventura","10","KC - SP",153,183,14,0,159,3.2,1.3]
[61,"Lightning (Mike Goodman)","Kevin Gausman","15","Bal - SP",449,113.1,7,0,88,3.57,1.31]
[62,"Lightning (Mike Goodman)","Drew Smyly","14","TB - SP",209,153,9,0,133,3.24,1.16]
[63,"Lightning (Mike Goodman)","Scott Kazmir","10","Oak - SP",189,190.1,15,0,164,3.55,1.16]
[64,"Lightning (Mike Goodman)","Brad Boxberger","5","TB - RP",289,64.2,5,2,104,2.37,0.84]
[65,"Lightning (Mike Goodman)","Francisco Lindor","5","Cle - SS",1532,"-/-","-","-","-","-","-"]
[66,"Lightning (Mike Goodman)","Neftali Feliz","5","Tex - RP",210,31.2,2,13,21,1.99,0.98]
[67,"Booya's (Cathy)","José Altuve","21","Hou - 2B",17,"225/660",85,7,59,56,0.341]
[68,"Booya's (Cathy)","Nelson Cruz","23","Sea - OF",65,"166/613",87,40,108,4,0.271]
[69,"Booya's (Cathy)","Álex Ríos","26","KC - OF",140,"138/492",54,4,54,17,0.28]
[70,"Booya's (Cathy)","J.D. Martínez","10","Det - OF",95,"139/441",57,23,76,6,0.315]
[71,"Booya's (Cathy)","Derek Holland","7","Tex - SP",342,37,2,0,25,1.46,1.05]
[72,"Booya's (Cathy)","Dallas Keuchel","10","Hou - SP",260,200,12,0,146,2.93,1.18]
[73,"Booya's (Cathy)","Hisashi Iwakuma","27","Sea - SP",78,179,15,0,154,3.52,1.05]
[74,"Booya's (Cathy)","Koji Uehara","26","Bos - RP",117,64.1,6,26,80,2.52,0.92]
[75,"Booya's (Cathy)","Glen Perkins","31","Min - RP",148,61.2,4,34,66,3.65,1.18]
[76,"Evolution (Bruce)","Yan Gomes","15","Cle - C",104,"135/485",61,21,74,0,0.278]
[77,"Evolution (Bruce)","José Abreu","22","CWS - 1B",8,"176/556",80,36,107,3,0.317]
[78,"Evolution (Bruce)","Jason Kipnis","15","Cle - 2B",90,"120/500",61,6,41,22,0.24]
[79,"Evolution (Bruce)","Manny Machado","15","Bal - 3B",132,"91/327",38,12,32,2,0.278]
[80,"Evolution (Bruce)","Alcides Escobar","5","KC - SS",201,"165/579",74,3,50,31,0.285]
[81,"Evolution (Bruce)","George Springer","15","Hou - OF",55,"68/295",45,20,51,5,0.231]
[82,"Evolution (Bruce)","Matt Moore","11","TB - SP",443,10,0,0,6,2.7,1.5]
[83,"Evolution (Bruce)","Rick Porcello","6","Bos - SP",222,204.2,15,0,129,3.43,1.23]
[84,"Evolution (Bruce)","Chris Archer","6","TB - SP",138,194.2,10,0,173,3.33,1.28]
[85,"Evolution (Bruce)","Masahiro Tanaka","30","NYY - SP",129,136.1,13,0,141,2.77,1.06]
[86,"Evolution (Bruce)","Luke Gregerson","1","Hou - RP",191,72.1,5,3,59,2.12,1.01]
[87,"Evolution (Bruce)","Huston Street","10","LAA - RP",151,59.1,2,41,57,1.37,0.94]
[88,"Evolution (Bruce)","Zach Britton","10","Bal - RP",165,76.1,3,37,62,1.65,0.9]
[89,"Evolution (Bruce)","Byron Buxton","5","Min - OF",1525,"-/-","-","-","-","-","-"]
[90,"Evolution (Bruce)","Miguel Sano","5","Min - 3B,SS",1503,"-/-","-","-","-","-","-"]
[91,"Evolution (Bruce)","Aarón Sánchez","5","Tor - RP",334,33,2,3,27,1.09,0.7]
[92,"Evolution (Bruce)","Kelvin Herrera","1","KC - RP",300,70,4,0,59,1.41,1.14]
[93,"The Macon Whoopees (Rob)","Leonys Martín","10","Tex - OF",142,"146/533",68,7,40,31,0.274]
[94,"The Macon Whoopees (Rob)","Garrett Richards","11","LAA - SP",136,168.2,13,0,164,2.61,1.04]
[95,"The Macon Whoopees (Rob)","Félix Hernández","40","Sea - SP",12,236,15,0,248,2.14,0.92]
[96,"The Macon Whoopees (Rob)","Logan Morrison","5","Sea - 1B,OF",624,"88/336",41,11,38,5,0.262]
[97,"Freebirds (Todd)","Carlos Santana","24","Cle - C,1B,3B",89,"125/541",68,27,85,5,0.231]
[98,"Freebirds (Todd)","Jake Odorizzi","3","TB - SP",205,168,11,0,174,4.13,1.28]
[99,"Freebirds (Todd)","Chris Tillman","8","Bal - SP",230,207.1,13,0,150,3.34,1.23]
[100,"Freebirds (Todd)","Marcus Stroman","15","Tor - SP,RP",184,130.2,11,1,111,3.65,1.17]
[101,"Freebirds (Todd)","David Robertson","31","CWS - RP",92,64.1,4,39,96,3.08,1.06]
[102,"Freebirds (Todd)","Junichi Tazawa","1","Bos - RP",345,63,4,0,64,2.86,1.19]
[103,"Freebirds (Todd)","Stephen Drew","5","NYY - 2B,SS",1184,"44/271",18,7,26,1,0.162]
[104,"Freebirds (Todd)","Joey Gallo","5","Tex - 3B",1534,"-/-","-","-","-","-","-"]
[105,"TheDunnShow (Dave)","Hanley Ramírez","51","Bos - SS",23,"127/449",64,13,71,14,0.283]
[106,"Guzzlers (Rhonda)","Robinson Canó","49","Sea - 2B",15,"187/595",77,14,82,10,0.314]
[107,"The Soylent Knights (Colin)","Salvador Pérez","14","KC - C",121,"150/578",57,17,70,1,0.26]
[108,"Numbats (Tom)","Evan Gattis","36","Hou - C",134,"97/369",41,22,52,0,0.263]
[109,"Lightning (Mike Goodman)","Edwin Encarnación","48","Tor - 1B",14,"128/477",75,34,98,2,0.268]
[110,"Guzzlers (Rhonda)","Adrián Béltre","40","Tex - 3B",18,"178/549",79,19,77,1,0.324]
[111,"The Soylent Knights (Colin)","Chris Sale","50","CWS - SP",16,174,12,0,208,2.17,0.97]
[112,"Numbats (Tom)","Kyle Seager","38","Sea - 3B",66,"158/590",71,25,96,7,0.268]
[113,"Lightning (Mike Goodman)","Jacoby Ellsbury","49","NYY - OF",25,"156/575",71,16,70,39,0.271]
[114,"Freebirds (Todd)","Tyler Clippard","21","Oak - RP",197,70.1,7,1,82,2.18,1]
[115,"Booya's (Cathy)","Jake McGee","20","TB - RP",224,71.1,5,19,90,1.89,0.9]
[116,"Numbats (Tom)","Yu Darvish","13","Tex - SP",31,144.1,10,0,182,3.06,1.26]
[117,"Guzzlers (Rhonda)","Alex Cobb","20","TB - SP",74,166.1,10,0,149,2.87,1.14]
[118,"The Macon Whoopees (Rob)","Víctor Martínez","32","Det - 1B",43,"188/561",87,32,103,3,0.335]
[119,"The Dominant Brand (Brandon)","Michael Brantley","46","Cle - OF",29,"200/611",94,20,97,23,0.327]
[120,"The Dominant Brand (Brandon)","José Reyes","36","Tor - SS",53,"175/610",94,9,51,30,0.287]
[121,"Woap (Mike)","Brian Dozier","36","Min - 2B",88,"145/598",112,23,71,21,0.242]
[122,"The Soylent Knights (Colin)","Yoenis Céspedes","37","Det - OF",54,"156/600",89,22,100,7,0.26]
[123,"TheDunnShow (Dave)","David Ortiz","45","Bos - 1B",45,"136/518",59,35,104,0,0.263]
[124,"Freebirds (Todd)","Chris Carter","40","Hou - 1B,OF",98,"115/507",68,37,88,5,0.227]
[125,"The Dominant Brand (Brandon)","Joe Smith","4","LAA - RP",278,74.2,7,15,68,1.81,0.8]
[126,"Freebirds (Todd)","Prince Fielder","28","Tex - 1B",50,"37/150",19,3,16,0,0.247]
[127,"Booya's (Cathy)","Russell Martin","19","Tor - C",187,"110/379",45,11,67,4,0.29]
[128,"Freebirds (Todd)","Evan Longoria","35","TB - 3B",71,"158/624",83,22,91,5,0.253]
[129,"The Macon Whoopees (Rob)","Alexei Ramírez","22","CWS - SS",101,"170/622",82,15,74,21,0.273]
[130,"Evolution (Bruce)","Chris Davis","45","Bal - 1B,3B",119,"88/450",65,26,72,2,0.196]
[131,"Lightning (Mike Goodman)","Adam LaRoche","27","CWS - 1B",120,"128/494",73,26,92,3,0.259]
[132,"The Dominant Brand (Brandon)","Eric Hosmer","6","KC - 1B",128,"136/503",54,9,58,4,0.27]
[133,"The Macon Whoopees (Rob)","Justin Verlander","31","Det - SP",172,206,15,0,159,4.54,1.4]
[134,"Evolution (Bruce)","Brandon Moss","26","Cle - 1B,OF",150,"117/500",70,25,81,1,0.234]
[135,"Guzzlers (Rhonda)","Steve Pearce","21","Bal - 1B,OF",192,"99/338",51,21,49,5,0.293]
[136,"TheDunnShow (Dave)","Darren O'Day","2","Bal - RP",282,68.2,5,4,73,1.7,0.89]
[137,"TheDunnShow (Dave)","Dustin Pedroia","32","Bos - 2B",103,"153/551",72,7,53,6,0.278]
[138,"Guzzlers (Rhonda)","Pablo Sandoval","28","Bos - 3B",102,"164/588",68,16,73,0,0.279]
[139,"Woap (Mike)","Elvis Andrus","16","Tex - SS",112,"163/619",72,2,41,27,0.263]
[140,"Freebirds (Todd)","Austin Jackson","9","Sea - OF",152,"153/597",71,4,47,20,0.256]
[141,"Numbats (Tom)","Shin-Soo Choo","7","Tex - OF",161,"110/455",58,13,40,3,0.242]
[142,"Booya's (Cathy)","Ben Zobrist","28","Oak - 2B,SS,OF",174,"155/570",83,10,52,10,0.272]
[143,"The Dominant Brand (Brandon)","Asdrubal Cabrera","8","TB - 2B,SS",251,"133/553",74,14,61,10,0.241]
[144,"The Macon Whoopees (Rob)","Coco Crisp","5","Oak - OF",169,"114/463",68,9,47,19,0.246]
[145,"Lightning (Mike Goodman)","Pat Neshek","1","Hou - RP",283,67.1,7,6,68,1.87,0.79]
[146,"The Dominant Brand (Brandon)","Joe Nathan","19","Det - RP",292,58,5,35,54,4.81,1.53]
[147,"The Macon Whoopees (Rob)","Dan Otero","2","Oak - RP",297,86.2,8,1,45,2.28,1.1]
[148,"Numbats (Tom)","Brett Lawrie","16","Oak - 2B,3B",254,"64/259",27,12,38,0,0.247]
[149,"The Macon Whoopees (Rob)","José Quintana","18","CWS - SP",188,200.1,9,0,178,3.32,1.24]
[150,"The Soylent Knights (Colin)","Omar Infante","1","KC - 2B",352,"133/528",50,6,66,9,0.252]
[151,"The Dominant Brand (Brandon)","Rajai Davis","7","Det - OF",180,"130/461",64,8,51,36,0.282]
[152,"Guzzlers (Rhonda)","Bryan Shaw","2","Cle - RP",302,76.1,5,2,64,2.59,1.09]
[153,"Evolution (Bruce)","Ervin Santana","20","Min - SP",214,196,14,0,179,3.95,1.31]
[154,"Booya's (Cathy)","Yovani Gallardo","3","Tex - SP",246,192.1,8,0,146,3.51,1.29]
[155,"Woap (Mike)","Mike Napoli","8","Bos - 1B",196,"103/415",49,17,55,3,0.248]
[156,"TheDunnShow (Dave)","James Paxton","11","Sea - SP",248,74,6,0,59,3.04,1.2]
[157,"Woap (Mike)","Wei-Yin Chen","7","Bal - SP",252,185.2,16,0,136,3.54,1.23]
[158,"Freebirds (Todd)","Dominic Leone","2","Sea - RP",305,66.1,8,0,70,2.17,1.16]
[159,"TheDunnShow (Dave)","Mike Zunino","5","Sea - C",838,"87/438",51,22,60,0,0.199]
[160,"The Soylent Knights (Colin)","Joe Mauer","3","Min - 1B",202,"126/455",60,4,55,3,0.277]
[161,"Evolution (Bruce)","Oswaldo Arcia","5","Min - OF",243,"86/372",46,20,57,1,0.231]
[162,"The Dominant Brand (Brandon)","Edinson Vólquez","11","KC - SP",330,192.2,13,0,140,3.04,1.23]
[163,"The Macon Whoopees (Rob)","Melky Cabrera","32","CWS - OF",195,"171/568",81,16,73,6,0.301]
[164,"The Dominant Brand (Brandon)","Trevor Plouffe","1","Min - 3B",295,"134/520",69,14,80,2,0.258]
[165,"The Macon Whoopees (Rob)","Jesse Chavez","10","Oak - SP,RP",366,146,8,0,136,3.45,1.31]
[166,"TheDunnShow (Dave)","Adam Eaton","4","CWS - OF",200,"146/486",76,1,35,15,0.3]
[167,"TheDunnShow (Dave)","Anthony Gose","6","Det - OF",1132,"54/239",31,2,13,15,0.226]
[168,"TheDunnShow (Dave)","Joakim Soria","23","Det - RP",321,44.1,2,18,48,3.25,0.99]
[169,"The Dominant Brand (Brandon)","Brett Cecil","16","Tor - RP",350,53.1,2,5,76,2.7,1.37]
[170,"Freebirds (Todd)","Steven Souza","17","TB - OF",235,"3/23",2,2,2,0,0.13]
[171,"The Soylent Knights (Colin)","Shane Victorino","1","Bos - OF",1065,"33/123",14,2,12,2,0.268]
[172,"Freebirds (Todd)","Luis Valbuena","8","Hou - 2B,3B",379,"119/478",68,16,51,1,0.249]
[173,"Booya's (Cathy)","Bud Norris","5","Bal - SP",309,165.1,15,0,139,3.65,1.22]
[174,"The Dominant Brand (Brandon)","Desmond Jennings","4","TB - OF",261,"117/479",64,10,36,15,0.244]
[175,"The Soylent Knights (Colin)","Danny Farquhar","4","Sea - RP",322,71,3,1,81,2.66,1.13]
[176,"Woap (Mike)","Adam Warren","1","NYY - RP",343,78.2,3,3,76,2.97,1.11]
[177,"Numbats (Tom)","Kendall Graveman","10","Oak - RP",598,4.2,0,0,4,3.86,0.86]
[178,"TheDunnShow (Dave)","Jesse Hahn","10","Oak - SP",353,73.1,7,0,70,3.07,1.21]
[179,"TheDunnShow (Dave)","Nick Castellanos","1","Det - 3B",532,"138/533",50,11,66,2,0.259]
[180,"Lightning (Mike Goodman)","Jed Lowrie","2","Hou - SS",382,"125/502",59,6,50,0,0.249]
[181,"The Macon Whoopees (Rob)","Tom Wilhelmsen","2","Sea - RP",308,79.1,3,1,72,2.27,1.05]
[182,"The Dominant Brand (Brandon)","Chad Qualls","7","Hou - RP",333,51.1,1,19,43,3.33,1.15]
[183,"The Macon Whoopees (Rob)","Lonnie Chisenhall","1","Cle - 1B,3B",263,"134/478",62,13,59,3,0.28]
[184,"TheDunnShow (Dave)","Edward Mujica","2","Bos - RP",397,60,2,8,43,3.9,1.38]
[185,"TheDunnShow (Dave)","CC Sabathia","8","NYY - SP",960,46,3,0,48,5.28,1.48]
[186,"TheDunnShow (Dave)","Andrew Heaney","8","LAA - SP",979,29.1,0,0,20,5.83,1.33]
[187,"TheDunnShow (Dave)","Jarrod Dyson","6","KC - OF",419,"70/260",33,1,24,36,0.269]
[188,"Freebirds (Todd)","Miguel González","1","Bal - SP",331,159,10,0,111,3.23,1.3]
[189,"The Macon Whoopees (Rob)","Mark Teixeira","2","NYY - 1B",225,"95/440",56,22,62,1,0.216]
[190,"The Macon Whoopees (Rob)","Kurt Suzuki","1","Min - C",581,"130/452",37,3,61,0,0.288]
[191,"Woap (Mike)","Jason Castro","1","Hou - C",511,"103/465",43,14,56,1,0.222]
[192,"Guzzlers (Rhonda)","Tyler Flowers","1","CWS - C",876,"98/407",42,15,50,0,0.241]
[193,"Lightning (Mike Goodman)","Dylan Bundy","1","Bal - RP",714,"-","-","-","-","-","-"]
[194,"TheDunnShow (Dave)","Micah Johnson","1","CWS - 2B",1551,"-/-","-","-","-","-","-"]
[195,"Freebirds (Todd)","Mike Avilés","1","Cle - 2B,3B,SS,OF",560,"85/344",38,5,39,14,0.247]
[196,"Booya's (Cathy)","Zach Duke","1","CWS - RP",344,58.2,5,0,74,2.45,1.13]
[197,"The Macon Whoopees (Rob)","Alfredo Simón","10","Det - SP",291,196.1,15,0,127,3.44,1.21]
[198,"Woap (Mike)","Grant Balfour","1","TB - RP",450,62.1,2,12,57,4.91,1.44]
[199,"Freebirds (Todd)","C.J. Wilson","2","LAA - SP",584,175.2,13,0,151,4.51,1.45]
[200,"Lightning (Mike Goodman)","Héctor Santiago","1","LAA - SP,RP",521,127.1,6,0,108,3.75,1.36]
[201,"TheDunnShow (Dave)","Henry Owens","9","Bos - SP",639,"-","-","-","-","-","-"]
[202,"Freebirds (Todd)","Michael Saunders","1","Tor - OF",269,"63/231",38,8,34,4,0.273]
[203,"Booya's (Cathy)","Billy Butler","1","Oak - 1B",216,"149/549",57,9,66,0,0.271]
[204,"The Macon Whoopees (Rob)","Emilio Bonifacio","1","CWS - 2B,OF",423,"102/394",47,3,24,26,0.259]
[205,"Woap (Mike)","Travis Snider","1","Bal - OF",891,"85/322",37,13,38,1,0.264]
[206,"Guzzlers (Rhonda)","Kennys Vargas","1","Min - 1B",1093,"59/215",26,9,38,0,0.274]
[207,"Lightning (Mike Goodman)","Alex Meyer","1","Min - SP",667,"-","-","-","-","-","-"]
[208,"TheDunnShow (Dave)","Carlos Rodon","1","CWS - RP",693,"-","-","-","-","-","-"]
[209,"Booya's (Cathy)","Matt Domínguez","1","Hou - 3B",579,"121/564",51,16,57,0,0.215]
[210,"The Macon Whoopees (Rob)","Jason Frasor","1","KC - RP",365,47.1,4,0,46,2.66,1.23]
[211,"Woap (Mike)","Álex Colomé","1","TB - SP",492,23.2,2,0,13,2.66,1.23]
[212,"Guzzlers (Rhonda)","Alejandro De Aza","1","Bal - OF",313,"120/477",56,8,41,17,0.252]
[213,"Booya's (Cathy)","Yoan Moncada","1","Bos - 2B",1518,"-/-","-","-","-","-","-"]
[214,"Woap (Mike)","Aaron Loup","1","Tor - RP",338,68.2,4,4,56,3.15,1.17]
[215,"Guzzlers (Rhonda)","J.A. Happ","1","Sea - SP",544,158,11,0,133,4.22,1.34]
[216,"Guzzlers (Rhonda)","Ross Detwiler","1","Tex - RP",959,63,2,1,39,4,1.41]
[217,"TheDunnShow (Dave)","Blake Swihart","5","Bos - C",1558,"-/-","-","-","-","-","-"]
[218,"The Dominant Brand (Brandon)","John Jaso","5","TB - C",800,"81/307",42,9,40,2,0.264]
[219,"Freebirds (Todd)","Carlos Beltrán","5","NYY - OF",219,"94/403",46,15,49,3,0.233]
[220,"Guzzlers (Rhonda)","Kevin Kiermaier","5","TB - OF",1044,"87/331",35,10,35,5,0.263]
[221,"Evolution (Bruce)","Marcus Semien","5","Oak - 2B,3B",1129,"54/231",30,6,28,3,0.234]
[222,"The Macon Whoopees (Rob)","Jeremy Guthrie","5","KC - SP",558,202.2,13,0,124,4.13,1.3]
[223,"The Soylent Knights (Colin)","C.J. Cron","5","LAA - 1B",1096,"62/242",28,11,37,0,0.256]
[224,"Booya's (Cathy)","Jason Vargas","5","KC - SP",393,187,11,0,128,3.71,1.27]
[225,"Woap (Mike)","T.J. House","5","Cle - SP",454,102,5,0,80,3.35,1.32]
[226,"Lightning (Mike Goodman)","Rougned Odor","5","Tex - 2B",983,"100/386",39,9,48,4,0.259]
[227,"Numbats (Tom)","Nathan Eovaldi","5","NYY - SP",1039,199.2,6,0,142,4.37,1.33]
[228,"TheDunnShow (Dave)","Jonathan Schoop","5","Bal - 2B,3B",1080,"95/455",48,16,45,2,0.209]
[229,"The Dominant Brand (Brandon)","Chris Young","5","Sea - SP",354,165,12,0,108,3.65,1.23]
[230,"Freebirds (Todd)","Dustin Ackley","5","Sea - OF",341,"123/502",64,14,65,8,0.245]
[231,"Guzzlers (Rhonda)","Brock Holt","5","Bos - 1B,2B,3B,SS,OF",455,"126/449",68,4,29,12,0.281]
[232,"Evolution (Bruce)","Josh Reddick","5","Oak - OF",368,"96/363",53,12,54,1,0.264]
[233,"The Macon Whoopees (Rob)","Kevin Pillar","5","Tor - OF",1217,"31/116",19,2,7,1,0.267]
[234,"The Soylent Knights (Colin)","Jake Smolinski","5","Tex - OF",1201,"30/86",12,3,12,0,0.349]
[235,"Booya's (Cathy)","Josh Hamilton","5","LAA - OF",190,"89/338",43,10,44,3,0.263]
[236,"Woap (Mike)","Devon Travis","5","Tor - 2B",1527,"-/-","-","-","-","-","-"]
[237,"Lightning (Mike Goodman)","Shane Greene","5","Det - SP",507,78.2,5,0,81,3.78,1.4]
[238,"Numbats (Tom)","Wade Miley","5","Bos - SP",948,201.1,8,0,183,4.34,1.4]
[239,"TheDunnShow (Dave)","Ryan Rua","5","Tex - 1B,OF",1226,"31/105",11,2,14,1,0.295]
[240,"The Dominant Brand (Brandon)","Álex Rodríguez","5","NYY - 3B",264,"-/-","-","-","-","-","-"]
[241,"Freebirds (Todd)","Dioner Navarro","5","Tor - C",359,"132/481",40,12,69,3,0.274]
[242,"Guzzlers (Rhonda)","A.J. Griffin","5","Oak - SP",429,"-","-","-","-","-","-"]
[243,"Evolution (Bruce)","Brad Miller","5","Sea - 2B,SS",949,"81/367",47,10,36,4,0.221]
[244,"The Macon Whoopees (Rob)","Marco Estrada","5","Tor - SP,RP",395,150.2,7,0,127,4.36,1.2]
[245,"The Soylent Knights (Colin)","José Berrios","5","Min - SP",681,"-","-","-","-","-","-"]
[246,"Booya's (Cathy)","Gordon Beckham","5","CWS - 2B,3B",895,"101/446",53,9,44,3,0.226]
[247,"Woap (Mike)","Ike Davis","5","Oak - 1B",906,"84/360",43,11,51,0,0.233]
[248,"Lightning (Mike Goodman)","Everth Cabrera","5","Bal - SS",null,"-","-","-","-","-","-"]
[249,"Numbats (Tom)","Jarrod Parker","5","Oak - SP",512,"-","-","-","-","-","-"]
[250,"TheDunnShow (Dave)","Jon Singleton","5","Hou - 1B",273,"52/310",42,13,44,2,0.168]
[251,"The Dominant Brand (Brandon)","Héctor Noesí","5","CWS - SP,RP",1112,172.1,8,0,123,4.75,1.37]
[252,"Freebirds (Todd)","Tommy Hunter","5","Bal - RP",306,60.2,3,11,45,2.97,1.1]
[253,"Guzzlers (Rhonda)","J.J. Hardy","5","Bal - SS",245,"142/529",56,9,52,0,0.268]
[254,"Evolution (Bruce)","Kevin Jepsen","5","TB - RP",376,65,0,2,75,2.63,1.05]
[255,"The Macon Whoopees (Rob)","Garrett Jones","5","NYY - 1B,OF",402,"122/496",59,15,53,0,0.246]
[256,"The Soylent Knights (Colin)","Iván Nova","5","NYY - SP",928,20.2,2,0,12,8.27,1.84]
[257,"Booya's (Cathy)","Zach Putnam","5","CWS - RP",323,54.2,5,6,46,1.98,1.08]
[258,"Woap (Mike)","Kyle Gibson","5","Min - SP",985,179.1,13,0,107,4.47,1.31]
[259,"Lightning (Mike Goodman)","Joe Kelly","5","Bos - SP",509,96.1,6,0,66,4.2,1.35]
[260,"Numbats (Tom)","Martín Pérez","5","Tex - SP",533,51.1,4,0,35,4.38,1.34]
[261,"TheDunnShow (Dave)","Nathan Karns","5","TB - SP",592,12,1,0,13,4.5,0.92]
[262,"The Dominant Brand (Brandon)","Colby Rasmus","5","Hou - OF",406,"78/346",45,18,40,4,0.225]
[263,"Freebirds (Todd)","David Carpenter","5","NYY - RP",325,61,6,3,67,3.54,1.26]
[264,"Guzzlers (Rhonda)","Robinson Chirinos","5","Tex - C",1079,"73/306",36,13,40,0,0.239]
[265,"The Macon Whoopees (Rob)","Dayan Viciedo","5","CWS - OF",355,"121/523",65,21,58,0,0.231]
[266,"The Soylent Knights (Colin)","Conor Gillaspie","5","CWS - 3B",394,"131/464",50,7,57,0,0.282]
[267,"Booya's (Cathy)","Eduardo Escobar","5","Min - 2B,3B,SS",829,"119/433",52,6,37,1,0.275]
[268,"Woap (Mike)","Justin Masterson","5","Bos - SP",1141,128.2,7,0,116,5.88,1.63]
[269,"Lightning (Mike Goodman)","Jake Marisnick","5","Hou - OF",1158,"55/221",21,3,19,11,0.249]
[270,"TheDunnShow (Dave)","Billy Burns","5","Oak - Util","1364","1/6","4","0","0","3","0.167"]
[271,"The Dominant Brand (Brandon)","James Loney","5","TB - 1B",288,"174/600",59,9,69,4,0.29]
[272,"Booya's (Cathy)","Nick Swisher","5","Cle - 1B,OF",1049,"75/360",33,8,42,0,0.208]
[273,"The Macon Whoopees (Rob)","Scott Feldman","5","Hou - SP",441,180.1,8,0,107,3.74,1.3]
[274,"TheDunnShow (Dave)","Didi Gregorius","5","NYY - 2B,SS",1098,"61/270",35,6,27,3,0.226]
["275","Booya's (Cathy)","Danny Hultzen","5","Sea - SP",683,"-","-","-","-","-","-"]

{"sheet":"Summary","index":2,"n_rows":13,"n_cols":15,"rows_kept":13}
["Owners","Current Used Points","Remaining Points","Max Bidding Points","Players Left to Draft","C","1B","2B","3B","SS","OF","DH","SP","RP","Reserve"]
["Lightning (Mike Goodman)",{"$f":"used1","v":152},{"$f":"'2015 Pre-Draft Rosters'!D22","v":108},{"$f":"'2015 Pre-Draft Rosters'!D23","v":108},{"$f":"'2015 Pre-Draft Rosters'!D24","v":1},{"$f":"1-COUNT('2015 Pre-Draft Rosters'!D3)","v":1},{"$f":"1-COUNT('2015 Pre-Draft Rosters'!D4)","v":0},{"$f":"1-COUNT('2015 Pre-Draft Rosters'!D5)","v":0},{"$f":"1-COUNT('2015 Pre-Draft Rosters'!D6)","v":0},{"$f":"1-COUNT('2015 Pre-Draft Rosters'!D7)","v":0},{"$f":"3-COUNT('2015 Pre-Draft Rosters'!D8:D10)","v":0},{"$f":"1-COUNT('2015 Pre-Draft Rosters'!D11)","v":0},{"$f":"5-COUNT('2015 Pre-Draft Rosters'!D12:D16)","v":0},{"$f":"4-COUNT('2015 Pre-Draft Rosters'!D17:D20)","v":0},{"$f":"7-COUNT('2015 Pre-Draft Rosters'!D27:D33)","v":0}]
["Evolution (Bruce)",{"$f":"used2","v":253},{"$f":"'2015 Pre-Draft Rosters'!H22","v":7},{"$f":"'2015 Pre-Draft Rosters'!H23","v":4},{"$f":"'2015 Pre-Draft Rosters'!H24","v":4},{"$f":"1-COUNT('2015 Pre-Draft Rosters'!H3)","v":0},{"$f":"1-COUNT('2015 Pre-Draft Rosters'!H4)","v":0},{"$f":"1-COUNT('2015 Pre-Draft Rosters'!H5)","v":0},{"$f":"1-COUNT('2015 Pre-Draft Rosters'!H6)","v":0},{"$f":"1-COUNT('2015 Pre-Draft Rosters'!H7)","v":0},{"$f":"3-COUNT('2015 Pre-Draft Rosters'!H8:H10)","v":2},{"$f":"1-COUNT('2015 Pre-Draft Rosters'!H11)","v":0},{"$f":"5-COUNT('2015 Pre-Draft Rosters'!H12:H16)","v":0},{"$f":"4-COUNT('2015 Pre-Draft Rosters'!H17:H20)","v":2},{"$f":"7-COUNT('2015 Pre-Draft Rosters'!H27:H33)","v":2}]
["The Soylent Knights (Colin)",{"$f":"used3","v":196},{"$f":"'2015 Pre-Draft Rosters'!L22","v":64},{"$f":"'2015 Pre-Draft Rosters'!L23","v":64},{"$f":"'2015 Pre-Draft Rosters'!L24","v":0},{"$f":"1-COUNT('2015 Pre-Draft Rosters'!L3)","v":0},{"$f":"1-COUNT('2015 Pre-Draft Rosters'!L4)","v":0},{"$f":"1-COUNT('2015 Pre-Draft Rosters'!L5)","v":0},{"$f":"1-COUNT('2015 Pre-Draft Rosters'!L6)","v":0},{"$f":"1-COUNT('2015 Pre-Draft Rosters'!L7)","v":0},{"$f":"3-COUNT('2015 Pre-Draft Rosters'!L8:L10)","v":0},{"$f":"1-COUNT('2015 Pre-Draft Rosters'!L11)","v":0},{"$f":"5-COUNT('2015 Pre-Draft Rosters'!L12:L16)","v":0},{"$f":"4-COUNT('2015 Pre-Draft Rosters'!L17:L20)","v":0},{"$f":"7-COUNT('2015 Pre-Draft Rosters'!L27:L33)","v":1}]
["Woap (Mike)",{"$f":"used4","v":174},{"$f":"'2015 Pre-Draft Rosters'!P22","v":86},{"$f":"'2015 Pre-Draft Rosters'!P23","v":86},{"$f":"'2015 Pre-Draft Rosters'!P24","v":1},{"$f":"1-COUNT('2015 Pre-Draft Rosters'!P3)","v":0},{"$f":"1-COUNT('2015 Pre-Draft Rosters'!P4)","v":0},{"$f":"1-COUNT('2015 Pre-Draft Rosters'!P5)","v":0},{"$f":"1-COUNT('2015 Pre-Draft Rosters'!P6)","v":1},{"$f":"1-COUNT('2015 Pre-Draft Rosters'!P7)","v":0},{"$f":"3-COUNT('2015 Pre-Draft Rosters'!P8:P10)","v":0},{"$f":"1-COUNT('2015 Pre-Draft Rosters'!P11)","v":0},{"$f":"5-COUNT('2015 Pre-Draft Rosters'!P12:P16)","v":0},{"$f":"4-COUNT('2015 Pre-Draft Rosters'!P17:P20)","v":0},{"$f":"7-COUNT('2015 Pre-Draft Rosters'!P27:P33)","v":2}]
["The Dominant Brand (Brandon)",{"$f":"used5","v":164},{"$f":"'2015 Pre-Draft Rosters'!T22","v":96},{"$f":"'2015 Pre-Draft Rosters'!T23","v":96},{"$f":"'2015 Pre-Draft Rosters'!T24","v":1},{"$f":"1-COUNT('2015 Pre-Draft Rosters'!T3)","v":1},{"$f":"1-COUNT('2015 Pre-Draft Rosters'!T4)","v":0},{"$f":"1-COUNT('2015 Pre-Draft Rosters'!T5)","v":0},{"$f":"1-COUNT('2015 Pre-Draft Rosters'!T6)","v":0},{"$f":"1-COUNT('2015 Pre-Draft Rosters'!T7)","v":0},{"$f":"3-COUNT('2015 Pre-Draft Rosters'!T8:T10)","v":0},{"$f":"1-COUNT('2015 Pre-Draft Rosters'!T11)","v":0},{"$f":"5-COUNT('2015 Pre-Draft Rosters'!T12:T16)","v":0},{"$f":"4-COUNT('2015 Pre-Draft Rosters'!T17:T20)","v":0},{"$f":"7-COUNT('2015 Pre-Draft Rosters'!T27:T33)","v":0}]
["Guzzlers (Rhonda)",{"$f":"used6","v":214},{"$f":"'2015 Pre-Draft Rosters'!X22","v":46},{"$f":"'2015 Pre-Draft Rosters'!X23","v":46},{"$f":"'2015 Pre-Draft Rosters'!X24","v":0},{"$f":"1-COUNT('2015 Pre-Draft Rosters'!X3)","v":0},{"$f":"1-COUNT('2015 Pre-Draft Rosters'!X4)","v":0},{"$f":"1-COUNT('2015 Pre-Draft Rosters'!X5)","v":0},{"$f":"1-COUNT('2015 Pre-Draft Rosters'!X6)","v":0},{"$f":"1-COUNT('2015 Pre-Draft Rosters'!X7)","v":0},{"$f":"3-COUNT('2015 Pre-Draft Rosters'!X8:X10)","v":0},{"$f":"1-COUNT('2015 Pre-Draft Rosters'!X11)","v":0},{"$f":"5-COUNT('2015 Pre-Draft Rosters'!X12:X16)","v":0},{"$f":"4-COUNT('2015 Pre-Draft Rosters'!X17:X20)","v":0},{"$f":"7-COUNT('2015 Pre-Draft Rosters'!X27:X33)","v":2}]
["The Macon Whoopees (Rob)",{"$f":"used7","v":206},{"$f":"'2015 Pre-Draft Rosters'!AB22","v":54},{"$f":"'2015 Pre-Draft Rosters'!AB23","v":54},{"$f":"'2015 Pre-Draft Rosters'!AB24","v":0},{"$f":"1-COUNT('2015 Pre-Draft Rosters'!AB3)","v":0},{"$f":"1-COUNT('2015 Pre-Draft Rosters'!AB4)","v":0},{"$f":"1-COUNT('2015 Pre-Draft Rosters'!AB5)","v":0},{"$f":"1-COUNT('2015 Pre-Draft Rosters'!AB6)","v":0},{"$f":"1-COUNT('2015 Pre-Draft Rosters'!AB7)","v":0},{"$f":"3-COUNT('2015 Pre-Draft Rosters'!AB8:AB10)","v":0},{"$f":"1-COUNT('2015 Pre-Draft Rosters'!AB11)","v":0},{"$f":"5-COUNT('2015 Pre-Draft Rosters'!AB12:AB16)","v":0},{"$f":"4-COUNT('2015 Pre-Draft Rosters'!AB17:AB20)","v":0},{"$f":"7-COUNT('2015 Pre-Draft Rosters'!AB27:AB33)","v":0}]
["Booya's (Cathy)",{"$f":"used8","v":208},{"$f":"'2015 Pre-Draft Rosters'!AF22","v":52},{"$f":"'2015 Pre-Draft Rosters'!AF23","v":52},{"$f":"'2015 Pre-Draft Rosters'!AF24","v":1},{"$f":"1-COUNT('2015 Pre-Draft Rosters'!AF3)","v":0},{"$f":"1-COUNT('2015 Pre-Draft Rosters'!AF4)","v":0},{"$f":"1-COUNT('2015 Pre-Draft Rosters'!AF5)","v":0},{"$f":"1-COUNT('2015 Pre-Draft Rosters'!AF6)","v":0},{"$f":"1-COUNT('2015 Pre-Draft Rosters'!AF7)","v":0},{"$f":"3-COUNT('2015 Pre-Draft Rosters'!AF8:AF10)","v":1},{"$f":"1-COUNT('2015 Pre-Draft Rosters'!AF11)","v":0},{"$f":"5-COUNT('2015 Pre-Draft Rosters'!AF12:AF16)","v":0},{"$f":"4-COUNT('2015 Pre-Draft Rosters'!AF17:AF20)","v":0},{"$f":"7-COUNT('2015 Pre-Draft Rosters'!AF27:AF33)","v":1}]
["Freebirds (Todd)",{"$f":"used9","v":191},{"$f":"'2015 Pre-Draft Rosters'!AJ22","v":69},{"$f":"'2015 Pre-Draft Rosters'!AJ23","v":69},{"$f":"'2015 Pre-Draft Rosters'!AJ24","v":0},{"$f":"1-COUNT('2015 Pre-Draft Rosters'!AJ3)","v":0},{"$f":"1-COUNT('2015 Pre-Draft Rosters'!AJ4)","v":0},{"$f":"1-COUNT('2015 Pre-Draft Rosters'!AJ5)","v":0},{"$f":"1-COUNT('2015 Pre-Draft Rosters'!AJ6)","v":0},{"$f":"1-COUNT('2015 Pre-Draft Rosters'!AJ7)","v":0},{"$f":"3-COUNT('2015 Pre-Draft Rosters'!AJ8:AJ10)","v":0},{"$f":"1-COUNT('2015 Pre-Draft Rosters'!AJ11)","v":0},{"$f":"5-COUNT('2015 Pre-Draft Rosters'!AJ12:AJ16)","v":0},{"$f":"4-COUNT('2015 Pre-Draft Rosters'!AJ17:AJ20)","v":0},{"$f":"7-COUNT('2015 Pre-Draft Rosters'!AJ27:AJ33)","v":0}]
["Numbats (Tom)",{"$f":"used10","v":138},{"$f":"'2015 Pre-Draft Rosters'!AN22","v":122},{"$f":"'2015 Pre-Draft Rosters'!AN23","v":122},{"$f":"'2015 Pre-Draft Rosters'!AN24","v":0},{"$f":"1-COUNT('2015 Pre-Draft Rosters'!AN3)","v":0},{"$f":"1-COUNT('2015 Pre-Draft Rosters'!AN4)","v":0},{"$f":"1-COUNT('2015 Pre-Draft Rosters'!AN5)","v":0},{"$f":"1-COUNT('2015 Pre-Draft Rosters'!AN6)","v":0},{"$f":"1-COUNT('2015 Pre-Draft Rosters'!AN7)","v":0},{"$f":"3-COUNT('2015 Pre-Draft Rosters'!AN8:AN10)","v":0},{"$f":"1-COUNT('2015 Pre-Draft Rosters'!AN11)","v":0},{"$f":"5-COUNT('2015 Pre-Draft Rosters'!AN12:AN16)","v":0},{"$f":"4-COUNT('2015 Pre-Draft Rosters'!AN17:AN20)","v":0},{"$f":"7-COUNT('2015 Pre-Draft Rosters'!AN27:AN33)","v":1}]
["TheDunnShow (Dave)",{"$f":"used11","v":144},{"$f":"'2015 Pre-Draft Rosters'!AR22","v":116},{"$f":"'2015 Pre-Draft Rosters'!AR23","v":116},{"$f":"'2015 Pre-Draft Rosters'!AR24","v":1},{"$f":"1-COUNT('2015 Pre-Draft Rosters'!AR3)","v":0},{"$f":"1-COUNT('2015 Pre-Draft Rosters'!AR4)","v":0},{"$f":"1-COUNT('2015 Pre-Draft Rosters'!AR5)","v":0},{"$f":"1-COUNT('2015 Pre-Draft Rosters'!AR6)","v":0},{"$f":"1-COUNT('2015 Pre-Draft Rosters'!AR7)","v":1},{"$f":"3-COUNT('2015 Pre-Draft Rosters'!AR8:AR10)","v":0},{"$f":"1-COUNT('2015 Pre-Draft Rosters'!AR11)","v":0},{"$f":"5-COUNT('2015 Pre-Draft Rosters'!AR12:AR16)","v":0},{"$f":"4-COUNT('2015 Pre-Draft Rosters'!AR17:AR20)","v":0},{"$f":"7-COUNT('2015 Pre-Draft Rosters'!AR27:AR33)","v":0}]
[{"$nulls":4},{"$f":"SUM(E2:E12)","v":9},{"$f":"SUM(F2:F12)","v":2},0,0,1,1,3,0,0,2,9]

{"sheet":"Catchers","index":3,"n_rows":58,"n_cols":9,"rows_kept":58}
["Player","Team","Rank","H/AB","R","HR","RBI","SB","Avg."]
{"$rows_empty":8}
["Chris Iannetta","LAA - C",850,"77/306",41,7,43,3,0.252]
[]
["Álex Ávila","Det - C",1000,"85/390",44,11,47,0,0.218]
[]
["René Rivera","TB - C",1085,"74/294",27,11,44,0,0.252]
["J.P. Arencibia","Bal - C,1B",1137,"36/203",20,10,35,0,0.177]
["Josmil Pinto","Min - C",1165,"37/169",25,7,18,0,0.219]
["Carlos Corporán","Tex - C",1170,"40/170",22,6,19,0,0.235]
["Hank Conger","Hou - C",1175,"51/231",24,4,25,0,0.221]
["Ryan Hanigan","Bos - C",1188,"49/225",18,5,34,1,0.218]
["Caleb Joseph","Bal - C",1198,"51/246",22,9,28,0,0.207]
["Erik Kratz","KC - C",1213,"24/110",12,5,13,0,0.218]
["Geovany Soto","CWS - C",1229,"20/80",8,1,11,0,0.25]
["Christian Vázquez","Bos - C",1253,"42/175",15,1,20,0,0.24]
["Bryan Holaday","Det - C",1276,"36/156",14,0,15,1,0.231]
["Josh Phegley","Oak - C",1287,"8/37",4,3,7,0,0.216]
["George Kottaras","CWS - C",1292,"7/30",4,3,5,0,0.233]
["John Ryan Murphy","NYY - C",1293,"23/81",7,1,9,0,0.284]
["Chris Giménez","Tex - C,1B",1300,"28/116",13,0,11,0,0.241]
["Roberto Pérez","Cle - C",1314,"23/85",10,1,4,0,0.271]
["Eric Fryer","Min - C",1315,"16/75",11,1,5,1,0.213]
["Josh Thole","Tor - C",1326,"33/133",11,0,7,0,0.248]
["Adrián Nieto","CWS - C",1334,"25/106",8,2,7,0,0.236]
["Drew Butera","LAA - C",1337,"32/170",16,3,14,0,0.188]
["Tomás Telís","Tex - C",1342,"17/68",7,0,8,0,0.25]
["Steve Clevenger","Bal - C",1360,"20/89",8,0,8,0,0.225]
["Max Stassi","Hou - C",1371,"7/20",2,0,4,0,0.35]
["Austin Romine","NYY - C",1392,"3/13",2,0,1,0,0.231]
["Humberto Quintero","Bos - C",1403,"0/2",0,0,1,0,0]
["Jackson Williams","LAA - C",1408,"3/14",1,1,3,0,0.214]
["Yorvit Torrealba","LAA - C",1415,"-/-","-","-","-","-","-"]
["James McCann","Det - C",1419,"3/12",2,0,0,1,0.25]
["Kelly Shoppach","Cle - C",1422,"-/-","-","-","-","-","-"]
["Jesús Sucre","Sea - C",1426,"13/61",4,0,5,0,0.213]
["Rob Brantly","CWS - C",1446,"-/-","-","-","-","-","-"]
["Adam Moore","Cle - C",1449,"2/10",1,0,1,0,0.2]
["Curt Casali","TB - C",1450,"12/72",10,0,3,0,0.167]
["Johnny Monell","Bal - C",1470,"-/-","-","-","-","-","-"]
["John Hester","LAA - C",1471,"-/-","-","-","-","-","-"]
["Jorge Alfaro","Tex - C",1493,"-/-","-","-","-","-","-"]
["Francisco Peña","KC - C",1514,"0/0",0,0,0,0,"-"]
["Gary Sánchez","NYY - C",1524,"-/-","-","-","-","-","-"]
[]
["Jon Denney","Bos - C",1564,"-/-","-","-","-","-","-"]
["Bobby Wilson","TB - C",1572,"1/4",0,0,0,0,0.25]
["Bryan Anderson","Oak - C",1599,"0/1",0,0,0,0,0]
["John Baker","Sea - C",1610,"35/182",9,0,15,0,0.192]
["Brett Hayes","Cle - C",1616,"7/52",3,1,2,0,0.135]
["José Molina","TB - C",1630,"40/225",4,0,10,3,0.178]

{"sheet":"1st Base","index":4,"n_rows":61,"n_cols":9,"rows_kept":61}
["Player","Team","Rank","H/AB","R","HR","RBI","SB","Avg."]
{"$rows_empty":17}
["Adam Dunn","Oak - 1B,OF",346,"94/429",49,22,64,1,0.219]
[]
[]
["Daniel Nava","Bos - 1B,OF",457,"98/363",41,4,37,4,0.27]
["Juan Francisco","TB - 1B,3B",787,"63/287",40,16,43,0,0.22]
[]
[]
[]
[]
["Justin Smoak","Tor - 1B",1113,"50/248",28,7,30,0,0.202]
["Chris Parmelee","Bal - 1B,OF",1115,"64/250",27,7,28,0,0.256]
["Mitch Moreland","Tex - 1B",1122,"41/167",18,2,23,0,0.246]
["Danny Valencia","Tor - 1B,3B",1126,"68/264",20,4,30,1,0.258]
["J.P. Arencibia","Bal - C,1B",1137,"36/203",20,10,35,0,0.177]
["Chris Colabello","Tor - 1B,OF",1151,"47/205",17,6,39,0,0.229]
["Adam Rosales","Tex - 1B,2B,3B",1161,"43/164",20,4,19,4,0.262]
["Willie Bloomquist","Sea - 1B,2B,3B,SS",1193,"37/133",15,1,14,1,0.278]
["Kyle Blanks","Tex - 1B",1199,"17/55",10,2,7,0,0.309]
["Nate Freiman","Oak - 1B",1204,"19/87",12,5,15,0,0.218]
[]
["Marc Krauss","LAA - 1B,OF",1232,"36/186",16,6,21,0,0.194]
["Efrén Navarro","LAA - 1B,OF",1245,"39/159",17,1,14,1,0.245]
["Jesús Guzmán","Hou - 1B,OF",1277,"31/165",10,2,9,3,0.188]
["Brett Wallace","Bal - 1B,3B",1290,"-/-","-","-","-","-","-"]
["Chirs Giménez","Tex - C,1B",1300,"28/116",13,0,11,0,0.241]
["Travis Hafner","NYY - 1B",1313,"-/-","-","-","-","-","-"]
["Dan Johnson","Hou - 1B",1331,"8/38",8,1,7,0,0.211]
["Daric Barton","Tor - 1B",1353,"9/57",7,0,5,0,0.158]
["Carlos Peña","Tex - 1B",1356,"8/59",4,1,2,1,0.136]
["Brad Snyder","Tex - 1B",1404,"5/30",3,2,3,0,0.167]
["Kevin Youkilis","NYY - 1B,3B",1412,"-/-","-","-","-","-","-"]
["Chad Tracy","LAA - 1B,3B",1434,"-/-","-","-","-","-","-"]
["Ryan Lavarnway","Bal - 1B",1442,"0/10",0,0,0,0,0]
["Christian Walker","Bal - 1B",1458,"3/18",1,1,1,0,0.167]
["Greg Bird","NYY - 1B",1477,"-/-","-","-","-","-","-"]
["Max Muncy","Oak - 1B",1502,"-/-","-","-","-","-","-"]
["Matt Olson","Oak - 1B",1508,"-/-","-","-","-","-","-"]
["David Cooper","Cle - 1B",1539,"-/-","-","-","-","-","-"]
["Ji-Man Choi","Sea - 1B",1550,"-/-","-","-","-","-","-"]
["Casey Gillaspie","TB - 1B",1563,"-/-","-","-","-","-","-"]
["Matt Hague","Tor - 1B",1592,"0/2",0,0,0,0,0]
["Jesús Aguilar","Cle - 1B",1617,"4/33",2,0,3,0,0.121]
["Andy Wilkins","CWS - 1B",1624,"6/43",2,0,2,0,0.14]

{"sheet":"2nd Base","index":5,"n_rows":56,"n_cols":9,"rows_kept":56}
["Player","Team","Rank","H/AB","R","HR","RBI","SB","Avg."]
{"$rows_empty":13}
["Josh Rutledge","LAA - 2B,3B,SS",903,"83/309",44,4,33,2,0.269]
[]
[]
[]
["Marwin González","Hou - 2B,3B,SS",1087,"79/285",33,6,23,2,0.277]
["Eric Sogard","Oak - 2B,SS",1089,"65/291",38,1,22,11,0.223]
[]
["Ryan Flaherty","Bal - 2B,3B,SS",1114,"62/281",33,7,32,1,0.221]
[]
["José Ramírez","Cle - 2B,SS",1142,"62/237",27,2,17,10,0.262]
["Logan Forsythe","TB - 2B",1145,"67/301",32,6,26,2,0.223]
["Munenori Kawasaki","Tor - 2B,3B",1156,"62/240",31,0,17,1,0.258]
["Adam Rosales","Tex - 1B,2B,3B",1161,"43/164",20,4,19,4,0.262]
["Andrew Romine","Det - 2B,SS",1164,"57/251",30,2,12,12,0.227]
["Ed Lucas","Tex - 2B,SS",1190,"45/179",19,1,9,1,0.251]
["Ramón Santiago","Tor - 2B,3B,SS",1191,"44/179",20,2,17,2,0.246]
["Willie Bloomquist","Sea - 1B,2B,3B,SS",1193,"37/133",15,1,14,1,0.278]
["Steve Tolleson","Tor - 2B,3B",1194,"43/170",21,3,16,3,0.253]
["Grant Green","LAA - 2B,OF",1244,"27/99",7,1,11,1,0.273]
["Christian Colón","KC - 2B",1281,"15/45",8,0,6,2,0.333]
["Maicer Izturis","Tor - 2B",1286,"10-35",3,0,1,1,0.286]
["Leury García","CWS - 2B,3B,OF",1298,"24/145",13,1,6,11,0.166]
["Jemile Weeks","Bos - 2B",1312,"11/37",8,0,3,2,0.297]
["Josh Wilson","Det - 2B",1318,"16/67",7,0,8,1,0.239]
["Chris Getz","Tor - 2B",1319,"4/25",1,0,0,2,0.16]
["Johnny Giavotella","LAA - 2B",1328,"8/37",8,1,5,0,0.216]
["José Pirela","NYY - 2B",1345,"8/24",6,0,3,0,0.333]
["Miguel Tejada","KC - 2B,3B",1349,"-/-","-","-","-","-","-"]
["Ryan Goins","Tor - 2B,SS",1352,"34/181",14,1,15,0,0.188]
["Cole Figueroa","NYY - 2B",1366,"10/43",6,0,6,0,0.233]
["Carlos Sánchez","CWS - 2B",1367,"25/100",6,0,5,1,0.25]
["Jayson Nix","KC - 2B,3B",1389,"10/83",2,1,4,1,0.12]
["David Adams","Bal - 2B,3B",1439,"-/-","-","-","-","-","-"]
["César Izturis","Hou - 2B,SS",1463,"-/-","-","-","-","-","-"]
["Brendan Ryan","NYY - 2B,SS",1472,"19/114",5,0,8,0,0.167]
["Eddie Rosario","Min - 2B",1492,"-/-","-","-","-","-","-"]
["Delino DeShields","Tex - 2B",1515,"-/-","-","-","-","-","-"]
[]
[]
[]
["Ryan Jackson","KC - 2B,SS",1582,"-/-","-","-","-","-","-"]
["Brent Lillibridge","Tex - 2B,3B",1604,"-/-","-","-","-","-","-"]

{"sheet":"3rd Base","index":6,"n_rows":62,"n_cols":9,"rows_kept":62}
["Player","Team","Rank","H/AB","R","HR","RBI","SB","Avg."]
{"$rows_empty":10}
["David Freese","LAA - 3B",390,"120/462",53,10,55,1,0.26]
[]
[]
[]
[]
[]
["Juan Francisco","TB - 1B,3B",787,"63/287",40,16,43,0,0.22]
[]
[]
["Josh Rutledge","LAA - 2B,3B,SS",903,"83/309",44,4,33,2,0.269]
["Eduardo Núñez","Min - 3B,SS,OF",1076,"51/204",26,4,24,9,0.25]
[]
["Marwin González","Hou - 2B,3B,SS",1087,"79/285",33,6,23,2,0.277]
["Ryan Flaherty","Bal - 2B,3B,SS",1114,"62/281",33,7,32,1,0.221]
["Danny Valencia","Tor - 1B,3B",1126,"68/264",20,4,30,1,0.258]
[]
["Munenori Kawasaki","Tor - 2B,3B",1156,"62/240",31,0,17,1,0.258]
["Adam Rosales","Tex - 1B,2B,3B",1161,"43/164",20,4,19,4,0.262]
["Ramón Santiago","Tor - 2B,3B,SS",1191,"44/179",20,2,17,2,0.246]
["Willie Bloomquist","Sea - 1B,2B,3B,SS",1193,"37/133",15,1,14,1,0.278]
["Steve Tolleson","Tor - 2B,3B",1194,"43/170",21,3,16,3,0.253]
["Jimmy Paredes","Bal - 3B",1223,"18/63",12,2,8,4,0.286]
["Kevin Kouzmanoff","Tex - 3B",1241,"17/47",8,2,10,0,0.362]
["Gregorio Petit","Hou - 3B,SS",1243,"27/97",14,2,9,0,0.278]
["José Iglesias","Det - 3B,SS",1271,"-/-","-","-","-","-","-"]
["Ryan Wheeler","LAA - 3B",1288,"13/56",6,2,13,0,0.232]
["Brett Wallace","Bal - 1B,3B",1290,"-/-","-","-","-","-","-"]
["Leury García","CWS - 2B,3B,OF",1298,"24/145",13,1,6,11,0.166]
["Jeff Keppinger","CWS - 3B",1305,"-/-","-","-","-","-","-"]
["Matt Tuiasosopo","Tor - 3B,OF",1316,"-/-","-","-","-","-","-"]
["Garin Cecchini","Bos - 3B",1346,"8/31",6,1,4,0,0.258]
["Miguel Tejada","KC - 2B,3B",1349,"-/-","-","-","-","-","-"]
["Carlos Rivero","Sea - 3B",1365,"4/7",1,1,3,0,0.571]
["Jeff Bianchi","Bos - 3B,SS",1372,"12/70",4,0,6,0,0.171]
["Zelous Wheeler","NYY - 3B,OF",1374,"11/57",6,2,5,0,0.193]
["Jayson Nix","KC - 2B,3B",1389,"10/83",2,1,4,1,0.12]
["Matt Davidson","CWS - 3B",1402,"-/-","-","-","-","-","-"]
["Ryan Roberts","KC - 3B",1406,"2/19",1,0,0,0,0.105]
["Kevin Youkilis","NYY - 1B,3B",1412,"-/-","-","-","-","-","-"]
["Chad Tracy","LAA - 1B,3B",1434,"-/-","-","-","-","-","-"]
["David Adams","Bal - 2B,3B",1439,"-/-","-","-","-","-","-"]
["Kaleb Cowart","LAA - 3B",1494,"-/-","-","-","-","-","-"]
["Hunter Dozier","KC - 3B",1504,"-/-","-","-","-","-","-"]
["D.J. Peterson","Sea - 3B",1509,"-/-","-","-","-","-","-"]
["Colin Moran","Hou - 3B",1517,"-/-","-","-","-","-","-"]
["Michael Almánzar","Bal - 3B",1526,"-/-","-","-","-","-","-"]
["Miles Head","Oak - 3B",1546,"-/-","-","-","-","-","-"]
["Luis Cruz","NYY - 3B,SS",1576,"-/-","-","-","-","-","-"]
["Wilson Betemit","TB - 3B",1594,"-/-","-","-","-","-","-"]
["Brent Lillibridge","Tex - 2B,3B",1604,"-/-","-","-","-","-","-"]
["John McDonald","LAA - 3B,SS",1613,"13/76",4,0,5,1,0.171]

{"sheet":"Short Stop","index":7,"n_rows":47,"n_cols":9,"rows_kept":47}
["Player","Team","Rank","H/AB","R","HR","RBI","SB","Avg."]
{"$rows_empty":11}
["Josh Rutledge","LAA - 2B,3B,SS",903,"83/309",44,4,33,2,0.269]
[]
["Jonathan Villar","Hou - SS",1067,"55/263",31,7,27,17,0.209]
["Eduardo Núñez","Min - 3B,SS,OF",1076,"51/204",26,4,24,9,0.25]
["Marwin González","Hou - 2B,3B,SS",1087,"79/285",33,6,23,2,0.277]
["Eric Sogard","Oak - 2B,SS",1089,"65/291",38,1,22,11,0.223]
[]
["Ryan Flaherty","Bal - 2B,3B,SS",1114,"62/281",33,7,32,1,0.221]
["José Ramírez","Cle - 2B,SS",1142,"62/237",27,2,17,10,0.262]
["Andrew Romine","Det - 2B,SS",1164,"57/251",30,2,12,12,0.227]
["Ed Lucas","Tex - 2B,SS",1190,"45/179",19,1,9,1,0.251]
["Ramón Santiago","Tor - 2B,3B,SS",1191,"44/179",20,2,17,2,0.246]
["Willie Bloomquist","Sea - 1B,2B,3B,SS",1193,"37/133",15,1,14,1,0.278]
["Chris Taylor","Sea - SS",1216,"39/136",16,0,9,5,0.287]
["Gregorio Petit","Hou - 3B,SS",1243,"27/97",14,2,9,0,0.278]
["José Iglesias","Det - 3B,SS",1271,"-/-","-","-","-","-","-"]
["Ryan Goins","Tor - 2B,SS",1352,"34/181",14,1,15,0,0.188]
["Jeff Bianchi","Bos - 3B,SS",1372,"12/70",4,0,6,0,0.171]
["Jorge Polanco","Min - SS",1399,"2/6",2,0,3,0,0.333]
["Álex González","Det - SS",1424,"5/30",4,0,2,0,0.167]
["Jonathan Díaz","Tor - SS",1448,"6/38",3,0,4,1,0.158]
["Tim Beckham","TB - SS",1461,"-/-","-","-","-","-","-"]
["César Izturis","Hou - 2B,SS",1463,"-/-","-","-","-","-","-"]
["Brendan Ryan","NYY - 2B,SS",1472,"19/114",5,0,8,0,0.167]
["Tim Anderson","CWS - SS",1482,"-/-","-","-","-","-","-"]
["Willy Adames","TB - SS",1499,"-/-","-","-","-","-","-"]
["Hak-Ju Lee","TB - SS",1512,"-/-","-","-","-","-","-"]
["Hiroyuki Nakajima","Oak - SS",1520,"-/-","-","-","-","-","-"]
["Nick Gordon","Min - SS",1533,"-/-","-","-","-","-","-"]
["Daniel Robertson","TB - SS",1559,"-/-","-","-","-","-","-"]
["Raúl Mondesí","KC - SS",1566,"-/-","-","-","-","-","-"]
["Luis Cruz","NYY - 3B,SS",1576,"-/-","-","-","-","-","-"]
["Ryan Jackson","KC - 2B,SS",1582,"-/-","-","-","-","-","-"]
["Andy Parrino","Oak - SS",1593,"7/46",4,1,3,0,0.152]
["John McDonald","LAA - 3B,SS",1613,"13/76",4,0,5,1,0.171]

{"sheet":"Outfield","index":8,"n_rows":141,"n_cols":9,"rows_kept":141}
["Player","Team","Rank","H/AB","R","HR","RBI","SB","Avg."]
{"$rows_empty":21}
["Adam Dunn","Oak - 1B,OF",346,"94/429",49,22,64,1,0.219]
[]
[]
["Seth Smith","Sea - OF",398,"118/443",55,12,48,1,0.266]
[]
[]
["Matt Joyce","LAA - OF",408,"106/418",51,9,52,2,0.254]
[]
[]
["Michael Bourn","Cle - OF",437,"114/444",57,3,28,10,0.257]
[]
["Daniel Nava","Bos - 1B,OF",457,"98/363",41,4,37,4,0.27]
["David Murphy","Cle - OF",519,"109/416",40,8,58,2,0.262]
[]
["Josh Willingham","KC - OF",809,"64/297",48,14,40,2,0.215]
["Chris Young","NYY - OF",881,"72/325",40,11,38,8,0.222]
["Sam Fuld","Oak - OF",888,"84/351",40,4,36,21,0.239]
[]
["Justin Ruggiano","Sea - OF",923,"63/224",29,6,28,2,0.281]
["Alfonso Soriano","NYY - OF",930,"50/226",22,6,23,1,0.221]
["Craig Gentry","Oak - OF",941,"59/232",38,0,12,20,0.254]
["Delmon Young","Bal - OF",942,"73/242",27,7,30,2,0.302]
["Jordan Schafer","Min - OF",968,"50/210",26,1,15,30,0.238]
["Robbie Grossman","Hou - OF",996,"84/360",42,6,37,9,0.233]
[]
[]
["James Jones","Sea - OF",1053,"78/312",46,0,9,27,0.25]
[]
["Eduardo Núñez","Min - 3B,SS,OF",1076,"51/204",26,4,24,9,0.25]
["David Lough","Bal - OF",1078,"43/174",31,4,16,8,0.247]
["Nate Schierholtz","Tex - OF",1082,"69/353",32,7,37,4,0.195]
["Brandon Guyer","TB - OF",1104,"69/259",37,3,26,6,0.266]
["Ryan Ludwick","Tex - OF",1105,"87/357",28,9,45,0,0.244]
["Collin Cowgill","LAA - OF",1111,"65/260",37,5,21,4,0.25]
["Chris Parmelee","Bal - 1B,OF",1115,"64/250",27,7,28,0,0.256]
["David DeJesús","TB - OF",1121,"59/238",24,6,19,0,0.248]
["Endy Chávez","Sea - OF",1128,"64/232",22,2,23,5,0.276]
[]
["Raúl Ibañez","KC - OF",1144,"41/246",23,5,26,3,0.167]
["Alex Presley","Hou - OF",1148,"62/254",22,6,19,5,0.244]
["Chris Colabello","Tor - 1B,OF",1151,"47/205",17,6,39,0,0.229]
[]
["Ryan Raburn","Cle - OF",1159,"39/195",18,4,22,0,0.2]
["Daniel Robertson","LAA - OF",1167,"48/177",23,0,21,6,0.271]
["Jackie Bradley Jr.","Bos - OF",1171,"76/384",45,1,30,8,0.198]
["Aaron Hicks","Min - OF",1185,"40/186",22,1,18,4,0.215]
[]
["J.B. Shuck","CWS - OF",1207,"16/110",12,2,9,2,0.145]
["Michael Choice","Tex - OF",1208,"46/253",20,9,36,1,0.182]
["Moisés Sierra","KC - OF",1210,"37/161",22,2,9,3,0.23]
[]
["Zach Walters","Cle - OF",1218,"23/127",16,10,17,0,0.181]
[]
["Marc Krauss","LAA - 1B,OF",1232,"36/186",16,6,21,0,0.194]
["Chris Dickerson","Cle - OF",1235,"22/98",12,2,6,3,0.224]
["Andy Dirks","Tor - OF",1240,"-/-","-","-","-","-","-"]
["Grant Green","LAA - 2B,OF",1244,"27/99",7,1,11,1,0.273]
["Efrén Navarro","LAA - 1B,OF",1245,"39/159",17,1,14,1,0.245]
["Nolan Reimold","Bal - OF",1254,"16/69",5,3,13,1,0.232]
["Ezequiel Carrera","Tor - OF",1263,"18/69",12,0,2,7,0.261]
["Nyjer Morgan","Cle - OF",1264,"14/41",8,1,6,3,0.341]
["Jason Kubel","Min - OF",1266,"35/156",12,1,13,1,0.224]
["Jesús Guzmán","Hou - 1B,OF",1277,"31/165",10,2,9,3,0.188]
["L.J. Hoes","Hou - OF",1279,"21/122",12,3,11,0,0.172]
["Andrew Brown","Oak - OF",1282,"8/44",6,2,7,0,0.182]
["Ryan Kalish","Tor - OF",1294,"30/121",13,0,5,3,0.248]
["Leury García","CWS - 2B,3B,OF",1298,"24/145",13,1,6,11,0.166]
["Tony Campana","CWS - OF",1304,"14/75",10,0,5,4,0.187]
["Matt Tuiasosopo","Tor - 3B,OF",1316,"-/-","-","-","-","-","-"]
["Franklin Gutiérrez","Sea - OF",1317,"-/-","-","-","-","-","-"]
["Jason Bay","Sea - OF",1320,"-/-","-","-","-","-","-"]
["Stefen Romero","Sea - OF",1321,"34/177",19,3,11,0,0.192]
["Chris Herrmann","Min - OF",1332,"16/75",8,0,4,1,0.213]
["Jim Adduci","Tex - OF",1335,"17/101",13,1,8,3,0.168]
["Antoan Richardson","Tex - OF",1340,"5/16",2,0,1,5,0.313]
["Elliot Johnson","Cle - OF",1348,"2/19",1,0,0,0,0.105]
["Quintin Berry","Bos - OF",1363,"0/2",3,0,0,1,0]
["Bryce Brentz","Bos - OF",1368,"8/26",5,0,2,0,0.308]
["Tyler Holt","Cle - OF",1369,"19/71",4,0,2,2,0.268]
["Tyler Collins","Det - OF",1373,"6/24",3,1,4,0,0.25]
["Zelous Wheeler","NYY - 3B,OF",1374,"11/57",6,2,5,0,0.193]
["Trevor Crowe","Det - OF",1382,"-/-","-","-","-","-","-"]
["Shane Robinson","Min - OF",1386,"9/60",3,0,4,0,0.15]
["Xavier Nady","Sea - OF",1387,"5/37",4,3,4,0,0.135]
["Caleb Gindl","Tor - OF",1390,"3/19",0,0,0,0,0.158]
["Alfredo Marte","LAA - OF",1397,"18/106",8,2,9,1,0.17]
["Shawn O'Malley","Sea - OF",1401,"3/16",3,0,1,2,0.188]
["Steven Moyà","Det - OF",1418,"3/8",2,0,0,0,0.375]
["Carlos Peguero","Tex - OF",1429,"2/9",1,0,1,0,0.222]
["Engel Beltre","CWS - OF",1435,"-/-","-","-","-","-","-"]
["Dewayne Wise","CWS - OF",1438,"-/-","-","-","-","-","-"]
["Jason Bartlett","Min - OF",1443,"0/3",3,0,0,0,0]
["Francisco Peguero","Bal - OF",1444,"-/-","-","-","-","-","-"]
["Henry Urrutia","Bal - OF",1447,"-/-","-","-","-","-","-"]
["Roger Kieschnick","LAA - OF",1454,"8/41",2,1,2,0,0.195]
["Reymond Fuentes","KC - OF",1459,"-/-","-","-","-","-","-"]
["Corey Brown","TB - OF",1462,"0/1",0,0,0,0,0]
["Michael Taylor","CWS - OF",1474,"7/28",3,0,0,0,0.25]
["Nick Williams","Tex - OF",1476,"-/-","-","-","-","-","-"]
["Bradley Zimmer","Cle - OF",1478,"-/-","-","-","-","-","-"]
["Tyler Austin","NYY - OF",1495,"-/-","-","-","-","-","-"]
["Jorge Bonifacio","KC - OF",1496,"-/-","-","-","-","-","-"]
["Aaron Judge","NYY - OF",1507,"-/-","-","-","-","-","-"]
["Gareth Morgan","Sea - OF",1510,"-/-","-","-","-","-","-"]
["Xavier Avery","Sea - OF",1518,"-/-","-","-","-","-","-"]
["Manuel Margot","Bos - OF",1523,"-/-","-","-","-","-","-"]
["Mason Williams","NYY - OF",1530,"-/-","-","-","-","-","-"]
["Mikie Mahtook","TB - OF",1535,"-/-","-","-","-","-","-"]
["Clint Frazier","Cle - OF",1544,"-/-","-","-","-","-","-"]
["Bubba Starling","KC - OF",1547,"-/-","-","-","-","-","-"]
["Derek Hill","Det - OF",1555,"-/-","-","-","-","-","-"]
["Alex Jackson","Sea - OF",1556,"-/-","-","-","-","-","-"]
["Lane Adams","KC - OF",1573,"0/3",1,0,0,0,0]
["Jason Pridie","Oak - OF",1581,"0/4",1,0,0,0,0]
["Alex Hassan","Bal - OF",1585,"1/8",1,0,0,0,0.125]
["Joey Butler","TB - OF",1590,"0/5",0,0,0,0,0]
["Nick Buss","Oak - OF",1600,"-/-","-","-","-","-","-"]
["Brad Glenn","Tor - OF",1623,"1/15",0,0,0,0,0.067]
["Domingo Santana","Hou - OF",1628,"0/17",1,0,0,0,0]

{"sheet":"DH","index":9,"n_rows":1,"n_cols":9,"rows_kept":1}
["Player","Team","Rank","H/AB","R","HR","RBI","SB","Avg."]

{"sheet":"Pitchers","index":10,"n_rows":130,"n_cols":9,"rows_kept":130}
["Player","Team","Rank","IP","W","S","K","ERA","WHIP"]
{"$rows_empty":16}
["Cory Rasmus","LAA - SP,RP",371,56,3,0,57,2.57,1.05]
[]
[]
["Tim Stauffer","Min - SP,RP",400,64.1,6,0,67,3.5,1.4]
["Kris Medlen","KC - SP",411,"-","-","-","-","-","-"]
["Luke Hochevar","KC - SP,RP",414,"-","-","-","-","-","-"]
[]
[]
[]
["Gavin Floyd","Cle - SP",464,54.1,2,0,45,2.65,1.25]
["Lisalverto Bonilla","Tex - SP",472,20.2,3,0,17,3.05,1.21]
[]
[]
[]
[]
[]
[]
["Ross Ohlendorf","Tex - SP,RP",540,"-","-","-","-","-","-"]
[]
["Tyler Skaggs","LAA - SP",555,113,5,0,86,4.3,1.21]
[]
[]
[]
["Dustin McGowan","Tor - SP,RP",600,82,5,1,61,4.17,1.38]
["Enny Romero","TB - SP",615,"-","-","-","-","-","-"]
[]
["J.R. Graham","Min - SP",644,"-","-","-","-","-","-"]
["Alex White","Hou - SP",646,"-","-","-","-","-","-"]
["Eddie Gamboa","Bal - SP",649,"-","-","-","-","-","-"]
["Kohl Stewart","Min - SP",650,"-","-","-","-","-","-"]
["Sean Manaea","KC - SP",651,"-","-","-","-","-","-"]
["Mike Montgomery","TB - SP",657,"-","-","-","-","-","-"]
["Miguel Almonte","KC - SP",660,"-","-","-","-","-","-"]
["Hunter Harvey","Bal - SP",662,"-","-","-","-","-","-"]
["John Lamb","KC - SP",664,"-","-","-","-","-","-"]
[]
["Luke Jackson","Tex - SP",668,"-","-","-","-","-","-"]
["Sean Newcomb","LAA - SP",670,"-","-","-","-","-","-"]
["Taylor Guerrieri","TB - SP",673,"-","-","-","-","-","-"]
["Suk-min Yoon","Bal - SP",675,"-","-","-","-","-","-"]
["Casey Crosby","Det - SP",677,"-","-","-","-","-","-"]
[]
[]
["Lance McCullers","Hou - SP",684,"-","-","-","-","-","-"]
["Oliver Drake","Bal - SP",689,"-","-","-","-","-","-"]
["Johan Santana","Bal - SP",695,"-","-","-","-","-"]
["Arnold León","Oak - SP",696,"-","-","-","-","-","-"]
["Kyle Zimmer","KC - SP",699,"-","-","-","-","-","-"]
["Jeff Hoffman","Tor - SP",704,"-","-","-","-","-","-"]
["Eduardo Rodríguez","Bos - SP",707,"-","-","-","-","-","-"]
["Josh Tomlin","Cle - SP,RP",737,104,6,0,94,4.76,1.29]
["César Ramos","LAA - SP,RP",741,82.2,2,0,66,3.7,1.35]
["Nick Tropeano","LAA - SP",757,21.2,1,0,13,4.57,1.29]
["Kyle Lobstein","Det - SP",771,39.1,1,0,27,4.35,1.25]
["Steve Johnson","Bal - SP",774,"-","-","-","-","-","-"]
["Drew VerHagen","Det - SP",776,5,0,0,4,5.4,1.6]
["Anthony Ranaudo","Tex - SP",813,39.1,4,0,15,4.81,1.4]
["Tommy Milone","Min - SP",824,118,6,0,75,4.19,1.4]
["Wade LeBlanc","LAA - SP,RP",827,29.2,1,0,21,3.94,1.15]
["Burch Smith","TB - SP,RP",828,"-","-","-","-","-","-"]
["Ramón Ortiz","Tor - SP,RP",830,"-","-","-","-","-","-"]
["Ryan Dempster","Bos - SP",831,"-","-","-","-","-","-"]
["Shaun Marcum","Cle - SP,RP",844,"-","-","-","-","-","-"]
["Phil Irwin","Tex - SP",855,4,0,0,2,6.75,2]
["Jeremy Bonderman","Det - SP",858,"-","-","-","-","-","-"]
["Tommy Hanson","Tex - SP",866,"-","-","-","-","-","-"]
["Chris Bassitt","Oak - SP",872,29.2,1,0,21,3.94,1.58]
["Rudy Owens","Oak - SP",893,5.2,0,0,1,7.94,1.94]
["Randy Wolf","LAA - SP",902,25.2,1,1,19,5.26,1.52]
[]
[]
["Kris Johnson","Min - SP",951,13.1,0,0,12,4.73,1.95]
["Yohan Pino","KC - SP",955,60.1,2,0,50,5.07,1.33]
["Matt Harrison","Tex - SP",957,17.1,1,0,10,4.15,1.85]
[]
["Scott Baker","NYY - SP,RP",967,80.2,3,0,55,5.47,1.19]
[]
[]
["Chris Capuano","NYY - SP,RP",987,97.1,3,0,84,4.35,1.39]
["Brett Oberholtzer","Hou - SP",992,143.2,5,0,94,4.39,1.38]
["Ubaldo Jiménez","Bal - SP",994,125.1,6,0,116,4.81,1.52]
["Scott Diamond","Min - SP",1002,"-","-","-","-","-","-"]
["Tanner Scheppers","Tex - SP",1012,23,0,0,17,9,1.78]
["Erik Johnson","CWS - SP",1018,23.2,1,0,18,6.46,1.77]
["Samuel Deduno","Hou - SP,RP",1024,100.2,2,0,83,4.47,1.42]
["Zach McAllister","Cle - SP,RP",1028,86,4,0,74,5.23,1.44]
["Anthony Swarzak","Cle - SP,RP",1038,86,3,0,47,4.6,1.49]
[]
["Liam Hendriks","Tor - SP",1042,32.2,1,0,23,5.23,1.38]
["Logan Darnell","Min - SP",1046,24,0,0,22,7.13,1.63]
["Brad Penny","CWS - SP",1048,26,2,0,13,6.58,1.81]
["Joe Blanton","LAA - SP",1051,"-","-","-","-","-","-"]
["Chase Whitley","NYY - SP,RP",1057,75.2,4,0,60,5.23,1.48]
["Dan Straily","Hou - SP,RP",1068,52,1,0,47,6.75,1.48]
["Brad Mills","Oak - SP",1081,20.2,1,0,19,9.15,1.94]
["Nick Tepesch","Tex - SP",1083,126,5,0,56,4.36,1.37]
["Brandon Workman","Bos - SP",1091,87,1,0,70,5.17,1.43]
["Miles Mikolas","Tex - SP",1095,57.1,2,0,38,6.44,1.43]
["Bruce Chen","KC - SP,RP",1110,48.1,2,0,36,7.45,1.76]
[]
["Erasmo Ramírez","Sea - SP",1123,75.1,1,0,60,5.26,1.54]
["Nick Martínez","Tex - SP,RP",1125,140.1,5,0,77,4.55,1.46]
["Trevor May","Min - SP",1127,45.2,3,0,44,7.88,1.77]
["Felipe Paulino","Bos - SP",1136,18.1,0,0,14,11.29,2.56]
["Brad Peacock","Hou - SP",1138,131.2,4,0,119,4.72,1.56]
["John Danks","CWS - SP",1139,193.2,11,0,129,4.74,1.44]
[]
["Scott Carroll","CWS - SP,RP",1143,129.1,5,0,64,4.8,1.48]
["Mike Pelfrey","Min - SP",1162,23.2,0,0,10,7.99,1.99]
["Robbie Ross Jr.","Bos - SP,RP",1163,78.1,3,0,51,6.2,1.7]
["Colby Lewis","Tex - SP",1166,170.1,10,0,133,5.18,1.52]
["Ricky Nolasco","Min - SP",1169,159,6,0,115,5.38,1.52]
["Joe Saunders","Bal - SP,RP",1267,43,0,0,23,6.7,2.07]

{"sheet":"Relief Pitchers","index":11,"n_rows":255,"n_cols":9,"rows_kept":255}
["Player","Team","Rank","IP","W","S","K","ERA","WHIP"]
{"$rows_empty":11}
["Fernando Abad","Oak - RP",310,57.1,2,0,51,1.57,0.85]
["Scott Atchison","Cle - RP",320,72,6,2,49,2.75,1.03]
[]
[]
[]
[]
["Tony Sipp","Hou - RP",332,50.2,4,4,63,3.38,0.89]
[]
[]
[]
[]
[]
["Anthony Varvaro","Bos - RP",357,54.2,3,0,50,2.63,1.08]
["Yoervis Medina","Sea - RP",363,57,5,0,60,2.68,1.33]
["Al Alburquerque","Det - RP",364,57.1,3,1,63,2.51,1.17]
[]
[]
["Brad Brach","Bal - RP",367,62.1,7,0,54,3.18,1.17]
["Cory Rasmus","LAA - SP,RP",371,56,3,0,57,2.57,1.05]
["Fernando Salas","LAA - RP",373,58.2,5,0,61,3.38,1.09]
[]
["Shawn Tolleson","Tex - RP",377,71.2,3,0,69,2.76,1.17]
["Casey Fien","Min - RP",380,63.1,5,1,51,3.98,1.17]
["Kyle Crockett","Cle - RP",381,30,4,0,28,1.8,1.13]
["Ryan Cook","Oak - RP",383,50,1,1,50,3.42,1.08]
["Mike Morin","LAA - RP",388,59,4,0,54,2.9,1.19]
[]
[]
["Tim Stauffer","Min - SP,RP",400,64.1,6,0,67,3.5,1.4]
["Joe Beimel","Sea - RP",407,45,3,0,25,2.2,1.18]
["Luke Hochevar","KC - SP,RP",414,"-","-","-","-","-","-"]
["Jake Petricka","CWS - RP",418,73,1,14,55,2.96,1.37]
["Eric O'Flaherty","Oak - RP",422,20,1,1,15,2.25,0.95]
["Josh Fields","Hou - RP",426,54.2,4,4,70,4.45,1.23]
["Justin Wilson","NYY - RP",430,60,3,0,61,4.2,1.32]
["Charlie Furbush","Sea - RP",432,42.1,1,1,51,3.61,1.16]
["Alex Wilson","Det - RP",445,28.1,1,0,19,1.91,0.88]
["Tommy Layne","Bos - RP",448,19,2,0,14,0.95,1.16]
[]
["Dana Eveland","Bos - RP",460,27.1,1,1,27,2.63,1.1]
["Carson Smith","Sea - RP",461,8.1,1,0,10,0,0.6]
["Caleb Thielbar","Min - RP",473,47.2,2,0,35,3.4,1.41]
["Brian Matusz","Bal - RP",474,51.2,2,0,53,3.48,1.32]
["Ryan Webb","Bal - RP",477,49.1,3,0,37,3.83,1.26]
["Tom Gorzelanny","Det - RP",479,21,0,0,23,0.86,1.43]
["Jeff Beliveau","TB - RP",480,24,0,1,28,2.63,1.08]
["Román Méndez","Tex - RP",482,33,0,0,22,2.18,1.12]
["Fernando Rodríguez","Oak - RP",483,9,1,0,4,1,0.67]
["Spencer Patton","Tex - RP",484,9.1,1,0,8,0.96,0.86]
["Nick Hagadone","Cle - RP",488,23.1,1,0,27,2.7,1.03]
["Phil Klein","Tex - RP",491,19,1,0,23,2.84,1.11]
["Chasen Shreve","NYY - RP",495,12.1,0,0,15,0.73,1.05]
["Chad Jenkins","Tor - RP",497,31.2,1,0,18,2.56,1.26]
["Blaine Hardy","Det - RP",500,39,2,0,31,2.54,1.38]
["Marc Rzepczynski","Cle - RP",501,46,0,1,46,2.74,1.33]
["Dan Jennings","CWS - RP",505,40.1,0,0,38,1.34,1.54]
["Brandon Gómes","TB - RP",508,34,2,0,24,3.71,1.15]
["Jesse Crain","CWS - RP",510,"-","-","-","-","-","-"]
["Brian Duensing","Min - RP",514,54.1,3,0,33,3.31,1.33]
["Todd Redmond","Tor - RP",516,75,1,1,60,3.24,1.33]
["Javy Guerra","CWS - RP",517,46.1,2,1,38,2.91,1.32]
["Joe Thatcher","LAA - RP",520,30.1,2,0,27,3.86,1.32]
[]
["T.J. McFarland","Bal - RP",522,58.2,4,0,34,2.76,1.41]
["Kyle Ryan","Det - RP",523,10.1,2,0,4,2.61,1.16]
["Juan Carlos Oviedo","Tex - RP",524,31.2,3,1,26,3.69,1.36]
["Matt Albers","Hou - RP",526,10,0,0,8,0.9,1.3]
["Blaine Boyer","Min - RP",527,40.1,0,0,29,3.57,1.04]
["Will Harris","Hou - RP",530,29,0,0,35,4.34,1.24]
["Ryan Pressly","Min - RP",531,28.1,2,0,14,2.86,1.34]
["Steven Wright","Bos - RP",534,21,0,0,22,2.57,1.19]
["Andrew Bailey","NYY - RP",535,"-","-","-","-","-","-"]
["R.J. Álvarez","Oak - RP",536,8,0,0,9,1.13,1]
["Steve Delabar","Tor - RP",538,25.2,3,0,21,4.91,1.48]
["Ross Ohlendorf","Tex - SP,RP",540,"-","-","-","-","-","-"]
["Brandon Finnegan","KC - RP",542,7,0,0,10,1.29,1]
["Vinnie Pestano","LAA - RP",545,18.2,0,0,26,2.89,1.23]
["Joba Chamberlain","Det - RP",549,63,2,2,59,3.57,1.29]
["Eury De La Rosa","Oak - RP",550,36.2,2,0,32,2.95,1.39]
["Nate Jones","CWS - RP",559,0,0,0,0,"-","-"]
["Joe Savery","CWS - RP",562,4,0,0,0,0,1]
["Dane De La Rosa","Bal - RP",564,2.1,0,0,0,11.57,2.57]
["Evan Scribner","Oak - RP",567,11.2,1,0,11,4.63,0.94]
["Jared Burton","Min - RP",574,64,3,3,46,4.36,1.3]
["Melvin Mercedes","Det - RP",576,2,0,0,2,0,0]
["Daniel Webb","CWS - RP",582,67.2,6,0,58,3.99,1.49]
["Stephen Pryor","Min - RP",583,1.2,0,0,1,0,1.8]
["Robert Coello","NYY - RP",586,"-","-","-","-","-","-"]
["Steve Geltz","TB - RP",590,8.1,0,0,14,3.24,1.32]
["Kirby Yates","TB - RP",593,36,0,1,42,3.75,1.33]
["Wilking Rodríguez","NYY - RP",595,2,0,0,1,0,1]
[]
["Dustin McGowan","Tor - SP,RP",600,82,5,1,61,4.17,1.38]
["Rob Rasmussen","Tor - RP",601,11.1,0,0,13,3.18,1.32]
["Kyle Drabek","Tor - RP",602,3,0,0,5,0,1.33]
["Edwin Escobar","Bos - RP",608,2,0,0,2,4.5,0.5]
["Aaron Thompson","Min - RP",611,7.1,0,0,6,2.45,1.36]
["Ernesto Frieri","TB - RP",612,41.2,1,11,48,7.34,1.46]
["Pedro Figueroa","Tex - RP",613,9,2,0,3,4,1.44]
["Ryan Brasier","LAA - RP",614,"-","-","-","-","-","-"]
["Chris Dwyer","KC - RP",616,"-","-","-","-","-","-"]
["Álex Cláudio","Tex - RP",621,12.1,0,0,14,2.92,1.46]
["Andrew Albers","Min - RP",622,"-","-","-","-","-","-"]
["Kevin Chapman","Hou - RP",623,21.1,2,0,19,4.64,1.55]
["Everett Teaford","KC - RP",631,"-","-","-","-","-","-"]
["Randy Messenger","Sea - RP",640,"-","-","-","-","-","-"]
["Nick Burdi","Min - RP",641,"-","-","-","-","-","-"]
["Julio DePaula","Bal - RP",642,"-","-","-","-","-","-"]
["Ryan Madson","LAA - RP",648,"-","-","-","-","-","-"]
["Asher Wojciechowski","Hou - RP",653,"-","-","-","-","-","-"]
["Luis Severino","NYY - RP",658,"-","-","-","-","-","-"]
["Tim Berry","Bal - RP",665,"-","-","-","-","-","-"]
["Angel Nesbitt","Det - RP",686,"-","-","-","-","-","-"]
[]
["Frank Herrmann","Cle - RP",706,"-","-","-","-","-","-"]
["Jacob Lindgren","NYY - RP",708,"-","-","-","-","-","-"]
[]
["A.J. Achter","Min - RP",715,11,1,0,5,3.27,1.55]
["Luis Ayala","Bal - RP",717,"-","-","-","-","-","-"]
["Luis Pérez","Tor - RP",718,"-","-","-","-","-","-"]
["Wilmer Font","Tex - RP",719,"-","-","-","-","-","-"]
["Cory Burns","Tor - RP",721,"-","-","-","-","-","-"]
["Charles Brewer","Cle - RP",724,"-","-","-","-","-","-"]
["Chia-Jen Lo","Hou - RP",725,"-","-","-","-","-","-"]
["Sean Burnett","LAA - RP",726,0.2,0,0,0,13.5,1.5]
["Matt Daley","NYY - RP",727,14.1,0,0,10,5.02,1.26]
["Mickey Storey","Tor - RP",730,"-","-","-","-","-","-"]
["David Aardsma","Cle - RP",732,"-","-","-","-","-","-"]
["Scott Barnes","Tor - RP",733,"-","-","-","-","-","-"]
["Buddy Boshers","LAA - RP",735,"-","-","-","-","-","-"]
["Brooks Raley","LAA - RP",736,"-","-","-","-","-","-"]
["Josh Tomlin","Cle - SP,RP",737,104,6,0,94,4.76,1.29]
["Mike Belfiore","Det - RP",740,"-","-","-","-","-","-"]
["César Ramos","LAA - SP,RP",741,82.2,2,0,66,3.7,1.35]
["Onelki García","CWS - RP",743,"-","-","-","-","-","-"]
["Jarrett Grube","LAA - RP",744,0.2,0,0,0,13.5,1.5]
["Matt Barnes","Bos - RP",750,9,0,0,8,4,1.44]
["Édgar Olmos","Sea - RP",751,"-","-","-","-","-","-"]
["Preston Guilmet","Tor - RP",755,10.1,0,0,12,5.23,0.97]
["Tim Collins","KC - RP",756,21,0,0,15,3.86,1.38]
["Wesley Wright","Bal - RP",759,48.1,0,0,37,3.17,1.39]
["David Martínez","Tex - RP",761,7,0,0,6,5.14,1]
["Heath Hembree","Bos - RP",763,10,0,0,6,4.5,1.6]
["Joel Hanrahan","Det - RP",764,"-","-","-","-","-","-"]
["Drew Rucinski","LAA - RP",765,7.1,0,0,8,4.91,1.5]
["Ramón Ramírez","Bal - RP",767,1,0,0,2,0,1]
["Zeke Spruill","Bos - RP",769,22.2,1,0,14,3.57,1.37]
["Yoslan Herrera","LAA - RP",775,16.2,1,0,13,2.7,1.86]
["Bobby Korecky","Tor - RP",784,3.1,0,0,2,8.1,1.5]
["Brandon Lyon","LAA - RP",785,"-","-","-","-","-","-"]
["Chaz Roe","Bal - RP",796,2,0,0,4,9,3]
["Matt West","Tor - RP",797,4,0,0,3,6.75,1.75]
["Peter Moylan","Hou - RP",798,"-","-","-","-","-","-"]
["José Álvarez","LAA - RP",803,0.2,0,0,1,0,1.5]
["Alfredo Figaro","Tex - RP",806,8.2,0,0,8,7.27,1.38]
["Sean Nolin","Oak - RP",807,1,0,0,0,9,1]
["Lester Oliveros","Min - RP",808,6.1,0,0,5,7.11,1.42]
["Edgmer Escalona","NYY - RP",816,"-","-","-","-","-","-"]
["Kevin Whelan","Oak - RP",818,1.1,0,0,1,13.5,3.75]
["Robert Carson","LAA - RP",819,"-","-","-","-","-","-"]
["Deunte Heath","CWS - RP",821,"-","-","-","-","-","-"]
["Wade LeBlanc","LAA - SP,RP",827,29.2,1,0,21,3.94,1.15]
["Burch Smith","TB - SP,RP",828,"-","-","-","-","-","-"]
["Ramón Ortiz","Tor - SP,RP",830,"-","-","-","-","-","-"]
["Lucas Luetge","Sea - RP",832,9,0,0,7,5,1.22]
["Michael Tonkin","Min - RP",833,19,0,0,16,4.74,1.53]
["Brayan Villarreal","Bos - RP",835,"-","-","-","-","-","-"]
["José Mijares","Bos - RP",837,"-","-","-","-","-","-"]
["Kyuji Fujikawa","Tex - RP",840,13,0,0,17,4.85,1.85]
["Eric Surkamp","CWS - RP",842,24.1,2,0,20,4.81,1.44]
["Shaun Marcum","Cle - SP,RP",844,"-","-","-","-","-","-"]
["CC Lee","Cle - RP",845,28,1,0,26,4.5,1.5]
["Michael Kirkman","Tex - RP",847,5.2,0,0,3,1.59,1.06]
["Chad Smith","Det - RP",849,11.2,0,0,9,5.4,1.54]
["Ryan Mattheus","LAA - RP",853,8.2,0,0,4,1.04,1.27]
["Brad Lincoln","Tor - RP",854,2.1,0,0,2,11.57,2.14]
["Jon Edwards","Tex - RP",856,8.1,0,0,9,4.32,2.16]
["Colt Hynes","Tor - RP",861,"-","-","-","-","-","-"]
["Matt Guerrier","Min - RP",863,28,0,0,12,3.86,1.43]
["C.J. Riefenhauser","TB - RP",864,5.1,0,0,2,8.44,1.69]
["Phil Coke","Det - RP",865,58,5,1,41,3.88,1.53]
["José Ramírez","NYY - RP",867,10,0,0,10,5.4,1.8]
["César Cabral","Bal - RP",869,1,0,0,2,27,6]
["Casey Coleman","KC - RP",873,12,1,0,5,5.25,1.83]
["Ryan Feierabend","Tex - RP",880,7.1,0,0,4,6.14,1.91]
["Austin Adams","Cle - RP",886,7,0,0,4,9,1.43]
["Frank Francisco","CWS - RP",889,3.2,0,0,5,12.27,2.73]
["Mitchell Boggs","CWS - RP",890,"-","-","-","-","-","-"]
["Darin Downs","Hou - RP",905,34.2,2,0,27,5.45,1.36]
["Bo Schultz","Tor - RP",909,8,0,0,5,7.88,1.75]
["Aaron Poreda","Tex - RP",911,21.1,2,0,21,5.91,1.73]
["José Domínguez","TB - RP",912,6.1,0,0,8,11.37,1.58]
["Joe Paterson","KC - RP",914,1.1,0,0,0,33.75,3.75]
["Rich Hill","NYY - RP",918,5.1,0,0,9,3.38,2.44]
["Louis Coleman","KC - RP",919,34,1,1,24,5.56,1.68]
["Mark Lowe","Sea - RP",922,7,0,0,6,3.86,2.29]
["Neil Wagner","TB - RP",924,10,0,0,6,8.1,1.6]
["Jeff Francis","Tor - RP",927,20,1,1,15,5.85,1.05]
["Kyle Farnsworth","Hou - RP",932,28.2,0,3,18,4.4,1.64]
["Matt Lindstrom","CWS - RP",934,34,2,6,18,5.03,1.74]
["Alexi Ogando","Bos - RP",943,25,2,1,22,6.84,1.92]
["Taylor Thompson","Oak - RP",944,5.1,0,0,4,10.13,2.44]
["Alfredo Aceves","NYY - RP",945,19.1,1,0,16,6.52,1.4]
["Scott Snodgress","LAA - RP",954,2.1,0,0,1,15.43,4.71]
[]
["Jake Buchanan","Hou - RP",961,35.1,1,0,20,4.58,1.5]
["Scott Downs","Cle - RP",962,38,0,1,25,4.97,1.47]
["Raúl Valdes","Tor - RP",963,3.2,0,1,4,12.27,2.18]
["Bryan Price","Cle - RP",965,2.2,0,0,1,20.25,3.38]
["Justin Germano","Sea - RP",966,5.1,0,0,3,11.81,2.06]
["Scott Baker","NYY - SP,RP",967,80.2,3,0,55,5.47,1.19]
["Ronald Belisario","TB - RP",969,66.1,4,8,47,5.56,1.45]
["Maikel Cleto","CWS - RP",970,29.1,0,0,32,4.6,1.6]
["Luke Putkonen","Det - RP",973,2.2,0,0,1,27,3]
["Chris Martín","NYY - RP",978,15.2,0,0,14,6.89,1.66]
["Evan Reed","Det - RP",980,32.1,0,0,26,4.18,1.58]
["Jim Miller","NYY - RP",982,2.2,0,0,2,20.25,3.38]
["Patrick McCoy","Bal - RP",984,14,0,0,11,3.86,2.43]
["Chris Capuano","NYY - SP,RP",987,97.1,3,0,84,4.35,1.39]
["Josh Lueke","TB - RP",991,30.1,1,0,19,5.64,1.42]
["Ian Krol","Det - RP",1007,32.2,0,1,28,4.96,1.68]
["Cam Bedrosian","LAA - RP",1015,19.1,0,0,20,6.52,1.81]
["Michael Mariot","KC - RP",1023,25,1,0,21,6.48,1.72]
["Samuel Deduno","Hou - SP,RP",1024,100.2,2,0,83,4.47,1.42]
["Zach McAllister","Cle - SP,RP",1028,86,4,0,74,5.23,1.44]
["Wilton López","Tor - RP",1031,6.1,0,0,4,11.37,2.84]
["Michael Roth","Cle - RP",1034,12.1,1,0,9,8.76,2.03]
["Anthony Swarzak","Cle - SP,RP",1038,86,3,0,47,4.6,1.49]
["Nick Maronde","Cle - RP",1040,6.1,0,0,7,12.79,3]
["Josh Zeid","Det - RP",1047,20.2,0,0,18,6.97,1.79]
["Anthony Bass","Tex - RP",1056,27,1,2,7,6.33,1.44]
["Chase Whitley","NYY - SP,RP",1057,75.2,4,0,60,5.23,1.48]
["Esmil Rogers","NYY - RP",1060,45.2,2,0,44,5.72,1.47]
["Mike Kickham","Sea - RP",1061,2,0,0,1,22.5,4.5]
["Jeff Manship","Cle - RP",1062,23,1,0,16,6.65,1.65]
["Dan Straily","Hou - SP,RP",1068,52,1,0,47,6.75,1.48]
["Craig Breslow","Bos - RP",1102,54.1,2,1,37,5.96,1.86]
["Bruce Chen","KC - SP,RP",1110,48.1,2,0,36,7.45,1.76]
[]
["Nick Martínez","Tex - SP,RP",1125,140.1,5,0,77,4.55,1.46]
["Scott Carroll","CWS - SP,RP",1143,129.1,5,0,64,4.8,1.48]
["Robbie Ross Jr.","Bos - SP,RP",1163,78.1,3,0,51,6.2,1.7]
["Joe Saunders","Bal - SP,RP",1267,43,0,0,23,6.7,2.07]

{"sheet":"Data","index":12,"n_rows":50,"n_cols":11,"rows_kept":50}
["Owners","Position"]
["Lightning (Mike Goodman)","Catcher"]
["Evolution (Bruce)","1st Base"]
["The Soylent Knights (Colin)","2nd Base"]
["Woap (Mike)","3rd Base"]
["The Dominant Brand (Brandon)","Short Stop"]
["Guzzlers (Rhonda)","Outfield #1"]
["The Macon Whoopees (Rob)","Outfield #2"]
["Booya's (Cathy)","Outfield #3"]
["Freebirds (Todd)","DH"]
["Numbats (Tom)","Starting Pitcher #1"]
["TheDunnShow (Dave)","Starting Pitcher #2"]
[null,"Starting Pitcher #3"]
[null,"Starting Pitcher #4"]
[null,"Starting Pitcher #5"]
[null,"Relief Pitcher #1"]
[null,"Relief Pitcher #2"]
[null,"Relief Pitcher #3"]
[null,"Relief Pitcher #4"]
[null,"Reserve Roster #1"]
[null,"Reserve Roster #2"]
[null,"Reserve Roster #3"]
[null,"Reserve Roster #4"]
[null,"Reserve Roster #5"]
[null,"Reserve Roster #6"]
[null,"Reserve Roster #7"]
[]
["Make sure every year to select all the players for each position and recreate the bookmark name (delete name first, then recreate name) to ensure all players get listed.",null,"catchers","first","second","third","ss","outfield","dh","pitchers","relief"]
["Ensure that all players are listed when clicking on the button."]
[]
[null,"Change Draft Order Yearly"]
[]
["TheDunnShow (Dave)",1]
["The Dominant Brand (Brandon)",2]
["Freebirds (Todd)",3]
["Guzzlers (Rhonda)",4]
["Evolution (Bruce)",5]
["The Macon Whoopees (Rob)",6]
["The Soylent Knights (Colin)",7]
["Booya's (Cathy)",8]
["Woap (Mike)",9]
["Lightning (Mike Goodman)",10]
["Numbats (Tom)",11]
[]
[]
[]
["Formulas to Retreive Name and Position"]
["=RIGHT(A1,LEN(A1)+ 5-FIND(\"-\",A1))","Position"]
["=LEFT(A1,FIND(\"-\",A1) -5)","Name"]
["=Trim(cell)","Trim the positions for extra space"]

{"sheet":"Sheet1","index":13,"n_rows":0,"n_cols":0,"rows_kept":0}